You are viewing a plain text version of this content. The canonical link for it is here.
Posted to builds@cassandra.apache.org by Apache Jenkins Server <je...@builds.apache.org> on 2023/12/01 19:48:50 UTC
Build complete: Cassandra-4.1 #454 [FAILURE] 350e968565cb75d41cee63b4e3794e391b38bfce
-------------------------------------------------------------------------------
Build Cassandra-4.1 #454 Still Failing
URL: https://ci-cassandra.apache.org/job/Cassandra-4.1/454/
-------------------------------------------------------------------------------
Changes:
No changes
-------------------------------------------------------------------------------
Failed Tests:
9 tests failed.
FAILED: dtest-offheap.materialized_views_test.TestMaterializedViews.test_no_base_column_in_view_pk_complex_timestamp_with_flush
FAILED: dtest-offheap.bootstrap_test.TestBootstrap.test_shutdown_wiped_node_cannot_join
FAILED: dtest.bootstrap_test.TestBootstrap.test_shutdown_wiped_node_cannot_join
FAILED: dtest.bootstrap_test.TestBootstrap.test_killed_wiped_node_cannot_join
FAILED: dtest.cqlsh_tests.test_cqlsh_copy.TestCqlshCopy.test_bulk_round_trip_with_timeouts
FAILED: dtest.materialized_views_test.TestMaterializedViews.test_drop_with_stopped_build
FAILED: org.apache.cassandra.distributed.test.NetstatsBootstrapWithEntireSSTablesCompressionStreamingTest.testWithStreamingEntireSSTablesWithoutCompression
FAILED: org.apache.cassandra.net.ConnectionTest.testMessageDeliveryOnReconnect
FAILED: dtest-upgrade.upgrade_tests.bootstrap_upgrade_test.TestBootstrapUpgrade.test_simultaneous_bootstrap
-------------------------------------------------------------------------------
For complete test report and logs see https://nightlies.apache.org/cassandra/Cassandra-4.1/454/