You are viewing a plain text version of this content. The canonical link for it is here.
Posted to builds@cassandra.apache.org by Apache Jenkins Server <je...@builds.apache.org> on 2021/01/21 16:38:34 UTC
Build complete: Cassandra-trunk #244 [UNSTABLE]
5e8f7f591dfec5a61d8eb2e9e977ec29f3a2bbe4
-------------------------------------------------------------------------------
Build Cassandra-trunk #244 Still Unstable
URL: https://ci-cassandra.apache.org/job/Cassandra-trunk/244/
-------------------------------------------------------------------------------
Changes:
No changes
-------------------------------------------------------------------------------
Failed Tests:
4 tests failed.
FAILED: org.apache.cassandra.concurrent.LongSharedExecutorPoolTest.testPromptnessOfExecution
FAILED: org.apache.cassandra.utils.LongBTreeTest.testBuildNewTree
FAILED: org.apache.cassandra.index.sasi.SASIIndexTest.testMultiExpressionQueriesWhereRowSplitBetweenSSTables-cdc
FAILED: org.apache.cassandra.net.ProxyHandlerConnectionsTest.testExpireSomeFromBatch
-------------------------------------------------------------------------------