You are viewing a plain text version of this content. The canonical link for it is here.
Posted to dev@oozie.apache.org by Apache Jenkins Server <je...@builds.apache.org> on 2018/01/18 13:12:40 UTC
Failed: OOZIE-3145 PreCommit Build #335
Jira: https://issues.apache.org/jira/browse/OOZIE-3145
Build: https://builds.apache.org/job/PreCommit-OOZIE-Build/335/
###################################################################################
########################## LAST 100 LINES OF THE CONSOLE ###########################
[...truncated 1.58 MB...]
[DEBUG] There are no new bugs found in [core].
[TRACE] New XMLLib present, calling 'xmllint --xpath' to get bug instance counts
[DEBUG] There are no new bugs found in [tools].
[TRACE] New XMLLib present, calling 'xmllint --xpath' to get bug instance counts
[DEBUG] There are no new bugs found in [server].
[INFO] There are no new bugs found totally].
[TRACE] FindBugs diffs checked and reports created
[TRACE] Summary file size is 2109 bytes
[TRACE] Full summary file size is 1248 bytes
[TRACE] File [/home/jenkins/jenkins-slave/workspace/PreCommit-OOZIE-Build/test-patch/tmp/FINDBUGS_DIFF/diff/findbugs-diff-0.1.0-all.jar] removed
[TRACE] File [/home/jenkins/jenkins-slave/workspace/PreCommit-OOZIE-Build/test-patch/tmp/FINDBUGS_DIFF/diff/findbugs-diff-0.1.0-all.jar.md5sum] removed
Running test-patch task BACKWARDS_COMPATIBILITY
Running test-patch task TESTS
Running test-patch task DISTRO
Testing JIRA OOZIE-3145
Cleaning local git workspace
----------------------------
+1 PATCH_APPLIES
+1 CLEAN
-1 RAW_PATCH_ANALYSIS
+1 the patch does not introduce any @author tags
+1 the patch does not introduce any tabs
+1 the patch does not introduce any trailing spaces
-1 the patch contains 1 line(s) longer than 132 characters
+1 the patch adds/modifies 10 testcase(s)
+1 RAT
+1 the patch does not seem to introduce new RAT warnings
+1 JAVADOC
+1 the patch does not seem to introduce new Javadoc warnings
+1 COMPILE
+1 HEAD compiles
+1 patch compiles
+1 the patch does not seem to introduce new javac warnings
+1 There are no new bugs found in total.
+1 There are no new bugs found in [docs].
+1 There are no new bugs found in [sharelib/distcp].
+1 There are no new bugs found in [sharelib/hive].
+1 There are no new bugs found in [sharelib/spark].
+1 There are no new bugs found in [sharelib/hive2].
+1 There are no new bugs found in [sharelib/hcatalog].
+1 There are no new bugs found in [sharelib/streaming].
+1 There are no new bugs found in [sharelib/pig].
+1 There are no new bugs found in [sharelib/sqoop].
+1 There are no new bugs found in [sharelib/oozie].
+1 There are no new bugs found in [examples].
+1 There are no new bugs found in [client].
+1 There are no new bugs found in [core].
+1 There are no new bugs found in [tools].
+1 There are no new bugs found in [server].
+1 BACKWARDS_COMPATIBILITY
+1 the patch does not change any JPA Entity/Colum/Basic/Lob/Transient annotations
+1 the patch does not modify JPA files
-1 TESTS
Tests run: 2087
Tests failed: 3
Tests errors: 1
The patch failed the following testcases:
testPartitionDependency(org.apache.oozie.service.TestPartitionDependencyManagerService)
testCoordActionRecoveryServiceForWaitingRegisterPartition(org.apache.oozie.service.TestRecoveryService)
testPartitionDependency(org.apache.oozie.service.TestPartitionDependencyManagerEhcache)
Tests failing with errors:
testConnectionRetry(org.apache.oozie.service.TestJMSAccessorService)
Tests failed at first run:
TestJavaActionExecutor#testCredentialsSkip
For the complete list of flaky tests, see TEST-SUMMARY-FULL files.
+1 DISTRO
+1 distro tarball builds with the patch
----------------------------
-1 Overall result, please check the reported -1(s)
The full output of the test-patch run is available at
https://builds.apache.org/job/PreCommit-OOZIE-Build/335/
Adding comment to JIRA
curl: option -1(s)*{color}\n\n\nThe: is unknown
curl: try 'curl --help' or 'curl --manual' for more information
Failed to add comment to JIRA
test-patch exit code: 1
Build step 'Execute shell' marked build as failure
[description-setter] Description set: OOZIE-3145
Archiving artifacts
[Fast Archiver] Compressed 1.73 MB of artifacts by 37.8% relative to #318
Recording test results
Email was triggered for: Failure - Any
Sending email for trigger: Failure - Any
###################################################################################
############################## FAILED TESTS (if any) ##############################
4 tests failed.
FAILED: org.apache.oozie.service.TestJMSAccessorService.testConnectionRetry
Error Message:
null
Stack Trace:
junit.framework.AssertionFailedError
at org.apache.oozie.service.TestJMSAccessorService.testConnectionRetry(TestJMSAccessorService.java:183)
FAILED: org.apache.oozie.service.TestPartitionDependencyManagerEhcache.testPartitionDependency
Error Message:
null
Stack Trace:
junit.framework.AssertionFailedError
at org.apache.oozie.service.TestPartitionDependencyManagerEhcache.testPartitionDependency(TestPartitionDependencyManagerEhcache.java:47)
FAILED: org.apache.oozie.service.TestPartitionDependencyManagerService.testPartitionDependency
Error Message:
null
Stack Trace:
junit.framework.AssertionFailedError
at org.apache.oozie.service.TestPartitionDependencyManagerService.testPartitionDependency(TestPartitionDependencyManagerService.java:95)
FAILED: org.apache.oozie.service.TestRecoveryService.testCoordActionRecoveryServiceForWaitingRegisterPartition
Error Message:
null
Stack Trace:
junit.framework.AssertionFailedError
at org.apache.oozie.service.TestRecoveryService.testCoordActionRecoveryServiceForWaitingRegisterPartition(TestRecoveryService.java:505)
Success: OOZIE-3145 PreCommit Build #337
Posted by Apache Jenkins Server <je...@builds.apache.org>.
Jira: https://issues.apache.org/jira/browse/OOZIE-3145
Build: https://builds.apache.org/job/PreCommit-OOZIE-Build/337/
###################################################################################
########################## LAST 100 LINES OF THE CONSOLE ###########################
[...truncated 1.58 MB...]
[TRACE] New XMLLib present, calling 'xmllint --xpath' to get bug instance counts
[DEBUG] There are no new bugs found in [sharelib/oozie].
[TRACE] New XMLLib present, calling 'xmllint --xpath' to get bug instance counts
[DEBUG] There are no new bugs found in [sharelib/pig].
[TRACE] New XMLLib present, calling 'xmllint --xpath' to get bug instance counts
[DEBUG] There are no new bugs found in [sharelib/hive].
[TRACE] New XMLLib present, calling 'xmllint --xpath' to get bug instance counts
[DEBUG] There are no new bugs found in [sharelib/spark].
[TRACE] New XMLLib present, calling 'xmllint --xpath' to get bug instance counts
[DEBUG] There are no new bugs found in [client].
[TRACE] New XMLLib present, calling 'xmllint --xpath' to get bug instance counts
[DEBUG] There are no new bugs found in [examples].
[TRACE] New XMLLib present, calling 'xmllint --xpath' to get bug instance counts
[DEBUG] There are no new bugs found in [docs].
[TRACE] New XMLLib present, calling 'xmllint --xpath' to get bug instance counts
[DEBUG] There are no new bugs found in [server].
[INFO] There are no new bugs found totally].
[TRACE] FindBugs diffs checked and reports created
[TRACE] Summary file size is 2111 bytes
[TRACE] Full summary file size is 1248 bytes
[TRACE] File [/home/jenkins/jenkins-slave/workspace/PreCommit-OOZIE-Build/test-patch/tmp/FINDBUGS_DIFF/diff/findbugs-diff-0.1.0-all.jar] removed
[TRACE] File [/home/jenkins/jenkins-slave/workspace/PreCommit-OOZIE-Build/test-patch/tmp/FINDBUGS_DIFF/diff/findbugs-diff-0.1.0-all.jar.md5sum] removed
Running test-patch task BACKWARDS_COMPATIBILITY
Running test-patch task TESTS
Running test-patch task DISTRO
Testing JIRA OOZIE-3145
Cleaning local git workspace
----------------------------
+1 PATCH_APPLIES
+1 CLEAN
+1 RAW_PATCH_ANALYSIS
+1 the patch does not introduce any @author tags
+1 the patch does not introduce any tabs
+1 the patch does not introduce any trailing spaces
+1 the patch does not introduce any line longer than 132
+1 the patch adds/modifies 10 testcase(s)
+1 RAT
+1 the patch does not seem to introduce new RAT warnings
+1 JAVADOC
+1 the patch does not seem to introduce new Javadoc warnings
+1 COMPILE
+1 HEAD compiles
+1 patch compiles
+1 the patch does not seem to introduce new javac warnings
+1 There are no new bugs found in total.
+1 There are no new bugs found in [core].
+1 There are no new bugs found in [tools].
+1 There are no new bugs found in [sharelib/hive2].
+1 There are no new bugs found in [sharelib/distcp].
+1 There are no new bugs found in [sharelib/hcatalog].
+1 There are no new bugs found in [sharelib/streaming].
+1 There are no new bugs found in [sharelib/sqoop].
+1 There are no new bugs found in [sharelib/oozie].
+1 There are no new bugs found in [sharelib/pig].
+1 There are no new bugs found in [sharelib/hive].
+1 There are no new bugs found in [sharelib/spark].
+1 There are no new bugs found in [client].
+1 There are no new bugs found in [examples].
+1 There are no new bugs found in [docs].
+1 There are no new bugs found in [server].
+1 BACKWARDS_COMPATIBILITY
+1 the patch does not change any JPA Entity/Colum/Basic/Lob/Transient annotations
+1 the patch does not modify JPA files
+1 TESTS
Tests run: 2087
Tests failed at first run:
TestJavaActionExecutor#testCredentialsSkip
TestCoordActionsKillXCommand#testActionKillCommandDate
TestHiveActionExecutor#testHiveAction
For the complete list of flaky tests, see TEST-SUMMARY-FULL files.
+1 DISTRO
+1 distro tarball builds with the patch
----------------------------
+1 Overall result, good!, no -1s
The full output of the test-patch run is available at
https://builds.apache.org/job/PreCommit-OOZIE-Build/337/
Adding comment to JIRA
% Total % Received % Xferd Average Speed Time Time Time Current
Dload Upload Total Spent Left Speed
0 0 0 0 0 0 0 0 --:--:-- --:--:-- --:--:-- 0100 3010 0 0 100 3010 0 3350 --:--:-- --:--:-- --:--:-- 3348{"self":"https://issues.apache.org/jira/rest/api/2/issue/13126608/comment/16330902","id":"16330902","author":{"self":"https://issues.apache.org/jira/rest/api/2/user?username=hadoopqa","name":"hadoopqa","key":"hadoopqa","emailAddress":"blackhole at hadoop dot apache dot org","avatarUrls":{"48x48":"https://issues.apache.org/jira/secure/useravatar?ownerId=hadoopqa&avatarId=10393","24x24":"https://issues.apache.org/jira/secure/useravatar?size=small&ownerId=hadoopqa&avatarId=10393","16x16":"https://issues.apache.org/jira/secure/useravatar?size=xsmall&ownerId=hadoopqa&avatarId=10393","32x32":"https://issues.apache.org/jira/secure/useravatar?size=medium&ownerId=hadoopqa&avatarId=10393"},"displayName":"Hadoop QA","active":true,"timeZone":"Etc/UTC"},"body":"\nTesting JIRA OOZIE-3145\n\nCleaning local git workspace\n\n----------------------------\n\n{color:green}+1 PATCH_APPLIES{color}\n{color:green}+1 CLEAN{color}\n{color:green}+1 RAW_PATCH_ANALYSIS{color}\n. {color:green}+1{color} the patch does not introduce any @author tags\n. {color:green}+1{color} the patch does not introduce any tabs\n. {color:green}+1{color} the patch does not introduce any trailing spaces\n. {color:green}+1{color} the patch does not introduce any line longer than 132\n. {color:green}+1{color} the patch adds/modifies 10 testcase(s)\n{color:green}+1 RAT{color}\n. {color:green}+1{color} the patch does not seem to introduce new RAT warnings\n{color:green}+1 JAVADOC{color}\n. {color:green}+1{color} the patch does not seem to introduce new Javadoc warnings\n{color:green}+1 COMPILE{color}\n. {color:green}+1{color} HEAD compiles\n. {color:green}+1{color} patch compiles\n. {color:green}+1{color} the patch does not seem to introduce new javac warnings\n{color:green}+1{color} There are no new bugs found in total.\n. {color:green}+1{color} There are no new bugs found in [core].\n. {color:green}+1{color} There are no new bugs found in [tools].\n. {color:green}+1{color} There are no new bugs found in [sharelib/hive2].\n. {color:green}+1{color} There are no new bugs found in [sharelib/distcp].\n. {color:green}+1{color} There are no new bugs found in [sharelib/hcatalog].\n. {color:green}+1{color} There are no new bugs found in [sharelib/streaming].\n. {color:green}+1{color} There are no new bugs found in [sharelib/sqoop].\n. {color:green}+1{color} There are no new bugs found in [sharelib/oozie].\n. {color:green}+1{color} There are no new bugs found in [sharelib/pig].\n. {color:green}+1{color} There are no new bugs found in [sharelib/hive].\n. {color:green}+1{color} There are no new bugs found in [sharelib/spark].\n. {color:green}+1{color} There are no new bugs found in [client].\n. {color:green}+1{color} There are no new bugs found in [examples].\n. {color:green}+1{color} There are no new bugs found in [docs].\n. {color:green}+1{color} There are no new bugs found in [server].\n{color:green}+1 BACKWARDS_COMPATIBILITY{color}\n. {color:green}+1{color} the patch does not change any JPA Entity/Colum/Basic/Lob/Transient annotations\n. {color:green}+1{color} the patch does not modify JPA files\n{color:green}+1 TESTS{color}\n. Tests run: 2087\n. {color:orange}Tests failed at first run:{color}\nTestJavaActionExecutor#testCredentialsSkip\nTestCoordActionsKillXCommand#testActionKillCommandDate\nTestHiveActionExecutor#testHiveAction\n. For the complete list of flaky tests, see TEST-SUMMARY-FULL files.\n{color:green}+1 DISTRO{color}\n. {color:green}+1{color} distro tarball builds with the patch \n\n----------------------------\n{color:green}*+1 Overall result, good!, no -1s*{color}\n\n\nThe full output of the test-patch run is available at\n\n. https://builds.apache.org/job/PreCommit-OOZIE-Build/337/\n\n","updateAuthor":{"self":"https://issues.apache.org/jira/rest/api/2/user?username=hadoopqa","name":"hadoopqa","key":"hadoopqa","emailAddress":"blackhole at hadoop dot apache dot org","avatarUrls":{"48x48":"https://issues.apache.org/jira/secure/useravatar?ownerId=hadoopqa&avatarId=10393","24x24":"https://issues.apache.org/jira/secure/user100 7508 0 4498 100 3010 5006 3350 --:--:-- --:--:-- --:--:-- 5003
avatar?size=small&ownerId=hadoopqa&avatarId=10393","16x16":"https://issues.apache.org/jira/secure/useravatar?size=xsmall&ownerId=hadoopqa&avatarId=10393","32x32":"https://issues.apache.org/jira/secure/useravatar?size=medium&ownerId=hadoopqa&avatarId=10393"},"displayName":"Hadoop QA","active":true,"timeZone":"Etc/UTC"},"created":"2018-01-18T18:22:39.624+0000","updated":"2018-01-18T18:22:39.624+0000"}
test-patch exit code: 0
[description-setter] Description set: OOZIE-3145
Archiving artifacts
[Fast Archiver] Compressed 1.73 MB of artifacts by 28.9% relative to #318
Recording test results
Email was triggered for: Success
Sending email for trigger: Success
###################################################################################
############################## FAILED TESTS (if any) ##############################
All tests passed
Failed: OOZIE-2775 PreCommit Build #336
Posted by Apache Jenkins Server <je...@builds.apache.org>.
Jira: https://issues.apache.org/jira/browse/OOZIE-2775
Build: https://builds.apache.org/job/PreCommit-OOZIE-Build/336/
###################################################################################
########################## LAST 100 LINES OF THE CONSOLE ###########################
[...truncated 1.58 MB...]
[DEBUG] There are no new bugs found in [sharelib/pig].
[TRACE] New XMLLib present, calling 'xmllint --xpath' to get bug instance counts
[DEBUG] There are no new bugs found in [sharelib/sqoop].
[TRACE] New XMLLib present, calling 'xmllint --xpath' to get bug instance counts
[DEBUG] There are no new bugs found in [sharelib/oozie].
[TRACE] New XMLLib present, calling 'xmllint --xpath' to get bug instance counts
[DEBUG] There are no new bugs found in [examples].
[TRACE] New XMLLib present, calling 'xmllint --xpath' to get bug instance counts
[DEBUG] There are no new bugs found in [client].
[TRACE] New XMLLib present, calling 'xmllint --xpath' to get bug instance counts
[DEBUG] There are no new bugs found in [core].
[TRACE] New XMLLib present, calling 'xmllint --xpath' to get bug instance counts
[DEBUG] There are no new bugs found in [tools].
[TRACE] New XMLLib present, calling 'xmllint --xpath' to get bug instance counts
[WARN] There are [1] new bugs found in [server].
[DEBUG] You can find the FindBugs diff here: server/findbugs-new.html
[WARN] There are [1] new bugs found in total that would be nice to have fixed.
[TRACE] FindBugs diffs checked and reports created
[TRACE] Summary file size is 2243 bytes
[TRACE] Full summary file size is 1380 bytes
[TRACE] File [/home/jenkins/jenkins-slave/workspace/PreCommit-OOZIE-Build/test-patch/tmp/FINDBUGS_DIFF/diff/findbugs-diff-0.1.0-all.jar] removed
[TRACE] File [/home/jenkins/jenkins-slave/workspace/PreCommit-OOZIE-Build/test-patch/tmp/FINDBUGS_DIFF/diff/findbugs-diff-0.1.0-all.jar.md5sum] removed
Running test-patch task BACKWARDS_COMPATIBILITY
Running test-patch task TESTS
Running test-patch task DISTRO
Testing JIRA OOZIE-2775
Cleaning local git workspace
----------------------------
+1 PATCH_APPLIES
+1 CLEAN
-1 RAW_PATCH_ANALYSIS
+1 the patch does not introduce any @author tags
+1 the patch does not introduce any tabs
+1 the patch does not introduce any trailing spaces
+1 the patch does not introduce any line longer than 132
-1 the patch does not add/modify any testcase
+1 RAT
+1 the patch does not seem to introduce new RAT warnings
+1 JAVADOC
+1 the patch does not seem to introduce new Javadoc warnings
+1 COMPILE
+1 HEAD compiles
+1 patch compiles
+1 the patch does not seem to introduce new javac warnings
0 There are [1] new bugs found in total that would be nice to have fixed.
+1 There are no new bugs found in [docs].
+1 There are no new bugs found in [sharelib/distcp].
+1 There are no new bugs found in [sharelib/hive].
+1 There are no new bugs found in [sharelib/spark].
+1 There are no new bugs found in [sharelib/hive2].
+1 There are no new bugs found in [sharelib/hcatalog].
+1 There are no new bugs found in [sharelib/streaming].
+1 There are no new bugs found in [sharelib/pig].
+1 There are no new bugs found in [sharelib/sqoop].
+1 There are no new bugs found in [sharelib/oozie].
+1 There are no new bugs found in [examples].
+1 There are no new bugs found in [client].
+1 There are no new bugs found in [core].
+1 There are no new bugs found in [tools].
0 There are [1] new bugs found in [server] that would be nice to have fixed.
You can find the FindBugs diff here: server/findbugs-new.html
+1 BACKWARDS_COMPATIBILITY
+1 the patch does not change any JPA Entity/Colum/Basic/Lob/Transient annotations
+1 the patch does not modify JPA files
+1 TESTS
Tests run: 2087
Tests failed at first run:
TestJavaActionExecutor#testCredentialsSkip
For the complete list of flaky tests, see TEST-SUMMARY-FULL files.
+1 DISTRO
+1 distro tarball builds with the patch
----------------------------
-1 Overall result, please check the reported -1(s)
The full output of the test-patch run is available at
https://builds.apache.org/job/PreCommit-OOZIE-Build/336/
Adding comment to JIRA
% Total % Received % Xferd Average Speed Time Time Time Current
Dload Upload Total Spent Left Speed
0 0 0 0 0 0 0 0 --:--:-- --:--:-- --:--:-- 0100 3064 0 0 100 3064 0 3182 --:--:-- --:--:-- --:--:-- 3181{"self":"https://issues.apache.org/jira/rest/api/2/issue/13035979/comment/16330859","id":"16330859","author":{"self":"https://issues.apache.org/jira/rest/api/2/user?username=hadoopqa","name":"hadoopqa","key":"hadoopqa","emailAddress":"blackhole at hadoop dot apache dot org","avatarUrls":{"48x48":"https://issues.apache.org/jira/secure/useravatar?ownerId=hadoopqa&avatarId=10393","24x24":"https://issues.apache.org/jira/secure/useravatar?size=small&ownerId=hadoopqa&avatarId=10393","16x16":"https://issues.apache.org/jira/secure/useravatar?size=xsmall&ownerId=hadoopqa&avatarId=10393","32x32":"https://issues.apache.org/jira/secure/useravatar?size=medium&ownerId=hadoopqa&avatarId=10393"},"displayName":"Hadoop QA","active":true,"timeZone":"Etc/UTC"},"body":"\nTesting JIRA OOZIE-2775\n\nCleaning local git workspace\n\n----------------------------\n\n{color:green}+1 PATCH_APPLIES{color}\n{color:green}+1 CLEAN{color}\n{color:red}-1 RAW_PATCH_ANALYSIS{color}\n. {color:green}+1{color} the patch does not introduce any @author tags\n. {color:green}+1{color} the patch does not introduce any tabs\n. {color:green}+1{color} the patch does not introduce any trailing spaces\n. {color:green}+1{color} the patch does not introduce any line longer than 132\n. {color:red}-1{color} the patch does not add/modify any testcase\n{color:green}+1 RAT{color}\n. {color:green}+1{color} the patch does not seem to introduce new RAT warnings\n{color:green}+1 JAVADOC{color}\n. {color:green}+1{color} the patch does not seem to introduce new Javadoc warnings\n{color:green}+1 COMPILE{color}\n. {color:green}+1{color} HEAD compiles\n. {color:green}+1{color} patch compiles\n. {color:green}+1{color} the patch does not seem to introduce new javac warnings\n{color:orange}0{color} There are [1] new bugs found in total that would be nice to have fixed.\n. {color:green}+1{color} There are no new bugs found in [docs].\n. {color:green}+1{color} There are no new bugs found in [sharelib/distcp].\n. {color:green}+1{color} There are no new bugs found in [sharelib/hive].\n. {color:green}+1{color} There are no new bugs found in [sharelib/spark].\n. {color:green}+1{color} There are no new bugs found in [sharelib/hive2].\n. {color:green}+1{color} There are no new bugs found in [sharelib/hcatalog].\n. {color:green}+1{color} There are no new bugs found in [sharelib/streaming].\n. {color:green}+1{color} There are no new bugs found in [sharelib/pig].\n. {color:green}+1{color} There are no new bugs found in [sharelib/sqoop].\n. {color:green}+1{color} There are no new bugs found in [sharelib/oozie].\n. {color:green}+1{color} There are no new bugs found in [examples].\n. {color:green}+1{color} There are no new bugs found in [client].\n. {color:green}+1{color} There are no new bugs found in [core].\n. {color:green}+1{color} There are no new bugs found in [tools].\n. {color:orange}0{color} There are [1] new bugs found in [server] that would be nice to have fixed.\n. You can find the FindBugs diff here: server/findbugs-new.html\n{color:green}+1 BACKWARDS_COMPATIBILITY{color}\n. {color:green}+1{color} the patch does not change any JPA Entity/Colum/Basic/Lob/Transient annotations\n. {color:green}+1{color} the patch does not modify JPA files\n{color:green}+1 TESTS{color}\n. Tests run: 2087\n. {color:orange}Tests failed at first run:{color}\nTestJavaActionExecutor#testCredentialsSkip\n. For the complete list of flaky tests, see TEST-SUMMARY-FULL files.\n{color:green}+1 DISTRO{color}\n. {color:green}+1{color} distro tarball builds with the patch \n\n----------------------------\n{color:red}*-1 Overall result, please check the reported -1(s)*{color}\n\n\nThe full output of the test-patch run is available at\n\n. https://builds.apache.org/job/PreCommit-OOZIE-Build/336/\n\n","updateAuthor":{"self":"https://issues.apache.org/jira/rest/api/2/user?username=hadoopqa","name":"hadoopqa","key":"hadoopqa","emailAddress":"blackhole at hadoop dot apache dot org","avatarUrls":{"48x48":"https://issues.apache.org/jira/secure/useravatar?ownerId=hadoopqa&avatarId=1039100 7616 0 4552 100 3064 4723 3179 --:--:-- --:--:-- --:--:-- 4721
3","24x24":"https://issues.apache.org/jira/secure/useravatar?size=small&ownerId=hadoopqa&avatarId=10393","16x16":"https://issues.apache.org/jira/secure/useravatar?size=xsmall&ownerId=hadoopqa&avatarId=10393","32x32":"https://issues.apache.org/jira/secure/useravatar?size=medium&ownerId=hadoopqa&avatarId=10393"},"displayName":"Hadoop QA","active":true,"timeZone":"Etc/UTC"},"created":"2018-01-18T17:52:35.066+0000","updated":"2018-01-18T17:52:35.066+0000"}
test-patch exit code: 1
Build step 'Execute shell' marked build as failure
[description-setter] Description set: OOZIE-2775
Archiving artifacts
[Fast Archiver] Compressed 1.73 MB of artifacts by 37.9% relative to #318
Recording test results
Email was triggered for: Failure - Any
Sending email for trigger: Failure - Any
###################################################################################
############################## FAILED TESTS (if any) ##############################
All tests passed