You are viewing a plain text version of this content. The canonical link for it is here.
Posted to issues@calcite.apache.org by "duan xiong (Jira)" <ji...@apache.org> on 2021/09/25 01:31:00 UTC

[jira] [Created] (CALCITE-4799) SqlXmlFunctionsTest testXmlTransform unit test failed coused by NPE

duan xiong created CALCITE-4799:
-----------------------------------

             Summary: SqlXmlFunctionsTest testXmlTransform unit test failed coused by NPE
                 Key: CALCITE-4799
                 URL: https://issues.apache.org/jira/browse/CALCITE-4799
             Project: Calcite
          Issue Type: Bug
            Reporter: duan xiong
            Assignee: duan xiong
             Fix For: 1.28.0


Error Info:
{code:java}
java.lang.AssertionError: xmlTransform(, <)
Expected: is org.apache.calcite.runtime.CalciteException: Illegal xslt specified : '<'
     but: was <java.lang.NullPointerException>
Expected :is org.apache.calcite.runtime.CalciteException: Illegal xslt specified : '<'
Actual   :<java.lang.NullPointerException>
{code}



--
This message was sent by Atlassian Jira
(v8.3.4#803005)