You are viewing a plain text version of this content. The canonical link for it is here.
Posted to builds@beam.apache.org by Apache Jenkins Server <je...@builds.apache.org> on 2019/11/22 18:58:02 UTC

Build failed in Jenkins: beam_PostCommit_Python35 #1061

See <https://builds.apache.org/job/beam_PostCommit_Python35/1061/display/redirect>

Changes:


------------------------------------------
[...truncated 542.11 KB...]
19/11/22 18:07:41 WARN org.apache.beam.runners.spark.translation.GroupNonMergingWindowsFunctions: Either coder LengthPrefixCoder(ByteArrayCoder) or GlobalWindow$Coder is not consistent with equals. That might cause issues on some runners.
WARNING:apache_beam.io.filebasedsink:Deleting 4 existing files in target path matching: -*-of-%(num_shards)05d
19/11/22 18:07:58 INFO org.apache.beam.runners.spark.SparkPipelineRunner: Job BeamApp-jenkins-1122180737-9d0147df_64726fc5-e0ef-40c2-81c0-015e42d52d0f: Pipeline translated successfully. Computing outputs
INFO:apache_beam.io.filebasedsink:Starting finalize_write threads with num_shards: 4 (skipped: 0), batches: 4, num_threads: 4
INFO:apache_beam.io.filebasedsink:Renamed 4 shards in 0.10 seconds.
19/11/22 18:08:15 INFO org.apache.beam.runners.spark.SparkPipelineRunner: Job BeamApp-jenkins-1122180737-9d0147df_64726fc5-e0ef-40c2-81c0-015e42d52d0f finished.
19/11/22 18:08:15 WARN org.apache.beam.runners.spark.SparkPipelineResult$BatchMode: Collecting monitoring infos is not implemented yet in Spark portable runner.
19/11/22 18:08:15 INFO org.apache.beam.runners.fnexecution.artifact.AbstractArtifactRetrievalService: Manifest at /tmp/beam-tempq4mdkj7i/artifactsjn23gfs1/job_8d3300fd-2338-4731-8bcd-0d5cc4f26178/MANIFEST has 1 artifact locations
19/11/22 18:08:15 INFO org.apache.beam.runners.fnexecution.artifact.BeamFileSystemArtifactStagingService: Removed dir /tmp/beam-tempq4mdkj7i/artifactsjn23gfs1/job_8d3300fd-2338-4731-8bcd-0d5cc4f26178/
INFO:apache_beam.runners.portability.portable_runner:Job state changed to DONE
19/11/22 18:08:15 INFO org.apache.beam.runners.fnexecution.jobsubmission.InMemoryJobService: Getting job metrics for BeamApp-jenkins-1122180737-9d0147df_64726fc5-e0ef-40c2-81c0-015e42d52d0f
19/11/22 18:08:15 INFO org.apache.beam.runners.fnexecution.jobsubmission.InMemoryJobService: Finished getting job metrics for BeamApp-jenkins-1122180737-9d0147df_64726fc5-e0ef-40c2-81c0-015e42d52d0f
ERROR:apache_beam.runners.worker.data_plane:Failed to read inputs in the data plane.
Traceback (most recent call last):
  File "<https://builds.apache.org/job/beam_PostCommit_Python35/ws/src/sdks/python/apache_beam/runners/worker/data_plane.py",> line 272, in _read_inputs
    for elements in elements_iterator:
  File "<https://builds.apache.org/job/beam_PostCommit_Python35/ws/src/build/gradleenv/2022703439/lib/python3.5/site-packages/grpc/_channel.py",> line 392, in __next__
    return self._next()
  File "<https://builds.apache.org/job/beam_PostCommit_Python35/ws/src/build/gradleenv/2022703439/lib/python3.5/site-packages/grpc/_channel.py",> line 561, in _next
    raise self
grpc._channel._Rendezvous: <_Rendezvous of RPC that terminated with:
	status = StatusCode.UNAVAILABLE
	details = "Socket closed"
	debug_error_string = "{"created":"@1574446096.005167741","description":"Error received from peer ipv4:127.0.0.1:39127","file":"src/core/lib/surface/call.cc","file_line":1055,"grpc_message":"Socket closed","grpc_status":14}"
>
Exception in thread run_worker_1-1:
Traceback (most recent call last):
  File "/usr/lib/python3.5/threading.py", line 914, in _bootstrap_inner
    self.run()
  File "/usr/lib/python3.5/threading.py", line 862, in run
    self._target(*self._args, **self._kwargs)
  File "<https://builds.apache.org/job/beam_PostCommit_Python35/ws/src/sdks/python/apache_beam/runners/worker/sdk_worker.py",> line 111, in run
    for work_request in control_stub.Control(get_responses()):
  File "<https://builds.apache.org/job/beam_PostCommit_Python35/ws/src/build/gradleenv/2022703439/lib/python3.5/site-packages/grpc/_channel.py",> line 392, in __next__
    return self._next()
  File "<https://builds.apache.org/job/beam_PostCommit_Python35/ws/src/build/gradleenv/2022703439/lib/python3.5/site-packages/grpc/_channel.py",> line 561, in _next
    raise self
grpc._channel._Rendezvous: <_Rendezvous of RPC that terminated with:
	status = StatusCode.UNAVAILABLE
	details = "Socket closed"
	debug_error_string = "{"created":"@1574446096.005218623","description":"Error received from peer ipv4:127.0.0.1:45003","file":"src/core/lib/surface/call.cc","file_line":1055,"grpc_message":"Socket closed","grpc_status":14}"
>

Exception in thread read_grpc_client_inputs:
Traceback (most recent call last):
  File "/usr/lib/python3.5/threading.py", line 914, in _bootstrap_inner
    self.run()
  File "/usr/lib/python3.5/threading.py", line 862, in run
    self._target(*self._args, **self._kwargs)
  File "<https://builds.apache.org/job/beam_PostCommit_Python35/ws/src/sdks/python/apache_beam/runners/worker/data_plane.py",> line 286, in <lambda>
    target=lambda: self._read_inputs(elements_iterator),
  File "<https://builds.apache.org/job/beam_PostCommit_Python35/ws/src/sdks/python/apache_beam/runners/worker/data_plane.py",> line 272, in _read_inputs
    for elements in elements_iterator:
  File "<https://builds.apache.org/job/beam_PostCommit_Python35/ws/src/build/gradleenv/2022703439/lib/python3.5/site-packages/grpc/_channel.py",> line 392, in __next__
    return self._next()
  File "<https://builds.apache.org/job/beam_PostCommit_Python35/ws/src/build/gradleenv/2022703439/lib/python3.5/site-packages/grpc/_channel.py",> line 561, in _next
    raise self
grpc._channel._Rendezvous: <_Rendezvous of RPC that terminated with:
	status = StatusCode.UNAVAILABLE
	details = "Socket closed"
	debug_error_string = "{"created":"@1574446096.005167741","description":"Error received from peer ipv4:127.0.0.1:39127","file":"src/core/lib/surface/call.cc","file_line":1055,"grpc_message":"Socket closed","grpc_status":14}"
>

Exception in thread read_state:
Traceback (most recent call last):
  File "/usr/lib/python3.5/threading.py", line 914, in _bootstrap_inner
    self.run()
  File "/usr/lib/python3.5/threading.py", line 862, in run
    self._target(*self._args, **self._kwargs)
  File "<https://builds.apache.org/job/beam_PostCommit_Python35/ws/src/sdks/python/apache_beam/runners/worker/sdk_worker.py",> line 532, in pull_responses
    for response in responses:
  File "<https://builds.apache.org/job/beam_PostCommit_Python35/ws/src/build/gradleenv/2022703439/lib/python3.5/site-packages/grpc/_channel.py",> line 392, in __next__
    return self._next()
  File "<https://builds.apache.org/job/beam_PostCommit_Python35/ws/src/build/gradleenv/2022703439/lib/python3.5/site-packages/grpc/_channel.py",> line 561, in _next
    raise self
grpc._channel._Rendezvous: <_Rendezvous of RPC that terminated with:
	status = StatusCode.UNAVAILABLE
	details = "Socket closed"
	debug_error_string = "{"created":"@1574446096.005195672","description":"Error received from peer ipv4:127.0.0.1:44483","file":"src/core/lib/surface/call.cc","file_line":1055,"grpc_message":"Socket closed","grpc_status":14}"
>


> Task :sdks:python:test-suites:portable:py35:postCommitPy35

> Task :sdks:python:test-suites:dataflow:py35:postCommitIT
<https://builds.apache.org/job/beam_PostCommit_Python35/ws/src/sdks/python/apache_beam/io/gcp/bigquery.py>:1214: BeamDeprecationWarning: options is deprecated since First stable release. References to <pipeline>.options will not be supported
Worker logs: https://console.cloud.google.com/dataflow/jobsDetail/locations/us-central1/jobs/2019-11-22_10_06_38-14384762756298540930?project=apache-beam-testing
  experiments = p.options.view_as(DebugOptions).experiments or []
Worker logs: https://console.cloud.google.com/dataflow/jobsDetail/locations/us-central1/jobs/2019-11-22_10_21_45-15260282540230023948?project=apache-beam-testing
Worker logs: https://console.cloud.google.com/dataflow/jobsDetail/locations/us-central1/jobs/2019-11-22_10_30_34-2306581968538768935?project=apache-beam-testing
Worker logs: https://console.cloud.google.com/dataflow/jobsDetail/locations/us-central1/jobs/2019-11-22_10_39_03-3628701211018734379?project=apache-beam-testing
Worker logs: https://console.cloud.google.com/dataflow/jobsDetail/locations/us-central1/jobs/2019-11-22_10_47_42-8528509713690998240?project=apache-beam-testing
Worker logs: https://console.cloud.google.com/dataflow/jobsDetail/locations/us-central1/jobs/2019-11-22_10_06_33-10027502528194835440?project=apache-beam-testing
<https://builds.apache.org/job/beam_PostCommit_Python35/ws/src/sdks/python/apache_beam/runners/dataflow/dataflow_runner.py>:726: BeamDeprecationWarning: BigQuerySink is deprecated since 2.11.0. Use WriteToBigQuery instead.
  kms_key=transform.kms_key))
Worker logs: https://console.cloud.google.com/dataflow/jobsDetail/locations/us-central1/jobs/2019-11-22_10_27_02-15918675561047750164?project=apache-beam-testing
<https://builds.apache.org/job/beam_PostCommit_Python35/ws/src/sdks/python/apache_beam/io/gcp/bigquery.py>:1211: BeamDeprecationWarning: options is deprecated since First stable release. References to <pipeline>.options will not be supported
Worker logs: https://console.cloud.google.com/dataflow/jobsDetail/locations/us-central1/jobs/2019-11-22_10_44_46-6429697835167192199?project=apache-beam-testing
  self.table_reference.projectId = pcoll.pipeline.options.view_as(
Worker logs: https://console.cloud.google.com/dataflow/jobsDetail/locations/us-central1/jobs/2019-11-22_10_06_35-4443876451334768045?project=apache-beam-testing
<https://builds.apache.org/job/beam_PostCommit_Python35/ws/src/sdks/python/apache_beam/io/gcp/bigquery.py>:1214: BeamDeprecationWarning: options is deprecated since First stable release. References to <pipeline>.options will not be supported
Worker logs: https://console.cloud.google.com/dataflow/jobsDetail/locations/us-central1/jobs/2019-11-22_10_19_19-10227705068216540563?project=apache-beam-testing
  experiments = p.options.view_as(DebugOptions).experiments or []
Worker logs: https://console.cloud.google.com/dataflow/jobsDetail/locations/us-central1/jobs/2019-11-22_10_27_28-16933648515299513330?project=apache-beam-testing
<https://builds.apache.org/job/beam_PostCommit_Python35/ws/src/sdks/python/apache_beam/runners/dataflow/dataflow_runner.py>:726: BeamDeprecationWarning: BigQuerySink is deprecated since 2.11.0. Use WriteToBigQuery instead.
Worker logs: https://console.cloud.google.com/dataflow/jobsDetail/locations/us-central1/jobs/2019-11-22_10_36_09-10602198740801515272?project=apache-beam-testing
  kms_key=transform.kms_key))
<https://builds.apache.org/job/beam_PostCommit_Python35/ws/src/sdks/python/apache_beam/runners/dataflow/dataflow_runner.py>:726: BeamDeprecationWarning: BigQuerySink is deprecated since 2.11.0. Use WriteToBigQuery instead.
  kms_key=transform.kms_key))
Worker logs: https://console.cloud.google.com/dataflow/jobsDetail/locations/us-central1/jobs/2019-11-22_10_44_18-13517626372705824378?project=apache-beam-testing
<https://builds.apache.org/job/beam_PostCommit_Python35/ws/src/sdks/python/apache_beam/runners/dataflow/dataflow_runner.py>:726: BeamDeprecationWarning: BigQuerySink is deprecated since 2.11.0. Use WriteToBigQuery instead.
  kms_key=transform.kms_key))
Worker logs: https://console.cloud.google.com/dataflow/jobsDetail/locations/us-central1/jobs/2019-11-22_10_06_35-14194108731007292568?project=apache-beam-testing
<https://builds.apache.org/job/beam_PostCommit_Python35/ws/src/sdks/python/apache_beam/io/gcp/bigquery.py>:1214: BeamDeprecationWarning: options is deprecated since First stable release. References to <pipeline>.options will not be supported
Worker logs: https://console.cloud.google.com/dataflow/jobsDetail/locations/us-central1/jobs/2019-11-22_10_25_35-11050748496638217595?project=apache-beam-testing
  experiments = p.options.view_as(DebugOptions).experiments or []
Worker logs: https://console.cloud.google.com/dataflow/jobsDetail/locations/us-central1/jobs/2019-11-22_10_34_41-3301027758610844505?project=apache-beam-testing
<https://builds.apache.org/job/beam_PostCommit_Python35/ws/src/sdks/python/apache_beam/io/gcp/bigquery_file_loads.py>:797: BeamDeprecationWarning: options is deprecated since First stable release. References to <pipeline>.options will not be supported
Worker logs: https://console.cloud.google.com/dataflow/jobsDetail/locations/us-central1/jobs/2019-11-22_10_43_51-14782464295233407750?project=apache-beam-testing
  temp_location = p.options.view_as(GoogleCloudOptions).temp_location
<https://builds.apache.org/job/beam_PostCommit_Python35/ws/src/sdks/python/apache_beam/io/fileio_test.py>:296: FutureWarning: MatchAll is experimental.
  | 'GetPath' >> beam.Map(lambda metadata: metadata.path))
<https://builds.apache.org/job/beam_PostCommit_Python35/ws/src/sdks/python/apache_beam/io/fileio_test.py>:307: FutureWarning: MatchAll is experimental.
  | 'Checksums' >> beam.Map(compute_hash))
<https://builds.apache.org/job/beam_PostCommit_Python35/ws/src/sdks/python/apache_beam/io/fileio_test.py>:307: FutureWarning: ReadMatches is experimental.
  | 'Checksums' >> beam.Map(compute_hash))
Worker logs: https://console.cloud.google.com/dataflow/jobsDetail/locations/us-central1/jobs/2019-11-22_10_06_32-8143113245496427589?project=apache-beam-testing
<https://builds.apache.org/job/beam_PostCommit_Python35/ws/src/sdks/python/apache_beam/io/gcp/bigquery.py>:1214: BeamDeprecationWarning: options is deprecated since First stable release. References to <pipeline>.options will not be supported
  experiments = p.options.view_as(DebugOptions).experiments or []
Worker logs: https://console.cloud.google.com/dataflow/jobsDetail/locations/us-central1/jobs/2019-11-22_10_16_18-10945899753088099986?project=apache-beam-testing
Worker logs: https://console.cloud.google.com/dataflow/jobsDetail/locations/us-central1/jobs/2019-11-22_10_25_47-7067022349752126990?project=apache-beam-testing
<https://builds.apache.org/job/beam_PostCommit_Python35/ws/src/sdks/python/apache_beam/io/gcp/bigquery_file_loads.py>:797: BeamDeprecationWarning: options is deprecated since First stable release. References to <pipeline>.options will not be supported
Worker logs: https://console.cloud.google.com/dataflow/jobsDetail/locations/us-central1/jobs/2019-11-22_10_35_08-1987189878556728703?project=apache-beam-testing
  temp_location = p.options.view_as(GoogleCloudOptions).temp_location
<https://builds.apache.org/job/beam_PostCommit_Python35/ws/src/sdks/python/apache_beam/io/gcp/bigquery.py>:1214: BeamDeprecationWarning: options is deprecated since First stable release. References to <pipeline>.options will not be supported
  experiments = p.options.view_as(DebugOptions).experiments or []
<https://builds.apache.org/job/beam_PostCommit_Python35/ws/src/sdks/python/apache_beam/io/gcp/bigquery_file_loads.py>:797: BeamDeprecationWarning: options is deprecated since First stable release. References to <pipeline>.options will not be supported
  temp_location = p.options.view_as(GoogleCloudOptions).temp_location
Worker logs: https://console.cloud.google.com/dataflow/jobsDetail/locations/us-central1/jobs/2019-11-22_10_06_37-5356615272867469124?project=apache-beam-testing
<https://builds.apache.org/job/beam_PostCommit_Python35/ws/src/sdks/python/apache_beam/runners/dataflow/dataflow_runner.py>:726: BeamDeprecationWarning: BigQuerySink is deprecated since 2.11.0. Use WriteToBigQuery instead.
Worker logs: https://console.cloud.google.com/dataflow/jobsDetail/locations/us-central1/jobs/2019-11-22_10_14_47-84286721737833426?project=apache-beam-testing
  kms_key=transform.kms_key))
Worker logs: https://console.cloud.google.com/dataflow/jobsDetail/locations/us-central1/jobs/2019-11-22_10_24_26-8383231254381250714?project=apache-beam-testing
Worker logs: https://console.cloud.google.com/dataflow/jobsDetail/locations/us-central1/jobs/2019-11-22_10_33_47-13006980630771002018?project=apache-beam-testing
<https://builds.apache.org/job/beam_PostCommit_Python35/ws/src/sdks/python/apache_beam/io/gcp/bigquery_test.py>:651: BeamDeprecationWarning: options is deprecated since First stable release. References to <pipeline>.options will not be supported
Worker logs: https://console.cloud.google.com/dataflow/jobsDetail/locations/us-central1/jobs/2019-11-22_10_42_13-4124813952907995927?project=apache-beam-testing
  streaming = self.test_pipeline.options.view_as(StandardOptions).streaming
<https://builds.apache.org/job/beam_PostCommit_Python35/ws/src/sdks/python/apache_beam/io/gcp/bigquery.py>:1214: BeamDeprecationWarning: options is deprecated since First stable release. References to <pipeline>.options will not be supported
  experiments = p.options.view_as(DebugOptions).experiments or []
Worker logs: https://console.cloud.google.com/dataflow/jobsDetail/locations/us-central1/jobs/2019-11-22_10_06_33-4308274920872289801?project=apache-beam-testing
Worker logs: https://console.cloud.google.com/dataflow/jobsDetail/locations/us-central1/jobs/2019-11-22_10_16_08-1618040393370774321?project=apache-beam-testing
Worker logs: https://console.cloud.google.com/dataflow/jobsDetail/locations/us-central1/jobs/2019-11-22_10_23_36-2424076822706803651?project=apache-beam-testing
Worker logs: https://console.cloud.google.com/dataflow/jobsDetail/locations/us-central1/jobs/2019-11-22_10_31_16-4917149739541715723?project=apache-beam-testing
<https://builds.apache.org/job/beam_PostCommit_Python35/ws/src/sdks/python/apache_beam/runners/dataflow/dataflow_runner.py>:726: BeamDeprecationWarning: BigQuerySink is deprecated since 2.11.0. Use WriteToBigQuery instead.
Worker logs: https://console.cloud.google.com/dataflow/jobsDetail/locations/us-central1/jobs/2019-11-22_10_39_01-16820932451856397350?project=apache-beam-testing
  kms_key=transform.kms_key))
<https://builds.apache.org/job/beam_PostCommit_Python35/ws/src/sdks/python/apache_beam/runners/dataflow/dataflow_runner.py>:726: BeamDeprecationWarning: BigQuerySink is deprecated since 2.11.0. Use WriteToBigQuery instead.
  kms_key=transform.kms_key))
<https://builds.apache.org/job/beam_PostCommit_Python35/ws/src/sdks/python/apache_beam/runners/dataflow/dataflow_runner.py>:726: BeamDeprecationWarning: BigQuerySink is deprecated since 2.11.0. Use WriteToBigQuery instead.
  kms_key=transform.kms_key))
<https://builds.apache.org/job/beam_PostCommit_Python35/ws/src/sdks/python/apache_beam/io/gcp/big_query_query_to_table_pipeline.py>:73: BeamDeprecationWarning: BigQuerySink is deprecated since 2.11.0. Use WriteToBigQuery instead.
  kms_key=kms_key))
Worker logs: https://console.cloud.google.com/dataflow/jobsDetail/locations/us-central1/jobs/2019-11-22_10_06_32-14575803532874453963?project=apache-beam-testing
Worker logs: https://console.cloud.google.com/dataflow/jobsDetail/locations/us-central1/jobs/2019-11-22_10_15_52-8276091158554624348?project=apache-beam-testing
Worker logs: https://console.cloud.google.com/dataflow/jobsDetail/locations/us-central1/jobs/2019-11-22_10_23_45-8350444398333137386?project=apache-beam-testing
Worker logs: https://console.cloud.google.com/dataflow/jobsDetail/locations/us-central1/jobs/2019-11-22_10_32_32-631521263392931319?project=apache-beam-testing
Worker logs: https://console.cloud.google.com/dataflow/jobsDetail/locations/us-central1/jobs/2019-11-22_10_40_49-15140882968510606695?project=apache-beam-testing
Worker logs: https://console.cloud.google.com/dataflow/jobsDetail/locations/us-central1/jobs/2019-11-22_10_49_35-11882128677679360270?project=apache-beam-testing
test_datastore_wordcount_it (apache_beam.examples.cookbook.datastore_wordcount_it_test.DatastoreWordCountIT) ... SKIP: This test still needs to be fixed on Python 3TODO: BEAM-4543
test_avro_it (apache_beam.examples.fastavro_it_test.FastavroIT) ... SKIP: Due to a known issue in avro-python3 package, thistest is skipped until BEAM-6522 is addressed. 
test_bigquery_tornadoes_it (apache_beam.examples.cookbook.bigquery_tornadoes_it_test.BigqueryTornadoesIT) ... ok
test_wordcount_fnapi_it (apache_beam.examples.wordcount_it_test.WordCountIT) ... ok
test_streaming_wordcount_it (apache_beam.examples.streaming_wordcount_it_test.StreamingWordCountIT) ... ok
test_autocomplete_it (apache_beam.examples.complete.autocomplete_test.AutocompleteTest) ... ok
test_leader_board_it (apache_beam.examples.complete.game.leader_board_it_test.LeaderBoardIT) ... ok
test_game_stats_it (apache_beam.examples.complete.game.game_stats_it_test.GameStatsIT) ... ok
test_wordcount_it (apache_beam.examples.wordcount_it_test.WordCountIT) ... ok
test_user_score_it (apache_beam.examples.complete.game.user_score_it_test.UserScoreIT) ... ok
test_hourly_team_score_it (apache_beam.examples.complete.game.hourly_team_score_it_test.HourlyTeamScoreIT) ... ok
test_bigquery_read_1M_python (apache_beam.io.gcp.bigquery_io_read_it_test.BigqueryIOReadIT) ... ok
test_multiple_destinations_transform (apache_beam.io.gcp.bigquery_test.BigQueryStreamingInsertTransformIntegrationTests) ... ok
test_datastore_write_limit (apache_beam.io.gcp.datastore_write_it_test.DatastoreWriteIT) ... SKIP: This test still needs to be fixed on Python 3TODO: BEAM-4543
test_copy (apache_beam.io.gcp.gcsio_integration_test.GcsIOIntegrationTest) ... ok
test_copy_batch (apache_beam.io.gcp.gcsio_integration_test.GcsIOIntegrationTest) ... ok
test_copy_batch_kms (apache_beam.io.gcp.gcsio_integration_test.GcsIOIntegrationTest) ... ok
test_copy_batch_rewrite_token (apache_beam.io.gcp.gcsio_integration_test.GcsIOIntegrationTest) ... ok
test_copy_kms (apache_beam.io.gcp.gcsio_integration_test.GcsIOIntegrationTest) ... ok
test_copy_rewrite_token (apache_beam.io.gcp.gcsio_integration_test.GcsIOIntegrationTest) ... ok
test_value_provider_transform (apache_beam.io.gcp.bigquery_test.BigQueryStreamingInsertTransformIntegrationTests) ... ok
test_bqfl_streaming (apache_beam.io.gcp.bigquery_file_loads_test.BigQueryFileLoadsIT) ... SKIP: TestStream is not supported on TestDataflowRunner
test_multiple_destinations_transform (apache_beam.io.gcp.bigquery_file_loads_test.BigQueryFileLoadsIT) ... ok
test_one_job_fails_all_jobs_fail (apache_beam.io.gcp.bigquery_file_loads_test.BigQueryFileLoadsIT) ... ok
test_big_query_read (apache_beam.io.gcp.bigquery_read_it_test.BigQueryReadIntegrationTests) ... ok
test_big_query_read_new_types (apache_beam.io.gcp.bigquery_read_it_test.BigQueryReadIntegrationTests) ... ok
test_transform_on_gcs (apache_beam.io.fileio_test.MatchIntegrationTest) ... ok
test_file_loads (apache_beam.io.gcp.bigquery_test.PubSubBigQueryIT) ... SKIP: https://issuetracker.google.com/issues/118375066
test_streaming_inserts (apache_beam.io.gcp.bigquery_test.PubSubBigQueryIT) ... ok
test_parquetio_it (apache_beam.io.parquetio_it_test.TestParquetIT) ... ok
test_big_query_legacy_sql (apache_beam.io.gcp.big_query_query_to_table_it_test.BigQueryQueryToTableIT) ... ok
test_big_query_new_types (apache_beam.io.gcp.big_query_query_to_table_it_test.BigQueryQueryToTableIT) ... ok
test_big_query_standard_sql (apache_beam.io.gcp.big_query_query_to_table_it_test.BigQueryQueryToTableIT) ... ok
test_big_query_standard_sql_kms_key_native (apache_beam.io.gcp.big_query_query_to_table_it_test.BigQueryQueryToTableIT) ... ok
test_streaming_data_only (apache_beam.io.gcp.pubsub_integration_test.PubSubIntegrationTest) ... ok
test_streaming_with_attributes (apache_beam.io.gcp.pubsub_integration_test.PubSubIntegrationTest) ... ok
Runs streaming Dataflow job and verifies that user metrics are reported ... ok
test_job_python_from_python_it (apache_beam.transforms.external_test_it.ExternalTransformIT) ... ok
test_big_query_write (apache_beam.io.gcp.bigquery_write_it_test.BigQueryWriteIntegrationTests) ... ok
test_big_query_write_new_types (apache_beam.io.gcp.bigquery_write_it_test.BigQueryWriteIntegrationTests) ... ok
test_big_query_write_schema_autodetect (apache_beam.io.gcp.bigquery_write_it_test.BigQueryWriteIntegrationTests) ... SKIP: DataflowRunner does not support schema autodetection
test_big_query_write_without_schema (apache_beam.io.gcp.bigquery_write_it_test.BigQueryWriteIntegrationTests) ... ok
test_metrics_fnapi_it (apache_beam.runners.dataflow.dataflow_exercise_metrics_pipeline_test.ExerciseMetricsPipelineTest) ... ok
test_metrics_it (apache_beam.runners.dataflow.dataflow_exercise_metrics_pipeline_test.ExerciseMetricsPipelineTest) ... ok
test_datastore_write_limit (apache_beam.io.gcp.datastore.v1new.datastore_write_it_test.DatastoreWriteIT) ... ok

----------------------------------------------------------------------
XML: nosetests-postCommitIT-df-py35.xml
----------------------------------------------------------------------
XML: <https://builds.apache.org/job/beam_PostCommit_Python35/ws/src/sdks/python/nosetests.xml>
----------------------------------------------------------------------
Ran 45 tests in 3133.957s

OK (SKIP=6)

FAILURE: Build failed with an exception.

* Where:
Build file '<https://builds.apache.org/job/beam_PostCommit_Python35/ws/src/sdks/python/test-suites/direct/py35/build.gradle'> line: 51

* What went wrong:
Execution failed for task ':sdks:python:test-suites:direct:py35:postCommitIT'.
> Process 'command 'sh'' finished with non-zero exit value 1

* Try:
Run with --stacktrace option to get the stack trace. Run with --info or --debug option to get more log output. Run with --scan to get full insights.

* Get more help at https://help.gradle.org

Deprecated Gradle features were used in this build, making it incompatible with Gradle 6.0.
Use '--warning-mode all' to show the individual deprecation warnings.
See https://docs.gradle.org/5.2.1/userguide/command_line_interface.html#sec:command_line_warnings

BUILD FAILED in 53m 24s
83 actionable tasks: 62 executed, 21 from cache

Publishing build scan...
https://gradle.com/s/qtnz2baquyr7g

Build step 'Invoke Gradle script' changed build result to FAILURE
Build step 'Invoke Gradle script' marked build as failure

---------------------------------------------------------------------
To unsubscribe, e-mail: builds-unsubscribe@beam.apache.org
For additional commands, e-mail: builds-help@beam.apache.org


Jenkins build is back to normal : beam_PostCommit_Python35 #1062

Posted by Apache Jenkins Server <je...@builds.apache.org>.
See <https://builds.apache.org/job/beam_PostCommit_Python35/1062/display/redirect?page=changes>


---------------------------------------------------------------------
To unsubscribe, e-mail: builds-unsubscribe@beam.apache.org
For additional commands, e-mail: builds-help@beam.apache.org