You are viewing a plain text version of this content. The canonical link for it is here.
Posted to builds@beam.apache.org by Apache Jenkins Server <je...@builds.apache.org> on 2019/03/31 06:33:29 UTC
Build failed in Jenkins: beam_PreCommit_Website_Stage_GCS_Cron #701
See <https://builds.apache.org/job/beam_PreCommit_Website_Stage_GCS_Cron/701/display/redirect>
------------------------------------------
Started by timer
[EnvInject] - Loading node environment variables.
Building remotely on beam11 (beam) in workspace <https://builds.apache.org/job/beam_PreCommit_Website_Stage_GCS_Cron/ws/>
No credentials specified
> git rev-parse --is-inside-work-tree # timeout=10
Fetching changes from the remote Git repository
> git config remote.origin.url https://github.com/apache/beam.git # timeout=10
Fetching upstream changes from https://github.com/apache/beam.git
> git --version # timeout=10
> git fetch --tags --progress https://github.com/apache/beam.git +refs/heads/*:refs/remotes/origin/* +refs/pull/${ghprbPullId}/*:refs/remotes/origin/pr/${ghprbPullId}/*
> git rev-parse origin/master^{commit} # timeout=10
Checking out Revision e5601fc622cd9c29b90f4af3c067275415dbcfba (origin/master)
> git config core.sparsecheckout # timeout=10
> git checkout -f e5601fc622cd9c29b90f4af3c067275415dbcfba
Commit message: "Merge pull request #7901: [BEAM-6715] Fix minor GCS path issue in Gradle defaults for Dataflow runner tests"
> git rev-list --no-walk e5601fc622cd9c29b90f4af3c067275415dbcfba # timeout=10
Cleaning workspace
> git rev-parse --verify HEAD # timeout=10
Resetting working tree
> git reset --hard # timeout=10
> git clean -fdx # timeout=10
[EnvInject] - Executing scripts and injecting environment variables after the SCM step.
[EnvInject] - Injecting as environment variables the properties content
SPARK_LOCAL_IP=127.0.0.1
[EnvInject] - Variables injected successfully.
[Gradle] - Launching build.
[src] $ <https://builds.apache.org/job/beam_PreCommit_Website_Stage_GCS_Cron/ws/src/gradlew> --continue --max-workers=12 -Dorg.gradle.jvmargs=-Xms2g -Dorg.gradle.jvmargs=-Xmx4g :beam-website:stageWebsite
To honour the JVM settings for this build a new JVM will be forked. Please consider using the daemon: https://docs.gradle.org/5.2.1/userguide/gradle_daemon.html.
Daemon will be stopped at the end of the build stopping after processing
> Task :buildSrc:compileJava NO-SOURCE
> Task :buildSrc:compileGroovy FROM-CACHE
> Task :buildSrc:pluginDescriptors
> Task :buildSrc:processResources
> Task :buildSrc:classes
> Task :buildSrc:jar
> Task :buildSrc:assemble
> Task :buildSrc:spotlessGroovy
> Task :buildSrc:spotlessGroovyCheck
> Task :buildSrc:spotlessGroovyGradle
> Task :buildSrc:spotlessGroovyGradleCheck
> Task :buildSrc:spotlessCheck
> Task :buildSrc:pluginUnderTestMetadata
> Task :buildSrc:compileTestJava NO-SOURCE
> Task :buildSrc:compileTestGroovy NO-SOURCE
> Task :buildSrc:processTestResources NO-SOURCE
> Task :buildSrc:testClasses UP-TO-DATE
> Task :buildSrc:test NO-SOURCE
> Task :buildSrc:validateTaskProperties FROM-CACHE
> Task :buildSrc:check
> Task :buildSrc:build
Configuration on demand is an incubating feature.
> Task :beam-website:setupBuildDir
> Task :beam-website:buildDockerImage
Sending build context to Docker daemon 26.45MB
Step 1/7 : FROM ruby:2.5
---> e86557c9a8ab
Step 2/7 : WORKDIR /ruby
---> Using cache
---> afc128c90c69
Step 3/7 : RUN gem install bundler
---> Running in cd9c12c59388
grpc: the connection is unavailable
> Task :beam-website:buildDockerImage FAILED
> Task :beam-website:setupVirtualenv
New python executable in <https://builds.apache.org/job/beam_PreCommit_Website_Stage_GCS_Cron/ws/src/build/website/gradleenv/bin/python2>
Also creating executable in <https://builds.apache.org/job/beam_PreCommit_Website_Stage_GCS_Cron/ws/src/build/website/gradleenv/bin/python>
Installing setuptools, pkg_resources, pip, wheel...done.
Running virtualenv with interpreter /usr/bin/python2
DEPRECATION: Python 2.7 will reach the end of its life on January 1st, 2020. Please upgrade your Python as Python 2.7 won't be maintained after that date. A future version of pip will drop support for Python 2.7.
Collecting beautifulsoup4
Using cached https://files.pythonhosted.org/packages/8b/0e/048a2f88bc4be5e3697df9dc1f7b9d5c9c75be62676feeeb91d2e896c5ea/beautifulsoup4-4.7.1-py2-none-any.whl
Collecting soupsieve>=1.2 (from beautifulsoup4)
Using cached https://files.pythonhosted.org/packages/c9/f8/e54b1d771ed4fab66b3fa1c178e137a3c73d84fb6f64329bddf0da5a371c/soupsieve-1.9-py2.py3-none-any.whl
Collecting backports.functools-lru-cache; python_version < "3" (from soupsieve>=1.2->beautifulsoup4)
Using cached https://files.pythonhosted.org/packages/03/8e/2424c0e65c4a066e28f539364deee49b6451f8fcd4f718fefa50cc3dcf48/backports.functools_lru_cache-1.5-py2.py3-none-any.whl
Installing collected packages: backports.functools-lru-cache, soupsieve, beautifulsoup4
Successfully installed backports.functools-lru-cache-1.5 beautifulsoup4-4.7.1 soupsieve-1.9
FAILURE: Build failed with an exception.
* What went wrong:
Execution failed for task ':beam-website:buildDockerImage'.
> Process 'command 'docker'' finished with non-zero exit value 1
* Try:
Run with --stacktrace option to get the stack trace. Run with --info or --debug option to get more log output. Run with --scan to get full insights.
* Get more help at https://help.gradle.org
BUILD FAILED in 17s
3 actionable tasks: 3 executed
Publishing build scan...
https://gradle.com/s/wopzsvsqlycwu
Build step 'Invoke Gradle script' changed build result to FAILURE
Build step 'Invoke Gradle script' marked build as failure
---------------------------------------------------------------------
To unsubscribe, e-mail: builds-unsubscribe@beam.apache.org
For additional commands, e-mail: builds-help@beam.apache.org
Jenkins build is back to normal :
beam_PreCommit_Website_Stage_GCS_Cron #702
Posted by Apache Jenkins Server <je...@builds.apache.org>.
See <https://builds.apache.org/job/beam_PreCommit_Website_Stage_GCS_Cron/702/display/redirect>
---------------------------------------------------------------------
To unsubscribe, e-mail: builds-unsubscribe@beam.apache.org
For additional commands, e-mail: builds-help@beam.apache.org