You are viewing a plain text version of this content. The canonical link for it is here.
Posted to dev@lucene.apache.org by Policeman Jenkins Server <je...@thetaphi.de> on 2015/10/05 14:32:33 UTC

[JENKINS] Lucene-Solr-5.x-Windows (64bit/jdk1.7.0_80) - Build # 5178 - Failure!

Build: http://jenkins.thetaphi.de/job/Lucene-Solr-5.x-Windows/5178/
Java: 64bit/jdk1.7.0_80 -XX:+UseCompressedOops -XX:+UseSerialGC

1 tests failed.
FAILED:  org.apache.lucene.store.TestNativeFSLockFactory.testStressLocks

Error Message:
IndexWriter hit unexpected exceptions

Stack Trace:
java.lang.AssertionError: IndexWriter hit unexpected exceptions
	at __randomizedtesting.SeedInfo.seed([91588621BD830FAD:CF69C8DCA12FC7CB]:0)
	at org.junit.Assert.fail(Assert.java:93)
	at org.junit.Assert.assertTrue(Assert.java:43)
	at org.apache.lucene.store.BaseLockFactoryTestCase.testStressLocks(BaseLockFactoryTestCase.java:175)
	at sun.reflect.NativeMethodAccessorImpl.invoke0(Native Method)
	at sun.reflect.NativeMethodAccessorImpl.invoke(NativeMethodAccessorImpl.java:57)
	at sun.reflect.DelegatingMethodAccessorImpl.invoke(DelegatingMethodAccessorImpl.java:43)
	at java.lang.reflect.Method.invoke(Method.java:606)
	at com.carrotsearch.randomizedtesting.RandomizedRunner.invoke(RandomizedRunner.java:1665)
	at com.carrotsearch.randomizedtesting.RandomizedRunner$8.evaluate(RandomizedRunner.java:864)
	at com.carrotsearch.randomizedtesting.RandomizedRunner$9.evaluate(RandomizedRunner.java:900)
	at com.carrotsearch.randomizedtesting.RandomizedRunner$10.evaluate(RandomizedRunner.java:914)
	at org.apache.lucene.util.TestRuleSetupTeardownChained$1.evaluate(TestRuleSetupTeardownChained.java:50)
	at org.apache.lucene.util.AbstractBeforeAfterRule$1.evaluate(AbstractBeforeAfterRule.java:46)
	at org.apache.lucene.util.TestRuleThreadAndTestName$1.evaluate(TestRuleThreadAndTestName.java:49)
	at org.apache.lucene.util.TestRuleIgnoreAfterMaxFailures$1.evaluate(TestRuleIgnoreAfterMaxFailures.java:65)
	at org.apache.lucene.util.TestRuleMarkFailure$1.evaluate(TestRuleMarkFailure.java:48)
	at com.carrotsearch.randomizedtesting.rules.StatementAdapter.evaluate(StatementAdapter.java:36)
	at com.carrotsearch.randomizedtesting.ThreadLeakControl$StatementRunner.run(ThreadLeakControl.java:367)
	at com.carrotsearch.randomizedtesting.ThreadLeakControl.forkTimeoutingTask(ThreadLeakControl.java:809)
	at com.carrotsearch.randomizedtesting.ThreadLeakControl$3.evaluate(ThreadLeakControl.java:460)
	at com.carrotsearch.randomizedtesting.RandomizedRunner.runSingleTest(RandomizedRunner.java:873)
	at com.carrotsearch.randomizedtesting.RandomizedRunner$5.evaluate(RandomizedRunner.java:775)
	at com.carrotsearch.randomizedtesting.RandomizedRunner$6.evaluate(RandomizedRunner.java:809)
	at com.carrotsearch.randomizedtesting.RandomizedRunner$7.evaluate(RandomizedRunner.java:820)
	at org.apache.lucene.util.AbstractBeforeAfterRule$1.evaluate(AbstractBeforeAfterRule.java:46)
	at com.carrotsearch.randomizedtesting.rules.StatementAdapter.evaluate(StatementAdapter.java:36)
	at org.apache.lucene.util.TestRuleStoreClassName$1.evaluate(TestRuleStoreClassName.java:42)
	at com.carrotsearch.randomizedtesting.rules.NoShadowingOrOverridesOnMethodsRule$1.evaluate(NoShadowingOrOverridesOnMethodsRule.java:39)
	at com.carrotsearch.randomizedtesting.rules.NoShadowingOrOverridesOnMethodsRule$1.evaluate(NoShadowingOrOverridesOnMethodsRule.java:39)
	at com.carrotsearch.randomizedtesting.rules.StatementAdapter.evaluate(StatementAdapter.java:36)
	at com.carrotsearch.randomizedtesting.rules.StatementAdapter.evaluate(StatementAdapter.java:36)
	at com.carrotsearch.randomizedtesting.rules.StatementAdapter.evaluate(StatementAdapter.java:36)
	at org.apache.lucene.util.TestRuleAssertionsRequired$1.evaluate(TestRuleAssertionsRequired.java:54)
	at org.apache.lucene.util.TestRuleMarkFailure$1.evaluate(TestRuleMarkFailure.java:48)
	at org.apache.lucene.util.TestRuleIgnoreAfterMaxFailures$1.evaluate(TestRuleIgnoreAfterMaxFailures.java:65)
	at org.apache.lucene.util.TestRuleIgnoreTestSuites$1.evaluate(TestRuleIgnoreTestSuites.java:55)
	at com.carrotsearch.randomizedtesting.rules.StatementAdapter.evaluate(StatementAdapter.java:36)
	at com.carrotsearch.randomizedtesting.ThreadLeakControl$StatementRunner.run(ThreadLeakControl.java:367)
	at java.lang.Thread.run(Thread.java:745)




Build Log:
[...truncated 1050 lines...]
   [junit4] Suite: org.apache.lucene.store.TestNativeFSLockFactory
   [junit4]   1> Stress Test Index Writer: creation hit unexpected exception: java.io.FileNotFoundException: segments_8 in dir=MMapDirectory@C:\Users\JenkinsSlave\workspace\Lucene-Solr-5.x-Windows\lucene\build\core\test\J1\temp\lucene.store.TestNativeFSLockFactory_91588621BD830FAD-001\tempDir-009 lockFactory=org.apache.lucene.store.NativeFSLockFactory@343dd4b6
   [junit4]   1> java.io.FileNotFoundException: segments_8 in dir=MMapDirectory@C:\Users\JenkinsSlave\workspace\Lucene-Solr-5.x-Windows\lucene\build\core\test\J1\temp\lucene.store.TestNativeFSLockFactory_91588621BD830FAD-001\tempDir-009 lockFactory=org.apache.lucene.store.NativeFSLockFactory@343dd4b6
   [junit4]   1> 	at org.apache.lucene.store.MockDirectoryWrapper.openInput(MockDirectoryWrapper.java:641)
   [junit4]   1> 	at org.apache.lucene.store.Directory.openChecksumInput(Directory.java:109)
   [junit4]   1> 	at org.apache.lucene.store.MockDirectoryWrapper.openChecksumInput(MockDirectoryWrapper.java:1009)
   [junit4]   1> 	at org.apache.lucene.index.SegmentInfos.readCommit(SegmentInfos.java:294)
   [junit4]   1> 	at org.apache.lucene.index.IndexFileDeleter.<init>(IndexFileDeleter.java:171)
   [junit4]   1> 	at org.apache.lucene.index.IndexWriter.<init>(IndexWriter.java:948)
   [junit4]   1> 	at org.apache.lucene.store.BaseLockFactoryTestCase$WriterThread.run(BaseLockFactoryTestCase.java:225)
   [junit4]   1> IFD 108 [2015-10-05T12:30:05.505Z; Thread-366]: init: current segments file is "segments_9"; deletionPolicy=org.apache.lucene.index.KeepOnlyLastCommitDeletionPolicy@1e6c1ee
   [junit4]   1> IFD 108 [2015-10-05T12:30:05.505Z; Thread-366]: init: load commit "segments_9"
   [junit4]   1> IFD 108 [2015-10-05T12:30:05.545Z; Thread-366]: init: load commit "segments_8"
   [junit4]   1> IW 108 [2015-10-05T12:30:05.546Z; Thread-366]: init: hit exception on init; releasing write lock
   [junit4]   1> 
   [junit4]   2> NOTE: reproduce with: ant test  -Dtestcase=TestNativeFSLockFactory -Dtests.method=testStressLocks -Dtests.seed=91588621BD830FAD -Dtests.slow=true -Dtests.locale=en_SG -Dtests.timezone=America/Menominee -Dtests.asserts=true -Dtests.file.encoding=ISO-8859-1
   [junit4] FAILURE 2.22s J1 | TestNativeFSLockFactory.testStressLocks <<<
   [junit4]    > Throwable #1: java.lang.AssertionError: IndexWriter hit unexpected exceptions
   [junit4]    > 	at __randomizedtesting.SeedInfo.seed([91588621BD830FAD:CF69C8DCA12FC7CB]:0)
   [junit4]    > 	at org.apache.lucene.store.BaseLockFactoryTestCase.testStressLocks(BaseLockFactoryTestCase.java:175)
   [junit4]    > 	at java.lang.Thread.run(Thread.java:745)
   [junit4]   2> NOTE: leaving temporary files on disk at: C:\Users\JenkinsSlave\workspace\Lucene-Solr-5.x-Windows\lucene\build\core\test\J1\temp\lucene.store.TestNativeFSLockFactory_91588621BD830FAD-001
   [junit4]   2> NOTE: test params are: codec=Asserting(Lucene53): {content=PostingsFormat(name=LuceneVarGapDocFreqInterval)}, docValues:{}, sim=DefaultSimilarity, locale=en_SG, timezone=America/Menominee
   [junit4]   2> NOTE: Windows 7 6.1 amd64/Oracle Corporation 1.7.0_80 (64-bit)/cpus=3,threads=1,free=64853728,total=87719936
   [junit4]   2> NOTE: All tests run in this JVM: [TestMultiTermQueryRewrites, TestNumericUtils, TestPackedInts, TestSearcherManager, TestReadOnlyIndex, TestBagOfPostings, TestStressAdvance, TestNIOFSDirectory, TestMultiDocValues, Test2BSortedDocValuesOrds, TestCrash, TestConsistentFieldNumbers, TestForTooMuchCloning, Test2BSortedDocValuesFixedSorted, Test2BNumericDocValues, TestBooleanScorer, TestCrashCausesCorruptIndex, TestBlockPostingsFormat2, TestTermVectors, Test2BBinaryDocValues, TestDocIdSetBuilder, TestDocumentWriter, TestNamedSPILoader, TestPrefixQuery, TestSegmentTermDocs, TestNGramPhraseQuery, TestOfflineSorter, Test2BTerms, TestSingleInstanceLockFactory, TestLockFactory, TestIndexCommit, TestDocumentsWriterStallControl, TestGrowableByteArrayDataOutput, TestOperations, TestVersion, TestMultiMMap, TestPriorityQueue, TestSpanExplanations, TestTopFieldCollector, TestDeterminism, TestStressIndexing, TestIndexFileDeleter, TestSimilarity2, TestTryDelete, TestAllFilesHaveChecksumFooter, TestDisjunctionMaxQuery, TestLongPostings, TestPersistentSnapshotDeletionPolicy, TestBitDocIdSetBuilder, TestTermRangeQuery, TestFastCompressionMode, TestPostingsOffsets, TestNumericDocValuesUpdates, TestIndexWriterReader, TestEarlyTermination, TestLucene50SegmentInfoFormat, TestCharsRefBuilder, Test2BPostings, TestSortRescorer, TestBytesRef, TestNRTCachingDirectory, TestSmallFloat, TestControlledRealTimeReopenThread, TestPhrasePrefixQuery, TestRoaringDocIdSet, TestDirectPacked, TestIntArrayDocIdSet, TestIndexWriterForceMerge, TestUsageTrackingFilterCachingPolicy, TestLucene53NormsFormat, TestSpanFirstQuery, TestNativeFSLockFactory]
   [junit4] Completed [177/409] on J1 in 12.92s, 10 tests, 1 failure <<< FAILURES!

[...truncated 768 lines...]
BUILD FAILED
C:\Users\JenkinsSlave\workspace\Lucene-Solr-5.x-Windows\build.xml:785: The following error occurred while executing this line:
C:\Users\JenkinsSlave\workspace\Lucene-Solr-5.x-Windows\build.xml:729: The following error occurred while executing this line:
C:\Users\JenkinsSlave\workspace\Lucene-Solr-5.x-Windows\build.xml:59: The following error occurred while executing this line:
C:\Users\JenkinsSlave\workspace\Lucene-Solr-5.x-Windows\lucene\build.xml:50: The following error occurred while executing this line:
C:\Users\JenkinsSlave\workspace\Lucene-Solr-5.x-Windows\lucene\common-build.xml:1452: The following error occurred while executing this line:
C:\Users\JenkinsSlave\workspace\Lucene-Solr-5.x-Windows\lucene\common-build.xml:1006: There were test failures: 409 suites (1 ignored), 3299 tests, 1 failure, 57 ignored (53 assumptions) [seed: 91588621BD830FAD]

Total time: 6 minutes 6 seconds
Build step 'Invoke Ant' marked build as failure
Archiving artifacts
[WARNINGS] Skipping publisher since build result is FAILURE
Recording test results
Email was triggered for: Failure - Any
Sending email for trigger: Failure - Any