You are viewing a plain text version of this content. The canonical link for it is here.
Posted to notifications@maven.apache.org by Apache Jenkins Server <je...@builds.apache.org> on 2020/09/19 08:15:06 UTC
Build failed in Jenkins: Maven » Maven TLP » maven-surefire » base64 #13
See https://ci-builds.apache.org/job/Maven/job/maven-box/job/maven-surefire/job/base64/13/
Changes:
* fixed old unit tests
All tests passed
Build log:
[...truncated 6359 lines...]
[2020-09-19T08:14:56.117Z] [INFO] Installing C:\Users\jenkins\AppData\Local\Temp\jenkins-Maven-maven-box-maven-surefire-base64-13\surefire-extensions-api\pom.xml to C:\Users\jenkins\AppData\Local\Temp\jenkins-Maven-maven-box-maven-surefire-base64-13\.m2\org\apache\maven\surefire\surefire-extensions-api\3.0.0-M6-SNAPSHOT\surefire-extensions-api-3.0.0-M6-SNAPSHOT.pom
[2020-09-19T08:14:56.118Z] [INFO]
[2020-09-19T08:14:56.118Z] [INFO] ---------< org.apache.maven.surefire:surefire-extensions-spi >----------
[2020-09-19T08:14:56.119Z] [INFO] Building Surefire Extensions SPI 3.0.0-M6-SNAPSHOT [5/26]
[2020-09-19T08:14:56.119Z] [INFO] --------------------------------[ jar ]---------------------------------
[2020-09-19T08:14:56.120Z] [INFO]
[2020-09-19T08:14:56.120Z] [INFO] --- maven-clean-plugin:3.1.0:clean (default-clean) @ surefire-extensions-spi ---
[2020-09-19T08:14:56.121Z] [INFO]
[2020-09-19T08:14:56.121Z] [INFO] --- maven-enforcer-plugin:3.0.0-M3:enforce (enforce-maven-version) @ surefire-extensions-spi ---
[2020-09-19T08:14:56.122Z] [INFO]
[2020-09-19T08:14:56.122Z] [INFO] --- maven-enforcer-plugin:3.0.0-M3:enforce (enforce-bytecode-version) @ surefire-extensions-spi ---
[2020-09-19T08:14:56.122Z] [INFO] Adding ignore: module-info
[2020-09-19T08:14:56.123Z] [INFO]
[2020-09-19T08:14:56.123Z] [INFO] --- maven-enforcer-plugin:3.0.0-M3:enforce (enforce-java) @ surefire-extensions-spi ---
[2020-09-19T08:14:56.124Z] [INFO]
[2020-09-19T08:14:56.124Z] [INFO] --- maven-enforcer-plugin:3.0.0-M3:enforce (enforce-maven) @ surefire-extensions-spi ---
[2020-09-19T08:14:56.125Z] [INFO]
[2020-09-19T08:14:56.125Z] [INFO] --- apache-rat-plugin:0.13:check (rat-check) @ surefire-extensions-spi ---
[2020-09-19T08:14:56.125Z] [INFO] Enabled default license matchers.
[2020-09-19T08:14:56.126Z] [INFO] Will parse SCM ignores for exclusions...
[2020-09-19T08:14:56.126Z] [INFO] Finished adding exclusions from SCM ignore files.
[2020-09-19T08:14:56.126Z] [INFO] 62 implicit excludes (use -debug for more details).
[2020-09-19T08:14:56.127Z] [INFO] 27 explicit excludes (use -debug for more details).
[2020-09-19T08:14:56.127Z] [INFO] 2 resources included (use -debug for more details)
[2020-09-19T08:14:56.127Z] [INFO] Rat check: Summary over all files. Unapproved: 0, unknown: 0, generated: 0, approved: 2 licenses.
[2020-09-19T08:14:56.128Z] [INFO]
[2020-09-19T08:14:56.128Z] [INFO] --- maven-compiler-plugin:3.8.1:compile (compile-generated) @ surefire-extensions-spi ---
[2020-09-19T08:14:56.128Z] [INFO] Nothing to compile - all classes are up to date
[2020-09-19T08:14:56.129Z] [INFO]
[2020-09-19T08:14:56.129Z] [INFO] --- maven-remote-resources-plugin:1.7.0:process (process-resource-bundles) @ surefire-extensions-spi ---
[2020-09-19T08:14:56.129Z] [INFO] Preparing remote bundle org.apache:apache-jar-resource-bundle:1.4
[2020-09-19T08:14:56.129Z] [INFO] Copying 3 resources from 1 bundle.
[2020-09-19T08:14:56.130Z] [INFO]
[2020-09-19T08:14:56.130Z] [INFO] --- maven-resources-plugin:3.1.0:resources (default-resources) @ surefire-extensions-spi ---
[2020-09-19T08:14:56.130Z] [INFO] Using 'UTF-8' encoding to copy filtered resources.
[2020-09-19T08:14:56.131Z] [INFO] skip non existing resourceDirectory C:\Users\jenkins\AppData\Local\Temp\jenkins-Maven-maven-box-maven-surefire-base64-13\surefire-extensions-spi\src\main\resources
[2020-09-19T08:14:56.131Z] [INFO] Copying 3 resources
[2020-09-19T08:14:56.131Z] [INFO]
[2020-09-19T08:14:56.132Z] [INFO] --- maven-compiler-plugin:3.8.1:compile (default-compile) @ surefire-extensions-spi ---
[2020-09-19T08:14:56.464Z] [INFO] Changes detected - recompiling the module!
[2020-09-19T08:14:56.465Z] [INFO] Compiling 1 source file to C:\Users\jenkins\AppData\Local\Temp\jenkins-Maven-maven-box-maven-surefire-base64-13\surefire-extensions-spi\target\classes
[2020-09-19T08:14:57.239Z] [INFO]
[2020-09-19T08:14:57.240Z] [INFO] --- animal-sniffer-maven-plugin:1.17:check (signature-check) @ surefire-extensions-spi ---
[2020-09-19T08:14:57.240Z] [INFO] Checking unresolved references to org.codehaus.mojo.signature:java17:1.0
[2020-09-19T08:14:57.574Z] [INFO]
[2020-09-19T08:14:57.574Z] [INFO] --- maven-resources-plugin:3.1.0:testResources (default-testResources) @ surefire-extensions-spi ---
[2020-09-19T08:14:57.575Z] [INFO] Using 'UTF-8' encoding to copy filtered resources.
[2020-09-19T08:14:57.575Z] [INFO] skip non existing resourceDirectory C:\Users\jenkins\AppData\Local\Temp\jenkins-Maven-maven-box-maven-surefire-base64-13\surefire-extensions-spi\src\test\resources
[2020-09-19T08:14:57.575Z] [INFO] Copying 3 resources
[2020-09-19T08:14:57.576Z] [INFO]
[2020-09-19T08:14:57.576Z] [INFO] --- maven-compiler-plugin:3.8.1:testCompile (default-testCompile) @ surefire-extensions-spi ---
[2020-09-19T08:14:57.577Z] [INFO] No sources to compile
[2020-09-19T08:14:57.577Z] [INFO]
[2020-09-19T08:14:57.577Z] [INFO] --- maven-surefire-plugin:3.0.0-M4:test (default-test) @ surefire-extensions-spi ---
[2020-09-19T08:14:57.578Z] [INFO]
[2020-09-19T08:14:57.578Z] [INFO] --- maven-jar-plugin:3.2.0:jar (default-jar) @ surefire-extensions-spi ---
[2020-09-19T08:14:57.578Z] [INFO] Building jar: C:\Users\jenkins\AppData\Local\Temp\jenkins-Maven-maven-box-maven-surefire-base64-13\surefire-extensions-spi\target\surefire-extensions-spi-3.0.0-M6-SNAPSHOT.jar
[2020-09-19T08:14:57.579Z] [INFO]
[2020-09-19T08:14:57.579Z] [INFO] --- maven-site-plugin:3.8.2:attach-descriptor (attach-descriptor) @ surefire-extensions-spi ---
[2020-09-19T08:14:57.580Z] [INFO] Skipping because packaging 'jar' is not pom.
[2020-09-19T08:14:57.580Z] [INFO]
[2020-09-19T08:14:57.580Z] [INFO] --- maven-checkstyle-plugin:3.0.0:check (checkstyle-check) @ surefire-extensions-spi ---
[2020-09-19T08:14:58.298Z] [INFO]
[2020-09-19T08:14:58.299Z] [INFO] --- maven-install-plugin:2.5.2:install (default-install) @ surefire-extensions-spi ---
[2020-09-19T08:14:58.299Z] [INFO] Installing C:\Users\jenkins\AppData\Local\Temp\jenkins-Maven-maven-box-maven-surefire-base64-13\surefire-extensions-spi\target\surefire-extensions-spi-3.0.0-M6-SNAPSHOT.jar to C:\Users\jenkins\AppData\Local\Temp\jenkins-Maven-maven-box-maven-surefire-base64-13\.m2\org\apache\maven\surefire\surefire-extensions-spi\3.0.0-M6-SNAPSHOT\surefire-extensions-spi-3.0.0-M6-SNAPSHOT.jar
[2020-09-19T08:14:58.300Z] [INFO] Installing C:\Users\jenkins\AppData\Local\Temp\jenkins-Maven-maven-box-maven-surefire-base64-13\surefire-extensions-spi\pom.xml to C:\Users\jenkins\AppData\Local\Temp\jenkins-Maven-maven-box-maven-surefire-base64-13\.m2\org\apache\maven\surefire\surefire-extensions-spi\3.0.0-M6-SNAPSHOT\surefire-extensions-spi-3.0.0-M6-SNAPSHOT.pom
[2020-09-19T08:14:58.300Z] [INFO]
[2020-09-19T08:14:58.300Z] [INFO] -------------< org.apache.maven.surefire:surefire-booter >--------------
[2020-09-19T08:14:58.301Z] [INFO] Building SureFire Booter 3.0.0-M6-SNAPSHOT [6/26]
[2020-09-19T08:14:58.301Z] [INFO] --------------------------------[ jar ]---------------------------------
[2020-09-19T08:14:59.014Z] [INFO]
[2020-09-19T08:14:59.015Z] [INFO] --- maven-clean-plugin:3.1.0:clean (default-clean) @ surefire-booter ---
[2020-09-19T08:14:59.015Z] [INFO]
[2020-09-19T08:14:59.016Z] [INFO] --- maven-enforcer-plugin:3.0.0-M3:enforce (enforce-maven-version) @ surefire-booter ---
[2020-09-19T08:14:59.016Z] [INFO]
[2020-09-19T08:14:59.016Z] [INFO] --- maven-enforcer-plugin:3.0.0-M3:enforce (enforce-bytecode-version) @ surefire-booter ---
[2020-09-19T08:14:59.017Z] [INFO] Adding ignore: module-info
[2020-09-19T08:14:59.729Z] [INFO]
[2020-09-19T08:14:59.729Z] [INFO] --- maven-enforcer-plugin:3.0.0-M3:enforce (enforce-java) @ surefire-booter ---
[2020-09-19T08:14:59.730Z] [INFO]
[2020-09-19T08:14:59.730Z] [INFO] --- maven-enforcer-plugin:3.0.0-M3:enforce (enforce-maven) @ surefire-booter ---
[2020-09-19T08:14:59.731Z] [INFO]
[2020-09-19T08:14:59.731Z] [INFO] --- apache-rat-plugin:0.13:check (rat-check) @ surefire-booter ---
[2020-09-19T08:14:59.731Z] [INFO] Enabled default license matchers.
[2020-09-19T08:14:59.732Z] [INFO] Will parse SCM ignores for exclusions...
[2020-09-19T08:14:59.732Z] [INFO] Finished adding exclusions from SCM ignore files.
[2020-09-19T08:14:59.732Z] [INFO] 62 implicit excludes (use -debug for more details).
[2020-09-19T08:14:59.733Z] [INFO] 27 explicit excludes (use -debug for more details).
[2020-09-19T08:14:59.733Z] [INFO] 47 resources included (use -debug for more details)
[2020-09-19T08:15:00.065Z] [INFO] Rat check: Summary over all files. Unapproved: 0, unknown: 0, generated: 0, approved: 47 licenses.
[2020-09-19T08:15:00.065Z] [INFO]
[2020-09-19T08:15:00.066Z] [INFO] --- jacoco-maven-plugin:0.8.5:prepare-agent (jacoco-agent) @ surefire-booter ---
[2020-09-19T08:15:00.066Z] [INFO] jacoco.agent set to -javaagent:C:\\Users\\jenkins\\AppData\\Local\\Temp\\jenkins-Maven-maven-box-maven-surefire-base64-13\\.m2\\org\\jacoco\\org.jacoco.agent\\0.8.5\\org.jacoco.agent-0.8.5-runtime.jar=destfile=C:\\Users\\jenkins\\AppData\\Local\\Temp\\jenkins-Maven-maven-box-maven-surefire-base64-13\\surefire-booter\\target\\jacoco.exec,includes=**/failsafe/*:**/failsafe/**/*:**/surefire/*:**/surefire/**/*,excludes=**/HelpMojo.class:**/shadefire/**/*:org/jacoco/**/*:com/vladium/emma/rt/*
[2020-09-19T08:15:00.066Z] [INFO]
[2020-09-19T08:15:00.067Z] [INFO] --- maven-dependency-plugin:3.1.1:build-classpath (build-test-classpath) @ surefire-booter ---
[2020-09-19T08:15:01.801Z] [INFO] Wrote classpath file 'C:\Users\jenkins\AppData\Local\Temp\jenkins-Maven-maven-box-maven-surefire-base64-13\surefire-booter\target\test-classpath\cp.txt'.
[2020-09-19T08:15:01.801Z] [INFO]
[2020-09-19T08:15:01.801Z] [INFO] --- maven-compiler-plugin:3.8.1:compile (compile-generated) @ surefire-booter ---
[2020-09-19T08:15:01.802Z] [INFO] Nothing to compile - all classes are up to date
[2020-09-19T08:15:01.802Z] [INFO]
[2020-09-19T08:15:01.802Z] [INFO] --- maven-remote-resources-plugin:1.7.0:process (process-resource-bundles) @ surefire-booter ---
[2020-09-19T08:15:01.803Z] [INFO] Preparing remote bundle org.apache:apache-jar-resource-bundle:1.4
[2020-09-19T08:15:01.803Z] [INFO] Copying 3 resources from 1 bundle.
[2020-09-19T08:15:02.134Z] [INFO]
[2020-09-19T08:15:02.134Z] [INFO] --- maven-resources-plugin:3.1.0:resources (default-resources) @ surefire-booter ---
[2020-09-19T08:15:02.135Z] [INFO] Using 'UTF-8' encoding to copy filtered resources.
[2020-09-19T08:15:02.135Z] [INFO] Copying 1 resource
[2020-09-19T08:15:02.135Z] [INFO] Copying 3 resources
[2020-09-19T08:15:02.136Z] [INFO]
[2020-09-19T08:15:02.136Z] [INFO] --- maven-compiler-plugin:3.8.1:compile (default-compile) @ surefire-booter ---
[2020-09-19T08:15:02.137Z] [INFO] Changes detected - recompiling the module!
[2020-09-19T08:15:02.137Z] [INFO] Compiling 30 source files to C:\Users\jenkins\AppData\Local\Temp\jenkins-Maven-maven-box-maven-surefire-base64-13\surefire-booter\target\classes
[2020-09-19T08:15:03.288Z] [INFO] -------------------------------------------------------------
[2020-09-19T08:15:03.288Z] [ERROR] COMPILATION ERROR :
[2020-09-19T08:15:03.289Z] [INFO] -------------------------------------------------------------
[2020-09-19T08:15:03.289Z] [ERROR] C:\Users\jenkins\AppData\Local\Temp\jenkins-Maven-maven-box-maven-surefire-base64-13\surefire-booter\src\main\java\org\apache\maven\surefire\booter\spi\LegacyMasterProcessChannelEncoder.java:[66] error: cannot find symbol
[2020-09-19T08:15:03.289Z] symbol: static MAGIC_NUMBER
[2020-09-19T08:15:03.289Z] location: class
[2020-09-19T08:15:03.290Z] [ERROR] C:\Users\jenkins\AppData\Local\Temp\jenkins-Maven-maven-box-maven-surefire-base64-13\surefire-booter\src\main\java\org\apache\maven\surefire\booter\spi\LegacyMasterProcessChannelEncoder.java:[457,21] error: cannot find symbol
[2020-09-19T08:15:03.290Z] symbol: variable MAGIC_NUMBER
[2020-09-19T08:15:03.290Z] location: class LegacyMasterProcessChannelEncoder
[2020-09-19T08:15:03.290Z] [INFO] 2 errors
[2020-09-19T08:15:03.291Z] [INFO] -------------------------------------------------------------
[2020-09-19T08:15:03.291Z] [INFO] ------------------------------------------------------------------------
[2020-09-19T08:15:03.291Z] [INFO] Reactor Summary for Apache Maven Surefire 3.0.0-M6-SNAPSHOT:
[2020-09-19T08:15:03.291Z] [INFO]
[2020-09-19T08:15:03.292Z] [INFO] Apache Maven Surefire .............................. SUCCESS [ 49.662 s]
[2020-09-19T08:15:03.292Z] [INFO] SureFire Logger API ................................ SUCCESS [ 17.282 s]
[2020-09-19T08:15:03.292Z] [INFO] SureFire API ....................................... SUCCESS [ 20.537 s]
[2020-09-19T08:15:03.292Z] [INFO] Surefire Extensions API ............................ SUCCESS [ 6.806 s]
[2020-09-19T08:15:03.293Z] [INFO] Surefire Extensions SPI ............................ SUCCESS [ 2.110 s]
[2020-09-19T08:15:03.293Z] [INFO] SureFire Booter .................................... FAILURE [ 5.079 s]
[2020-09-19T08:15:03.293Z] [INFO] Maven Surefire Test-Grouping Support ............... SKIPPED
[2020-09-19T08:15:03.293Z] [INFO] SureFire Providers ................................. SKIPPED
[2020-09-19T08:15:03.294Z] [INFO] Shared JUnit3 Provider Code ........................ SKIPPED
[2020-09-19T08:15:03.294Z] [INFO] Shared Java 5 Provider Base ........................ SKIPPED
[2020-09-19T08:15:03.294Z] [INFO] Shared JUnit4 Provider Code ........................ SKIPPED
[2020-09-19T08:15:03.295Z] [INFO] Shared JUnit48 Provider Code ....................... SKIPPED
[2020-09-19T08:15:03.295Z] [INFO] SureFire JUnit Runner .............................. SKIPPED
[2020-09-19T08:15:03.295Z] [INFO] SureFire JUnit4 Runner ............................. SKIPPED
[2020-09-19T08:15:03.295Z] [INFO] Maven Surefire Common .............................. SKIPPED
[2020-09-19T08:15:03.296Z] [INFO] SureFire JUnitCore Runner .......................... SKIPPED
[2020-09-19T08:15:03.296Z] [INFO] SureFire JUnit Platform Runner ..................... SKIPPED
[2020-09-19T08:15:03.296Z] [INFO] SureFire TestNG Utils .............................. SKIPPED
[2020-09-19T08:15:03.296Z] [INFO] SureFire TestNG Runner ............................. SKIPPED
[2020-09-19T08:15:03.297Z] [INFO] ShadeFire JUnit3 Provider .......................... SKIPPED
[2020-09-19T08:15:03.297Z] [INFO] Surefire Report Parser ............................. SKIPPED
[2020-09-19T08:15:03.297Z] [INFO] Maven Surefire Plugin .............................. SKIPPED
[2020-09-19T08:15:03.297Z] [INFO] Maven Failsafe Plugin .............................. SKIPPED
[2020-09-19T08:15:03.298Z] [INFO] Maven Surefire Report Plugin ....................... SKIPPED
[2020-09-19T08:15:03.298Z] [INFO] Maven Surefire Integration Tests ................... SKIPPED
[2020-09-19T08:15:03.298Z] [INFO] Surefire Shared Utils .............................. SKIPPED
[2020-09-19T08:15:03.299Z] [INFO] ------------------------------------------------------------------------
[2020-09-19T08:15:03.299Z] [INFO] BUILD FAILURE
[2020-09-19T08:15:03.299Z] [INFO] ------------------------------------------------------------------------
[2020-09-19T08:15:03.299Z] [INFO] Total time: 01:43 min
[2020-09-19T08:15:03.300Z] [INFO] Finished at: 2020-09-19T01:15:03-07:00
[2020-09-19T08:15:03.300Z] [INFO] ------------------------------------------------------------------------
[2020-09-19T08:15:03.300Z] [ERROR] Failed to execute goal org.apache.maven.plugins:maven-compiler-plugin:3.8.1:compile (default-compile) on project surefire-booter: Compilation failure: Compilation failure:
[2020-09-19T08:15:03.301Z] [ERROR] C:\Users\jenkins\AppData\Local\Temp\jenkins-Maven-maven-box-maven-surefire-base64-13\surefire-booter\src\main\java\org\apache\maven\surefire\booter\spi\LegacyMasterProcessChannelEncoder.java:[66] error: cannot find symbol
[2020-09-19T08:15:03.301Z] [ERROR] symbol: static MAGIC_NUMBER
[2020-09-19T08:15:03.301Z] [ERROR] location: class
[2020-09-19T08:15:03.301Z] [ERROR] C:\Users\jenkins\AppData\Local\Temp\jenkins-Maven-maven-box-maven-surefire-base64-13\surefire-booter\src\main\java\org\apache\maven\surefire\booter\spi\LegacyMasterProcessChannelEncoder.java:[457,21] error: cannot find symbol
[2020-09-19T08:15:03.301Z] [ERROR] symbol: variable MAGIC_NUMBER
[2020-09-19T08:15:03.302Z] [ERROR] location: class LegacyMasterProcessChannelEncoder
[2020-09-19T08:15:03.302Z] [ERROR] -> [Help 1]
[2020-09-19T08:15:03.302Z] org.apache.maven.lifecycle.LifecycleExecutionException: Failed to execute goal org.apache.maven.plugins:maven-compiler-plugin:3.8.1:compile (default-compile) on project surefire-booter: Compilation failure
[2020-09-19T08:15:03.302Z] at org.apache.maven.lifecycle.internal.MojoExecutor.execute (MojoExecutor.java:215)
[2020-09-19T08:15:03.302Z] at org.apache.maven.lifecycle.internal.MojoExecutor.execute (MojoExecutor.java:156)
[2020-09-19T08:15:03.302Z] at org.apache.maven.lifecycle.internal.MojoExecutor.execute (MojoExecutor.java:148)
[2020-09-19T08:15:03.303Z] at org.apache.maven.lifecycle.internal.LifecycleModuleBuilder.buildProject (LifecycleModuleBuilder.java:117)
[2020-09-19T08:15:03.303Z] at org.apache.maven.lifecycle.internal.LifecycleModuleBuilder.buildProject (LifecycleModuleBuilder.java:81)
[2020-09-19T08:15:03.303Z] at org.apache.maven.lifecycle.internal.builder.singlethreaded.SingleThreadedBuilder.build (SingleThreadedBuilder.java:56)
[2020-09-19T08:15:03.303Z] at org.apache.maven.lifecycle.internal.LifecycleStarter.execute (LifecycleStarter.java:128)
[2020-09-19T08:15:03.303Z] at org.apache.maven.DefaultMaven.doExecute (DefaultMaven.java:305)
[2020-09-19T08:15:03.303Z] at org.apache.maven.DefaultMaven.doExecute (DefaultMaven.java:192)
[2020-09-19T08:15:03.304Z] at org.apache.maven.DefaultMaven.execute (DefaultMaven.java:105)
[2020-09-19T08:15:03.304Z] at org.apache.maven.cli.MavenCli.execute (MavenCli.java:956)
[2020-09-19T08:15:03.304Z] at org.apache.maven.cli.MavenCli.doMain (MavenCli.java:288)
[2020-09-19T08:15:03.304Z] at org.apache.maven.cli.MavenCli.main (MavenCli.java:192)
[2020-09-19T08:15:03.304Z] at sun.reflect.NativeMethodAccessorImpl.invoke0 (Native Method)
[2020-09-19T08:15:03.304Z] at sun.reflect.NativeMethodAccessorImpl.invoke (NativeMethodAccessorImpl.java:62)
[2020-09-19T08:15:03.305Z] at sun.reflect.DelegatingMethodAccessorImpl.invoke (DelegatingMethodAccessorImpl.java:43)
[2020-09-19T08:15:03.305Z] at java.lang.reflect.Method.invoke (Method.java:498)
[2020-09-19T08:15:03.305Z] at org.codehaus.plexus.classworlds.launcher.Launcher.launchEnhanced (Launcher.java:282)
[2020-09-19T08:15:03.305Z] at org.codehaus.plexus.classworlds.launcher.Launcher.launch (Launcher.java:225)
[2020-09-19T08:15:03.305Z] at org.codehaus.plexus.classworlds.launcher.Launcher.mainWithExitCode (Launcher.java:406)
[2020-09-19T08:15:03.305Z] at org.codehaus.plexus.classworlds.launcher.Launcher.main (Launcher.java:347)
[2020-09-19T08:15:03.306Z] Caused by: org.apache.maven.plugin.compiler.CompilationFailureException: Compilation failure
[2020-09-19T08:15:03.306Z] at org.apache.maven.plugin.compiler.AbstractCompilerMojo.execute (AbstractCompilerMojo.java:1220)
[2020-09-19T08:15:03.306Z] at org.apache.maven.plugin.compiler.CompilerMojo.execute (CompilerMojo.java:187)
[2020-09-19T08:15:03.306Z] at org.apache.maven.plugin.DefaultBuildPluginManager.executeMojo (DefaultBuildPluginManager.java:137)
[2020-09-19T08:15:03.306Z] at org.apache.maven.lifecycle.internal.MojoExecutor.execute (MojoExecutor.java:210)
[2020-09-19T08:15:03.306Z] at org.apache.maven.lifecycle.internal.MojoExecutor.execute (MojoExecutor.java:156)
[2020-09-19T08:15:03.307Z] at org.apache.maven.lifecycle.internal.MojoExecutor.execute (MojoExecutor.java:148)
[2020-09-19T08:15:03.307Z] at org.apache.maven.lifecycle.internal.LifecycleModuleBuilder.buildProject (LifecycleModuleBuilder.java:117)
[2020-09-19T08:15:03.307Z] at org.apache.maven.lifecycle.internal.LifecycleModuleBuilder.buildProject (LifecycleModuleBuilder.java:81)
[2020-09-19T08:15:03.307Z] at org.apache.maven.lifecycle.internal.builder.singlethreaded.SingleThreadedBuilder.build (SingleThreadedBuilder.java:56)
[2020-09-19T08:15:03.307Z] at org.apache.maven.lifecycle.internal.LifecycleStarter.execute (LifecycleStarter.java:128)
[2020-09-19T08:15:03.307Z] at org.apache.maven.DefaultMaven.doExecute (DefaultMaven.java:305)
[2020-09-19T08:15:03.308Z] at org.apache.maven.DefaultMaven.doExecute (DefaultMaven.java:192)
[2020-09-19T08:15:03.308Z] at org.apache.maven.DefaultMaven.execute (DefaultMaven.java:105)
[2020-09-19T08:15:03.308Z] at org.apache.maven.cli.MavenCli.execute (MavenCli.java:956)
[2020-09-19T08:15:03.308Z] at org.apache.maven.cli.MavenCli.doMain (MavenCli.java:288)
[2020-09-19T08:15:03.308Z] at org.apache.maven.cli.MavenCli.main (MavenCli.java:192)
[2020-09-19T08:15:03.308Z] at sun.reflect.NativeMethodAccessorImpl.invoke0 (Native Method)
[2020-09-19T08:15:03.309Z] at sun.reflect.NativeMethodAccessorImpl.invoke (NativeMethodAccessorImpl.java:62)
[2020-09-19T08:15:03.309Z] at sun.reflect.DelegatingMethodAccessorImpl.invoke (DelegatingMethodAccessorImpl.java:43)
[2020-09-19T08:15:03.309Z] at java.lang.reflect.Method.invoke (Method.java:498)
[2020-09-19T08:15:03.309Z] at org.codehaus.plexus.classworlds.launcher.Launcher.launchEnhanced (Launcher.java:282)
[2020-09-19T08:15:03.309Z] at org.codehaus.plexus.classworlds.launcher.Launcher.launch (Launcher.java:225)
[2020-09-19T08:15:03.309Z] at org.codehaus.plexus.classworlds.launcher.Launcher.mainWithExitCode (Launcher.java:406)
[2020-09-19T08:15:03.310Z] at org.codehaus.plexus.classworlds.launcher.Launcher.main (Launcher.java:347)
[2020-09-19T08:15:03.310Z] [ERROR]
[2020-09-19T08:15:03.311Z] [ERROR] Re-run Maven using the -X switch to enable full debug logging.
[2020-09-19T08:15:03.311Z] [ERROR]
[2020-09-19T08:15:03.311Z] [ERROR] For more information about the errors and possible solutions, please read the following articles:
[2020-09-19T08:15:03.312Z] [ERROR] [Help 1] http://cwiki.apache.org/confluence/display/MAVEN/MojoFailureException
[2020-09-19T08:15:03.312Z] [ERROR]
[2020-09-19T08:15:03.313Z] [ERROR] After correcting the problems, you can resume the build with the command
[2020-09-19T08:15:03.313Z] [ERROR] mvn <args> -rf :surefire-booter
[Pipeline] }
[Pipeline] // withEnv
[Pipeline] }
[Pipeline] // stage
[Pipeline] fileExists
[Pipeline] fileExists
[Pipeline] archiveArtifacts
[2020-09-19T08:15:04.253Z] Archiving artifacts
[Pipeline] cleanWs
[2020-09-19T08:15:05.169Z] [WS-CLEANUP] Deleting project workspace...
[2020-09-19T08:15:05.169Z] [WS-CLEANUP] Deferred wipeout is used...
[2020-09-19T08:15:05.247Z] [WS-CLEANUP] done
[Pipeline] }
[Pipeline] // ws
[Pipeline] }
[Pipeline] // timestamps
[Pipeline] }
[Pipeline] // node
[Pipeline] }
[Pipeline] // parallel
[Pipeline] echo
Build result: FAILURE
[Pipeline] jiraIssueSelector
[Pipeline] echo
The authors of changes [tibordigana].
[Pipeline] echo
Sending email ...
[Pipeline] emailext
Build succeeded in Jenkins: Maven » Maven TLP » maven-surefire » base64 #18
Posted by Apache Jenkins Server <je...@builds.apache.org>.
See https://ci-builds.apache.org/job/Maven/job/maven-box/job/maven-surefire/job/base64/18/
Changes:
* fixed Surefire224WellFormedXmlFailuresIT which makes sense
All tests passed
Build failed in Jenkins: Maven » Maven TLP » maven-surefire » base64 #17
Posted by Apache Jenkins Server <je...@builds.apache.org>.
See https://ci-builds.apache.org/job/Maven/job/maven-box/job/maven-surefire/job/base64/17/
Changes:
* fixed the build and old tests
* More realistic E2ETest. This test changed the performance result only in 10%.
1 tests failed.
FAILED: org.apache.maven.surefire.its.jiras.Surefire224WellFormedXmlFailuresIT.testWellFormedXmlFailures
Error Message:
Wrong error message expected:<�> but was:<null>
Stack Trace:
java.lang.AssertionError: Wrong error message expected:<�> but was:<null>
at org.apache.maven.surefire.its.jiras.Surefire224WellFormedXmlFailuresIT.testWellFormedXmlFailures(Surefire224WellFormedXmlFailuresIT.java:76)
Build log:
[...truncated 31972 lines...]
[2020-09-25T09:24:08.951Z] Caused by: org.apache.maven.plugin.MojoFailureException: There are test failures.
[2020-09-25T09:24:08.952Z]
[2020-09-25T09:24:08.952Z] Please refer to C:\Users\jenkins\AppData\Local\Temp\jenkins-Maven-maven-box-maven-surefire-base64-17\surefire-its\target\failsafe-reports for the individual test results.
[2020-09-25T09:24:08.952Z] Please refer to dump files (if any exist) [date].dump, [date]-jvmRun[N].dump and [date].dumpstream.
[2020-09-25T09:24:08.952Z] at org.apache.maven.plugin.surefire.SurefireHelper.throwException (SurefireHelper.java:271)
[2020-09-25T09:24:08.952Z] at org.apache.maven.plugin.surefire.SurefireHelper.reportExecution (SurefireHelper.java:159)
[2020-09-25T09:24:08.952Z] at org.apache.maven.plugin.failsafe.VerifyMojo.execute (VerifyMojo.java:192)
[2020-09-25T09:24:08.953Z] at org.apache.maven.plugin.DefaultBuildPluginManager.executeMojo (DefaultBuildPluginManager.java:137)
[2020-09-25T09:24:08.953Z] at org.apache.maven.lifecycle.internal.MojoExecutor.execute (MojoExecutor.java:210)
[2020-09-25T09:24:08.953Z] at org.apache.maven.lifecycle.internal.MojoExecutor.execute (MojoExecutor.java:156)
[2020-09-25T09:24:08.953Z] at org.apache.maven.lifecycle.internal.MojoExecutor.execute (MojoExecutor.java:148)
[2020-09-25T09:24:08.953Z] at org.apache.maven.lifecycle.internal.LifecycleModuleBuilder.buildProject (LifecycleModuleBuilder.java:117)
[2020-09-25T09:24:08.954Z] at org.apache.maven.lifecycle.internal.LifecycleModuleBuilder.buildProject (LifecycleModuleBuilder.java:81)
[2020-09-25T09:24:08.954Z] at org.apache.maven.lifecycle.internal.builder.singlethreaded.SingleThreadedBuilder.build (SingleThreadedBuilder.java:56)
[2020-09-25T09:24:08.954Z] at org.apache.maven.lifecycle.internal.LifecycleStarter.execute (LifecycleStarter.java:128)
[2020-09-25T09:24:08.954Z] at org.apache.maven.DefaultMaven.doExecute (DefaultMaven.java:305)
[2020-09-25T09:24:09.336Z] at org.apache.maven.DefaultMaven.doExecute (DefaultMaven.java:192)
[2020-09-25T09:24:09.337Z] at org.apache.maven.DefaultMaven.execute (DefaultMaven.java:105)
[2020-09-25T09:24:09.337Z] at org.apache.maven.cli.MavenCli.execute (MavenCli.java:956)
[2020-09-25T09:24:09.338Z] at org.apache.maven.cli.MavenCli.doMain (MavenCli.java:288)
[2020-09-25T09:24:09.338Z] at org.apache.maven.cli.MavenCli.main (MavenCli.java:192)
[2020-09-25T09:24:09.338Z] at sun.reflect.NativeMethodAccessorImpl.invoke0 (Native Method)
[2020-09-25T09:24:09.339Z] at sun.reflect.NativeMethodAccessorImpl.invoke (NativeMethodAccessorImpl.java:62)
[2020-09-25T09:24:09.339Z] at sun.reflect.DelegatingMethodAccessorImpl.invoke (DelegatingMethodAccessorImpl.java:43)
[2020-09-25T09:24:09.340Z] at java.lang.reflect.Method.invoke (Method.java:498)
[2020-09-25T09:24:09.340Z] at org.codehaus.plexus.classworlds.launcher.Launcher.launchEnhanced (Launcher.java:282)
[2020-09-25T09:24:09.340Z] at org.codehaus.plexus.classworlds.launcher.Launcher.launch (Launcher.java:225)
[2020-09-25T09:24:09.341Z] at org.codehaus.plexus.classworlds.launcher.Launcher.mainWithExitCode (Launcher.java:406)
[2020-09-25T09:24:09.341Z] at org.codehaus.plexus.classworlds.launcher.Launcher.main (Launcher.java:347)
[2020-09-25T09:24:09.342Z] [ERROR]
[2020-09-25T09:24:09.342Z] [ERROR] Re-run Maven using the -X switch to enable full debug logging.
[2020-09-25T09:24:09.342Z] [ERROR]
[2020-09-25T09:24:09.343Z] [ERROR] For more information about the errors and possible solutions, please read the following articles:
[2020-09-25T09:24:09.343Z] [ERROR] [Help 1] http://cwiki.apache.org/confluence/display/MAVEN/MojoFailureException
[2020-09-25T09:24:09.344Z] [ERROR]
[2020-09-25T09:24:09.344Z] [ERROR] After correcting the problems, you can resume the build with the command
[2020-09-25T09:24:09.345Z] [ERROR] mvn <args> -rf :surefire-its
[Pipeline] }
[Pipeline] // withEnv
[Pipeline] }
[Pipeline] // stage
[Pipeline] fileExists
[Pipeline] zip
[2020-09-25T09:24:10.236Z] Writing zip file of C:\Users\jenkins\AppData\Local\Temp\jenkins-Maven-maven-box-maven-surefire-base64-17\maven-failsafe-plugin\target\it to C:\Users\jenkins\AppData\Local\Temp\jenkins-Maven-maven-box-maven-surefire-base64-17\maven-failsafe-plugin--windows-jdk15-maven3.6.x.zip
[2020-09-25T09:24:11.962Z] Zipped 78 entries.
[2020-09-25T09:24:11.963Z] Archiving C:\Users\jenkins\AppData\Local\Temp\jenkins-Maven-maven-box-maven-surefire-base64-17\maven-failsafe-plugin--windows-jdk15-maven3.6.x.zip
[2020-09-25T09:24:11.963Z] [Fast Archiver] No prior successful build to compare, so performing full copy of artifacts
[Pipeline] fileExists
[Pipeline] zip
[2020-09-25T09:24:12.864Z] Writing zip file of C:\Users\jenkins\AppData\Local\Temp\jenkins-Maven-maven-box-maven-surefire-base64-17\surefire-its\target to C:\Users\jenkins\AppData\Local\Temp\jenkins-Maven-maven-box-maven-surefire-base64-17\surefire-its--windows-jdk15-maven3.6.x.zip
[2020-09-25T09:24:35.511Z] Zipped 19163 entries.
[2020-09-25T09:24:35.511Z] Archiving C:\Users\jenkins\AppData\Local\Temp\jenkins-Maven-maven-box-maven-surefire-base64-17@2\surefire-its--windows-jdk11-maven3.6.x.zip
[2020-09-25T09:24:35.512Z] [Fast Archiver] No prior successful build to compare, so performing full copy of artifacts
[2020-09-25T09:24:38.106Z] [INFO] Tests run: 6, Failures: 0, Errors: 0, Skipped: 0, Time elapsed: 66.301 s - in org.apache.maven.surefire.its.jiras.Surefire946KillMainProcessInReusableForkIT
[2020-09-25T09:24:38.107Z] [INFO] Running org.apache.maven.surefire.its.jiras.Surefire972BizarreNoClassDefIT
[2020-09-25T09:24:42.072Z] [INFO] Tests run: 1, Failures: 0, Errors: 0, Skipped: 0, Time elapsed: 8.111 s - in org.apache.maven.surefire.its.jiras.Surefire972BizarreNoClassDefIT
[2020-09-25T09:24:42.072Z] [INFO] Running org.apache.maven.surefire.its.jiras.Surefire975DefaultVMEncodingIT
[2020-09-25T09:24:48.004Z] [INFO] Tests run: 1, Failures: 0, Errors: 0, Skipped: 0, Time elapsed: 5.229 s - in org.apache.maven.surefire.its.jiras.Surefire975DefaultVMEncodingIT
[2020-09-25T09:24:48.004Z] [INFO] Running org.apache.maven.surefire.its.jiras.Surefire979WrongClassLoaderIT
[2020-09-25T09:24:52.765Z] [INFO] Tests run: 1, Failures: 0, Errors: 0, Skipped: 0, Time elapsed: 5.39 s - in org.apache.maven.surefire.its.jiras.Surefire979WrongClassLoaderIT
[2020-09-25T09:24:52.766Z] [INFO] Running org.apache.maven.surefire.its.jiras.Surefire985ParameterizedRunnerAndCategoriesIT
[2020-09-25T09:24:58.679Z] [INFO] Tests run: 1, Failures: 0, Errors: 0, Skipped: 0, Time elapsed: 4.995 s - in org.apache.maven.surefire.its.jiras.Surefire985ParameterizedRunnerAndCategoriesIT
[2020-09-25T09:24:58.680Z] [INFO] Running org.apache.maven.surefire.its.jiras.Surefire995CategoryInheritanceIT
[Pipeline] archiveArtifacts
[2020-09-25T09:25:03.689Z] Archiving artifacts
[2020-09-25T09:25:03.772Z] [Fast Archiver] No prior successful build to compare, so performing full copy of artifacts
[2020-09-25T09:25:32.039Z] [INFO] Tests run: 7, Failures: 0, Errors: 0, Skipped: 0, Time elapsed: 30.791 s - in org.apache.maven.surefire.its.jiras.Surefire995CategoryInheritanceIT
[2020-09-25T09:25:32.040Z] [INFO]
[2020-09-25T09:25:32.040Z] [INFO] Results:
[2020-09-25T09:25:32.040Z] [INFO]
[2020-09-25T09:25:32.041Z] [ERROR] Failures:
[2020-09-25T09:25:32.041Z] [ERROR] Surefire224WellFormedXmlFailuresIT.testWellFormedXmlFailures:76 Wrong error message expected:<�> but was:<null>
[2020-09-25T09:25:32.041Z] [INFO]
[2020-09-25T09:25:32.042Z] [ERROR] Tests run: 955, Failures: 1, Errors: 0, Skipped: 137
[2020-09-25T09:25:32.042Z] [INFO]
[2020-09-25T09:25:32.042Z] [INFO]
[2020-09-25T09:25:32.042Z] [INFO] --- maven-checkstyle-plugin:3.0.0:check (checkstyle-check) @ surefire-its ---
[2020-09-25T09:25:32.043Z] [INFO]
[2020-09-25T09:25:32.043Z] [INFO] --- maven-failsafe-plugin:3.0.0-M4:verify (default) @ surefire-its ---
[2020-09-25T09:25:32.043Z] [INFO] Failsafe report directory: C:\Users\jenkins\AppData\Local\Temp\jenkins-Maven-maven-box-maven-surefire-base64-17@2\surefire-its\target\failsafe-reports
[2020-09-25T09:25:32.044Z] [INFO] ------------------------------------------------------------------------
[2020-09-25T09:25:32.044Z] [INFO] Reactor Summary for Apache Maven Surefire 3.0.0-M6-SNAPSHOT:
[2020-09-25T09:25:32.044Z] [INFO]
[2020-09-25T09:25:32.045Z] [INFO] Apache Maven Surefire .............................. SUCCESS [01:10 min]
[2020-09-25T09:25:32.045Z] [INFO] SureFire Logger API ................................ SUCCESS [ 26.135 s]
[2020-09-25T09:25:32.045Z] [INFO] SureFire API ....................................... SUCCESS [ 23.738 s]
[2020-09-25T09:25:32.045Z] [INFO] Surefire Extensions API ............................ SUCCESS [ 7.557 s]
[2020-09-25T09:25:32.046Z] [INFO] Surefire Extensions SPI ............................ SUCCESS [ 2.200 s]
[2020-09-25T09:25:32.046Z] [INFO] SureFire Booter .................................... SUCCESS [ 26.011 s]
[2020-09-25T09:25:32.046Z] [INFO] Maven Surefire Test-Grouping Support ............... SUCCESS [ 11.224 s]
[2020-09-25T09:25:32.047Z] [INFO] SureFire Providers ................................. SUCCESS [ 0.984 s]
[2020-09-25T09:25:32.047Z] [INFO] Shared JUnit3 Provider Code ........................ SUCCESS [ 5.465 s]
[2020-09-25T09:25:32.047Z] [INFO] Shared Java 5 Provider Base ........................ SUCCESS [ 6.106 s]
[2020-09-25T09:25:32.048Z] [INFO] Shared JUnit4 Provider Code ........................ SUCCESS [ 7.000 s]
[2020-09-25T09:25:32.048Z] [INFO] Shared JUnit48 Provider Code ....................... SUCCESS [ 14.038 s]
[2020-09-25T09:25:32.048Z] [INFO] SureFire JUnit Runner .............................. SUCCESS [ 5.276 s]
[2020-09-25T09:25:32.048Z] [INFO] SureFire JUnit4 Runner ............................. SUCCESS [ 5.537 s]
[2020-09-25T09:25:32.049Z] [INFO] Maven Surefire Common .............................. SUCCESS [01:23 min]
[2020-09-25T09:25:32.049Z] [INFO] SureFire JUnitCore Runner .......................... SUCCESS [02:16 min]
[2020-09-25T09:25:32.049Z] [INFO] SureFire JUnit Platform Runner ..................... SUCCESS [ 13.882 s]
[2020-09-25T09:25:32.050Z] [INFO] SureFire TestNG Utils .............................. SUCCESS [ 5.310 s]
[2020-09-25T09:25:32.050Z] [INFO] SureFire TestNG Runner ............................. SUCCESS [ 8.882 s]
[2020-09-25T09:25:32.050Z] [INFO] ShadeFire JUnit3 Provider .......................... SUCCESS [ 2.460 s]
[2020-09-25T09:25:32.050Z] [INFO] Surefire Report Parser ............................. SUCCESS [ 7.069 s]
[2020-09-25T09:25:32.051Z] [INFO] Maven Surefire Plugin .............................. SUCCESS [ 13.038 s]
[2020-09-25T09:25:32.051Z] [INFO] Maven Failsafe Plugin .............................. SUCCESS [01:26 min]
[2020-09-25T09:25:32.051Z] [INFO] Maven Surefire Report Plugin ....................... SUCCESS [ 20.379 s]
[2020-09-25T09:25:32.051Z] [INFO] Maven Surefire Integration Tests ................... FAILURE [ 01:27 h]
[2020-09-25T09:25:32.051Z] [INFO] Surefire Shared Utils .............................. SKIPPED
[2020-09-25T09:25:32.052Z] [INFO] ------------------------------------------------------------------------
[2020-09-25T09:25:32.052Z] [INFO] BUILD FAILURE
[2020-09-25T09:25:32.052Z] [INFO] ------------------------------------------------------------------------
[2020-09-25T09:25:32.052Z] [INFO] Total time: 01:37 h
[2020-09-25T09:25:32.052Z] [INFO] Finished at: 2020-09-25T02:25:29-07:00
[2020-09-25T09:25:32.052Z] [INFO] ------------------------------------------------------------------------
[2020-09-25T09:25:32.052Z] [ERROR] Failed to execute goal org.apache.maven.plugins:maven-failsafe-plugin:3.0.0-M4:verify (default) on project surefire-its: There are test failures.
[2020-09-25T09:25:32.053Z] [ERROR]
[2020-09-25T09:25:32.053Z] [ERROR] Please refer to C:\Users\jenkins\AppData\Local\Temp\jenkins-Maven-maven-box-maven-surefire-base64-17@2\surefire-its\target\failsafe-reports for the individual test results.
[2020-09-25T09:25:32.053Z] [ERROR] Please refer to dump files (if any exist) [date].dump, [date]-jvmRun[N].dump and [date].dumpstream.
[2020-09-25T09:25:32.053Z] [ERROR] -> [Help 1]
[2020-09-25T09:25:32.053Z] org.apache.maven.lifecycle.LifecycleExecutionException: Failed to execute goal org.apache.maven.plugins:maven-failsafe-plugin:3.0.0-M4:verify (default) on project surefire-its: There are test failures.
[2020-09-25T09:25:32.053Z]
[2020-09-25T09:25:32.053Z] Please refer to C:\Users\jenkins\AppData\Local\Temp\jenkins-Maven-maven-box-maven-surefire-base64-17@2\surefire-its\target\failsafe-reports for the individual test results.
[2020-09-25T09:25:32.054Z] Please refer to dump files (if any exist) [date].dump, [date]-jvmRun[N].dump and [date].dumpstream.
[2020-09-25T09:25:32.054Z] at org.apache.maven.lifecycle.internal.MojoExecutor.execute (MojoExecutor.java:215)
[2020-09-25T09:25:32.054Z] at org.apache.maven.lifecycle.internal.MojoExecutor.execute (MojoExecutor.java:156)
[2020-09-25T09:25:32.054Z] at org.apache.maven.lifecycle.internal.MojoExecutor.execute (MojoExecutor.java:148)
[2020-09-25T09:25:32.054Z] at org.apache.maven.lifecycle.internal.LifecycleModuleBuilder.buildProject (LifecycleModuleBuilder.java:117)
[2020-09-25T09:25:32.054Z] at org.apache.maven.lifecycle.internal.LifecycleModuleBuilder.buildProject (LifecycleModuleBuilder.java:81)
[2020-09-25T09:25:32.055Z] at org.apache.maven.lifecycle.internal.builder.singlethreaded.SingleThreadedBuilder.build (SingleThreadedBuilder.java:56)
[2020-09-25T09:25:32.055Z] at org.apache.maven.lifecycle.internal.LifecycleStarter.execute (LifecycleStarter.java:128)
[2020-09-25T09:25:32.055Z] at org.apache.maven.DefaultMaven.doExecute (DefaultMaven.java:305)
[2020-09-25T09:25:32.055Z] at org.apache.maven.DefaultMaven.doExecute (DefaultMaven.java:192)
[2020-09-25T09:25:32.055Z] at org.apache.maven.DefaultMaven.execute (DefaultMaven.java:105)
[2020-09-25T09:25:32.055Z] at org.apache.maven.cli.MavenCli.execute (MavenCli.java:956)
[2020-09-25T09:25:32.056Z] at org.apache.maven.cli.MavenCli.doMain (MavenCli.java:288)
[2020-09-25T09:25:32.056Z] at org.apache.maven.cli.MavenCli.main (MavenCli.java:192)
[2020-09-25T09:25:32.056Z] at sun.reflect.NativeMethodAccessorImpl.invoke0 (Native Method)
[2020-09-25T09:25:32.056Z] at sun.reflect.NativeMethodAccessorImpl.invoke (NativeMethodAccessorImpl.java:62)
[2020-09-25T09:25:32.056Z] at sun.reflect.DelegatingMethodAccessorImpl.invoke (DelegatingMethodAccessorImpl.java:43)
[2020-09-25T09:25:32.056Z] at java.lang.reflect.Method.invoke (Method.java:498)
[2020-09-25T09:25:32.057Z] at org.codehaus.plexus.classworlds.launcher.Launcher.launchEnhanced (Launcher.java:282)
[2020-09-25T09:25:32.057Z] at org.codehaus.plexus.classworlds.launcher.Launcher.launch (Launcher.java:225)
[2020-09-25T09:25:32.057Z] at org.codehaus.plexus.classworlds.launcher.Launcher.mainWithExitCode (Launcher.java:406)
[2020-09-25T09:25:32.057Z] at org.codehaus.plexus.classworlds.launcher.Launcher.main (Launcher.java:347)
[2020-09-25T09:25:32.057Z] Caused by: org.apache.maven.plugin.MojoFailureException: There are test failures.
[2020-09-25T09:25:32.057Z]
[2020-09-25T09:25:32.057Z] Please refer to C:\Users\jenkins\AppData\Local\Temp\jenkins-Maven-maven-box-maven-surefire-base64-17@2\surefire-its\target\failsafe-reports for the individual test results.
[2020-09-25T09:25:32.058Z] Please refer to dump files (if any exist) [date].dump, [date]-jvmRun[N].dump and [date].dumpstream.
[2020-09-25T09:25:32.058Z] at org.apache.maven.plugin.surefire.SurefireHelper.throwException (SurefireHelper.java:271)
[2020-09-25T09:25:32.058Z] at org.apache.maven.plugin.surefire.SurefireHelper.reportExecution (SurefireHelper.java:159)
[2020-09-25T09:25:32.058Z] at org.apache.maven.plugin.failsafe.VerifyMojo.execute (VerifyMojo.java:192)
[2020-09-25T09:25:32.058Z] at org.apache.maven.plugin.DefaultBuildPluginManager.executeMojo (DefaultBuildPluginManager.java:137)
[2020-09-25T09:25:32.058Z] at org.apache.maven.lifecycle.internal.MojoExecutor.execute (MojoExecutor.java:210)
[2020-09-25T09:25:32.059Z] at org.apache.maven.lifecycle.internal.MojoExecutor.execute (MojoExecutor.java:156)
[2020-09-25T09:25:32.059Z] at org.apache.maven.lifecycle.internal.MojoExecutor.execute (MojoExecutor.java:148)
[2020-09-25T09:25:32.059Z] at org.apache.maven.lifecycle.internal.LifecycleModuleBuilder.buildProject (LifecycleModuleBuilder.java:117)
[2020-09-25T09:25:32.059Z] at org.apache.maven.lifecycle.internal.LifecycleModuleBuilder.buildProject (LifecycleModuleBuilder.java:81)
[2020-09-25T09:25:32.059Z] at org.apache.maven.lifecycle.internal.builder.singlethreaded.SingleThreadedBuilder.build (SingleThreadedBuilder.java:56)
[2020-09-25T09:25:32.059Z] at org.apache.maven.lifecycle.internal.LifecycleStarter.execute (LifecycleStarter.java:128)
[2020-09-25T09:25:32.060Z] at org.apache.maven.DefaultMaven.doExecute (DefaultMaven.java:305)
[2020-09-25T09:25:32.060Z] at org.apache.maven.DefaultMaven.doExecute (DefaultMaven.java:192)
[2020-09-25T09:25:32.060Z] at org.apache.maven.DefaultMaven.execute (DefaultMaven.java:105)
[2020-09-25T09:25:32.060Z] at org.apache.maven.cli.MavenCli.execute (MavenCli.java:956)
[2020-09-25T09:25:32.060Z] at org.apache.maven.cli.MavenCli.doMain (MavenCli.java:288)
[2020-09-25T09:25:32.060Z] at org.apache.maven.cli.MavenCli.main (MavenCli.java:192)
[2020-09-25T09:25:32.060Z] at sun.reflect.NativeMethodAccessorImpl.invoke0 (Native Method)
[2020-09-25T09:25:32.061Z] at sun.reflect.NativeMethodAccessorImpl.invoke (NativeMethodAccessorImpl.java:62)
[2020-09-25T09:25:32.061Z] at sun.reflect.DelegatingMethodAccessorImpl.invoke (DelegatingMethodAccessorImpl.java:43)
[2020-09-25T09:25:32.061Z] at java.lang.reflect.Method.invoke (Method.java:498)
[2020-09-25T09:25:32.062Z] at org.codehaus.plexus.classworlds.launcher.Launcher.launchEnhanced (Launcher.java:282)
[2020-09-25T09:25:32.062Z] at org.codehaus.plexus.classworlds.launcher.Launcher.launch (Launcher.java:225)
[2020-09-25T09:25:32.063Z] at org.codehaus.plexus.classworlds.launcher.Launcher.mainWithExitCode (Launcher.java:406)
[2020-09-25T09:25:32.063Z] at org.codehaus.plexus.classworlds.launcher.Launcher.main (Launcher.java:347)
[2020-09-25T09:25:32.063Z] [ERROR]
[2020-09-25T09:25:32.064Z] [ERROR] Re-run Maven using the -X switch to enable full debug logging.
[2020-09-25T09:25:32.064Z] [ERROR]
[2020-09-25T09:25:32.064Z] [ERROR] For more information about the errors and possible solutions, please read the following articles:
[2020-09-25T09:25:32.065Z] [ERROR] [Help 1] http://cwiki.apache.org/confluence/display/MAVEN/MojoFailureException
[2020-09-25T09:25:32.065Z] [ERROR]
[2020-09-25T09:25:32.065Z] [ERROR] After correcting the problems, you can resume the build with the command
[2020-09-25T09:25:32.066Z] [ERROR] mvn <args> -rf :surefire-its
[Pipeline] }
[Pipeline] // withEnv
[Pipeline] }
[Pipeline] cleanWs
[2020-09-25T09:25:32.449Z] [WS-CLEANUP] Deleting project workspace...
[2020-09-25T09:25:32.449Z] [WS-CLEANUP] Deferred wipeout is used...
[2020-09-25T09:25:32.586Z] [WS-CLEANUP] done
[Pipeline] // stage
[Pipeline] fileExists
[Pipeline] }
[Pipeline] // ws
[Pipeline] zip
[Pipeline] }
[2020-09-25T09:25:33.045Z] Writing zip file of C:\Users\jenkins\AppData\Local\Temp\jenkins-Maven-maven-box-maven-surefire-base64-17@2\maven-failsafe-plugin\target\it to C:\Users\jenkins\AppData\Local\Temp\jenkins-Maven-maven-box-maven-surefire-base64-17@2\maven-failsafe-plugin--windows-jdk14-maven3.6.x.zip
[Pipeline] // timestamps
[2020-09-25T09:25:33.202Z] Zipped 78 entries.
[2020-09-25T09:25:33.203Z] Archiving C:\Users\jenkins\AppData\Local\Temp\jenkins-Maven-maven-box-maven-surefire-base64-17@2\maven-failsafe-plugin--windows-jdk14-maven3.6.x.zip
[2020-09-25T09:25:33.221Z] [Fast Archiver] No prior successful build to compare, so performing full copy of artifacts
[Pipeline] }
[Pipeline] // node
[Pipeline] }
[Pipeline] fileExists
[Pipeline] zip
[2020-09-25T09:25:33.655Z] Writing zip file of C:\Users\jenkins\AppData\Local\Temp\jenkins-Maven-maven-box-maven-surefire-base64-17@2\surefire-its\target to C:\Users\jenkins\AppData\Local\Temp\jenkins-Maven-maven-box-maven-surefire-base64-17@2\surefire-its--windows-jdk14-maven3.6.x.zip
[2020-09-25T09:25:44.757Z] Zipped 19139 entries.
[2020-09-25T09:25:44.757Z] Archiving C:\Users\jenkins\AppData\Local\Temp\jenkins-Maven-maven-box-maven-surefire-base64-17\surefire-its--windows-jdk15-maven3.6.x.zip
[2020-09-25T09:25:44.758Z] [Fast Archiver] No prior successful build to compare, so performing full copy of artifacts
[Pipeline] archiveArtifacts
[2020-09-25T09:26:13.506Z] Archiving artifacts
[2020-09-25T09:26:13.707Z] [Fast Archiver] No prior successful build to compare, so performing full copy of artifacts
[Pipeline] cleanWs
[2020-09-25T09:26:38.831Z] [WS-CLEANUP] Deleting project workspace...
[2020-09-25T09:26:38.832Z] [WS-CLEANUP] Deferred wipeout is used...
[2020-09-25T09:26:39.035Z] [WS-CLEANUP] done
[Pipeline] }
[Pipeline] // ws
[Pipeline] }
[Pipeline] // timestamps
[Pipeline] }
[Pipeline] // node
[Pipeline] }
[2020-09-25T09:27:02.732Z] Zipped 19173 entries.
[2020-09-25T09:27:02.733Z] Archiving C:\Users\jenkins\AppData\Local\Temp\jenkins-Maven-maven-box-maven-surefire-base64-17@2\surefire-its--windows-jdk14-maven3.6.x.zip
[2020-09-25T09:27:02.733Z] [Fast Archiver] No prior successful build to compare, so performing full copy of artifacts
[Pipeline] archiveArtifacts
[2020-09-25T09:27:35.662Z] Archiving artifacts
[2020-09-25T09:27:35.750Z] [Fast Archiver] No prior successful build to compare, so performing full copy of artifacts
[Pipeline] cleanWs
[2020-09-25T09:28:07.696Z] [WS-CLEANUP] Deleting project workspace...
[2020-09-25T09:28:07.697Z] [WS-CLEANUP] Deferred wipeout is used...
[2020-09-25T09:28:07.863Z] [WS-CLEANUP] done
[Pipeline] }
[Pipeline] // ws
[Pipeline] }
[Pipeline] // timestamps
[Pipeline] }
[Pipeline] // node
[Pipeline] }
[Pipeline] // parallel
[Pipeline] echo
Build result: FAILURE
[Pipeline] jiraIssueSelector
[Pipeline] echo
The authors of changes [tibordigana].
[Pipeline] echo
Sending email ...
[Pipeline] emailext
Build failed in Jenkins: Maven » Maven TLP » maven-surefire » base64 #16
Posted by Apache Jenkins Server <je...@builds.apache.org>.
See https://ci-builds.apache.org/job/Maven/job/maven-box/job/maven-surefire/job/base64/16/
Changes:
* employed the field "disabled"
All tests passed
Build log:
[...truncated 6569 lines...]
[2020-09-22T12:28:25.020Z] [INFO]
[2020-09-22T12:28:25.020Z] [INFO] --- maven-checkstyle-plugin:3.0.0:check (checkstyle-check) @ surefire-booter ---
[2020-09-22T12:28:25.612Z] [INFO] Tests run: 159, Failures: 0, Errors: 0, Skipped: 0, Time elapsed: 10.703 s - in org.apache.maven.surefire.booter.JUnit4SuiteTest
[2020-09-22T12:28:25.612Z] [INFO]
[2020-09-22T12:28:25.613Z] [INFO] Results:
[2020-09-22T12:28:25.613Z] [INFO]
[2020-09-22T12:28:25.613Z] [INFO] Tests run: 159, Failures: 0, Errors: 0, Skipped: 0
[2020-09-22T12:28:25.614Z] [INFO]
[2020-09-22T12:28:25.614Z] [INFO]
[2020-09-22T12:28:25.614Z] [INFO] --- maven-jar-plugin:3.2.0:jar (default-jar) @ surefire-booter ---
[2020-09-22T12:28:25.615Z] [INFO] Building jar: C:\Users\jenkins\AppData\Local\Temp\jenkins-Maven-maven-box-maven-surefire-base64-16@2\surefire-booter\target\surefire-booter-3.0.0-M6-SNAPSHOT.jar
[2020-09-22T12:28:25.615Z] [INFO]
[2020-09-22T12:28:25.616Z] [INFO] --- maven-site-plugin:3.8.2:attach-descriptor (attach-descriptor) @ surefire-booter ---
[2020-09-22T12:28:25.616Z] [INFO] Skipping because packaging 'jar' is not pom.
[2020-09-22T12:28:25.616Z] [INFO]
[2020-09-22T12:28:25.617Z] [INFO] --- maven-checkstyle-plugin:3.0.0:check (checkstyle-check) @ surefire-booter ---
[2020-09-22T12:28:26.464Z] [INFO] There are 2 errors reported by Checkstyle 6.18 with config/maven_checks.xml ruleset.
[2020-09-22T12:28:26.464Z] [ERROR] src\main\java\org\apache\maven\surefire\booter\spi\LegacyMasterProcessChannelEncoder.java:[466,32] (coding) MagicNumber: '0xff' is a magic number.
[2020-09-22T12:28:26.465Z] [INFO] Ignored 1 error, 1 violation remaining.
[2020-09-22T12:28:26.465Z] [INFO] ------------------------------------------------------------------------
[2020-09-22T12:28:26.465Z] [INFO] Reactor Summary for Apache Maven Surefire 3.0.0-M6-SNAPSHOT:
[2020-09-22T12:28:26.466Z] [INFO]
[2020-09-22T12:28:26.466Z] [INFO] Apache Maven Surefire .............................. SUCCESS [01:04 min]
[2020-09-22T12:28:26.466Z] [INFO] SureFire Logger API ................................ SUCCESS [ 20.724 s]
[2020-09-22T12:28:26.467Z] [INFO] SureFire API ....................................... SUCCESS [ 23.443 s]
[2020-09-22T12:28:26.467Z] [INFO] Surefire Extensions API ............................ SUCCESS [ 6.937 s]
[2020-09-22T12:28:26.468Z] [INFO] Surefire Extensions SPI ............................ SUCCESS [ 1.929 s]
[2020-09-22T12:28:26.468Z] [INFO] SureFire Booter .................................... FAILURE [ 25.409 s]
[2020-09-22T12:28:26.468Z] [INFO] Maven Surefire Test-Grouping Support ............... SKIPPED
[2020-09-22T12:28:26.469Z] [INFO] SureFire Providers ................................. SKIPPED
[2020-09-22T12:28:26.469Z] [INFO] Shared JUnit3 Provider Code ........................ SKIPPED
[2020-09-22T12:28:26.469Z] [INFO] Shared Java 5 Provider Base ........................ SKIPPED
[2020-09-22T12:28:26.470Z] [INFO] Shared JUnit4 Provider Code ........................ SKIPPED
[2020-09-22T12:28:26.470Z] [INFO] Shared JUnit48 Provider Code ....................... SKIPPED
[2020-09-22T12:28:26.471Z] [INFO] SureFire JUnit Runner .............................. SKIPPED
[2020-09-22T12:28:26.471Z] [INFO] SureFire JUnit4 Runner ............................. SKIPPED
[2020-09-22T12:28:26.471Z] [INFO] Maven Surefire Common .............................. SKIPPED
[2020-09-22T12:28:26.472Z] [INFO] SureFire JUnitCore Runner .......................... SKIPPED
[2020-09-22T12:28:26.472Z] [INFO] SureFire JUnit Platform Runner ..................... SKIPPED
[2020-09-22T12:28:26.472Z] [INFO] SureFire TestNG Utils .............................. SKIPPED
[2020-09-22T12:28:26.473Z] [INFO] SureFire TestNG Runner ............................. SKIPPED
[2020-09-22T12:28:26.473Z] [INFO] ShadeFire JUnit3 Provider .......................... SKIPPED
[2020-09-22T12:28:26.473Z] [INFO] Surefire Report Parser ............................. SKIPPED
[2020-09-22T12:28:26.474Z] [INFO] Maven Surefire Plugin .............................. SKIPPED
[2020-09-22T12:28:26.474Z] [INFO] Maven Failsafe Plugin .............................. SKIPPED
[2020-09-22T12:28:26.474Z] [INFO] Maven Surefire Report Plugin ....................... SKIPPED
[2020-09-22T12:28:26.475Z] [INFO] Maven Surefire Integration Tests ................... SKIPPED
[2020-09-22T12:28:26.475Z] [INFO] Surefire Shared Utils .............................. SKIPPED
[2020-09-22T12:28:26.476Z] [INFO] ------------------------------------------------------------------------
[2020-09-22T12:28:26.476Z] [INFO] BUILD FAILURE
[2020-09-22T12:28:26.477Z] [INFO] ------------------------------------------------------------------------
[2020-09-22T12:28:26.477Z] [INFO] Total time: 02:26 min
[2020-09-22T12:28:26.477Z] [INFO] Finished at: 2020-09-22T05:28:26-07:00
[2020-09-22T12:28:26.477Z] [INFO] ------------------------------------------------------------------------
[2020-09-22T12:28:26.478Z] [ERROR] Failed to execute goal org.apache.maven.plugins:maven-checkstyle-plugin:3.0.0:check (checkstyle-check) on project surefire-booter: You have 1 Checkstyle violation. -> [Help 1]
[2020-09-22T12:28:26.478Z] org.apache.maven.lifecycle.LifecycleExecutionException: Failed to execute goal org.apache.maven.plugins:maven-checkstyle-plugin:3.0.0:check (checkstyle-check) on project surefire-booter: You have 1 Checkstyle violation.
[2020-09-22T12:28:26.478Z] at org.apache.maven.lifecycle.internal.MojoExecutor.execute (MojoExecutor.java:215)
[2020-09-22T12:28:26.478Z] at org.apache.maven.lifecycle.internal.MojoExecutor.execute (MojoExecutor.java:156)
[2020-09-22T12:28:26.478Z] at org.apache.maven.lifecycle.internal.MojoExecutor.execute (MojoExecutor.java:148)
[2020-09-22T12:28:26.479Z] at org.apache.maven.lifecycle.internal.LifecycleModuleBuilder.buildProject (LifecycleModuleBuilder.java:117)
[2020-09-22T12:28:26.479Z] at org.apache.maven.lifecycle.internal.LifecycleModuleBuilder.buildProject (LifecycleModuleBuilder.java:81)
[2020-09-22T12:28:26.479Z] at org.apache.maven.lifecycle.internal.builder.singlethreaded.SingleThreadedBuilder.build (SingleThreadedBuilder.java:56)
[2020-09-22T12:28:26.479Z] at org.apache.maven.lifecycle.internal.LifecycleStarter.execute (LifecycleStarter.java:128)
[2020-09-22T12:28:26.479Z] at org.apache.maven.DefaultMaven.doExecute (DefaultMaven.java:305)
[2020-09-22T12:28:26.480Z] at org.apache.maven.DefaultMaven.doExecute (DefaultMaven.java:192)
[2020-09-22T12:28:26.480Z] at org.apache.maven.DefaultMaven.execute (DefaultMaven.java:105)
[2020-09-22T12:28:26.480Z] at org.apache.maven.cli.MavenCli.execute (MavenCli.java:956)
[2020-09-22T12:28:26.480Z] at org.apache.maven.cli.MavenCli.doMain (MavenCli.java:288)
[2020-09-22T12:28:26.480Z] at org.apache.maven.cli.MavenCli.main (MavenCli.java:192)
[2020-09-22T12:28:26.481Z] at sun.reflect.NativeMethodAccessorImpl.invoke0 (Native Method)
[2020-09-22T12:28:26.481Z] at sun.reflect.NativeMethodAccessorImpl.invoke (NativeMethodAccessorImpl.java:62)
[2020-09-22T12:28:26.481Z] at sun.reflect.DelegatingMethodAccessorImpl.invoke (DelegatingMethodAccessorImpl.java:43)
[2020-09-22T12:28:26.481Z] at java.lang.reflect.Method.invoke (Method.java:498)
[2020-09-22T12:28:26.481Z] at org.codehaus.plexus.classworlds.launcher.Launcher.launchEnhanced (Launcher.java:282)
[2020-09-22T12:28:26.482Z] at org.codehaus.plexus.classworlds.launcher.Launcher.launch (Launcher.java:225)
[2020-09-22T12:28:26.482Z] at org.codehaus.plexus.classworlds.launcher.Launcher.mainWithExitCode (Launcher.java:406)
[2020-09-22T12:28:26.482Z] at org.codehaus.plexus.classworlds.launcher.Launcher.main (Launcher.java:347)
[2020-09-22T12:28:26.482Z] Caused by: org.apache.maven.plugin.MojoFailureException: You have 1 Checkstyle violation.
[2020-09-22T12:28:26.482Z] at org.apache.maven.plugins.checkstyle.CheckstyleViolationCheckMojo.execute (CheckstyleViolationCheckMojo.java:576)
[2020-09-22T12:28:26.483Z] at org.apache.maven.plugin.DefaultBuildPluginManager.executeMojo (DefaultBuildPluginManager.java:137)
[2020-09-22T12:28:26.483Z] at org.apache.maven.lifecycle.internal.MojoExecutor.execute (MojoExecutor.java:210)
[2020-09-22T12:28:26.483Z] at org.apache.maven.lifecycle.internal.MojoExecutor.execute (MojoExecutor.java:156)
[2020-09-22T12:28:26.483Z] at org.apache.maven.lifecycle.internal.MojoExecutor.execute (MojoExecutor.java:148)
[2020-09-22T12:28:26.483Z] at org.apache.maven.lifecycle.internal.LifecycleModuleBuilder.buildProject (LifecycleModuleBuilder.java:117)
[2020-09-22T12:28:26.484Z] at org.apache.maven.lifecycle.internal.LifecycleModuleBuilder.buildProject (LifecycleModuleBuilder.java:81)
[2020-09-22T12:28:26.484Z] at org.apache.maven.lifecycle.internal.builder.singlethreaded.SingleThreadedBuilder.build (SingleThreadedBuilder.java:56)
[2020-09-22T12:28:26.484Z] at org.apache.maven.lifecycle.internal.LifecycleStarter.execute (LifecycleStarter.java:128)
[2020-09-22T12:28:26.484Z] at org.apache.maven.DefaultMaven.doExecute (DefaultMaven.java:305)
[2020-09-22T12:28:26.484Z] at org.apache.maven.DefaultMaven.doExecute (DefaultMaven.java:192)
[2020-09-22T12:28:26.485Z] at org.apache.maven.DefaultMaven.execute (DefaultMaven.java:105)
[2020-09-22T12:28:26.485Z] at org.apache.maven.cli.MavenCli.execute (MavenCli.java:956)
[2020-09-22T12:28:26.485Z] at org.apache.maven.cli.MavenCli.doMain (MavenCli.java:288)
[2020-09-22T12:28:26.485Z] at org.apache.maven.cli.MavenCli.main (MavenCli.java:192)
[2020-09-22T12:28:26.486Z] at sun.reflect.NativeMethodAccessorImpl.invoke0 (Native Method)
[2020-09-22T12:28:26.486Z] at sun.reflect.NativeMethodAccessorImpl.invoke (NativeMethodAccessorImpl.java:62)
[2020-09-22T12:28:26.486Z] at sun.reflect.DelegatingMethodAccessorImpl.invoke (DelegatingMethodAccessorImpl.java:43)
[2020-09-22T12:28:26.486Z] at java.lang.reflect.Method.invoke (Method.java:498)
[2020-09-22T12:28:26.486Z] at org.codehaus.plexus.classworlds.launcher.Launcher.launchEnhanced (Launcher.java:282)
[2020-09-22T12:28:26.487Z] at org.codehaus.plexus.classworlds.launcher.Launcher.launch (Launcher.java:225)
[2020-09-22T12:28:26.487Z] at org.codehaus.plexus.classworlds.launcher.Launcher.mainWithExitCode (Launcher.java:406)
[2020-09-22T12:28:26.487Z] at org.codehaus.plexus.classworlds.launcher.Launcher.main (Launcher.java:347)
[2020-09-22T12:28:26.487Z] [ERROR]
[2020-09-22T12:28:26.487Z] [ERROR] Re-run Maven using the -X switch to enable full debug logging.
[2020-09-22T12:28:26.488Z] [ERROR]
[2020-09-22T12:28:26.488Z] [ERROR] For more information about the errors and possible solutions, please read the following articles:
[2020-09-22T12:28:26.488Z] [ERROR] [Help 1] http://cwiki.apache.org/confluence/display/MAVEN/MojoFailureException
[2020-09-22T12:28:26.488Z] [ERROR]
[2020-09-22T12:28:26.488Z] [ERROR] After correcting the problems, you can resume the build with the command
[2020-09-22T12:28:26.489Z] [ERROR] mvn <args> -rf :surefire-booter
[Pipeline] }
[Pipeline] // withEnv
[Pipeline] }
[2020-09-22T12:28:26.910Z] [INFO] There are 2 errors reported by Checkstyle 6.18 with config/maven_checks.xml ruleset.
[2020-09-22T12:28:26.910Z] [ERROR] src\main\java\org\apache\maven\surefire\booter\spi\LegacyMasterProcessChannelEncoder.java:[466,32] (coding) MagicNumber: '0xff' is a magic number.
[2020-09-22T12:28:26.911Z] [INFO] Ignored 1 error, 1 violation remaining.
[2020-09-22T12:28:26.911Z] [INFO] ------------------------------------------------------------------------
[2020-09-22T12:28:26.911Z] [INFO] Reactor Summary for Apache Maven Surefire 3.0.0-M6-SNAPSHOT:
[2020-09-22T12:28:26.912Z] [INFO]
[2020-09-22T12:28:26.912Z] [INFO] Apache Maven Surefire .............................. SUCCESS [01:04 min]
[2020-09-22T12:28:26.912Z] [INFO] SureFire Logger API ................................ SUCCESS [ 20.733 s]
[2020-09-22T12:28:26.913Z] [INFO] SureFire API ....................................... SUCCESS [ 23.439 s]
[2020-09-22T12:28:26.913Z] [INFO] Surefire Extensions API ............................ SUCCESS [ 7.903 s]
[2020-09-22T12:28:26.913Z] [INFO] Surefire Extensions SPI ............................ SUCCESS [ 1.980 s]
[2020-09-22T12:28:26.914Z] [INFO] SureFire Booter .................................... FAILURE [ 24.729 s]
[2020-09-22T12:28:26.914Z] [INFO] Maven Surefire Test-Grouping Support ............... SKIPPED
[2020-09-22T12:28:26.915Z] [INFO] SureFire Providers ................................. SKIPPED
[2020-09-22T12:28:26.915Z] [INFO] Shared JUnit3 Provider Code ........................ SKIPPED
[2020-09-22T12:28:26.915Z] [INFO] Shared Java 5 Provider Base ........................ SKIPPED
[2020-09-22T12:28:26.916Z] [INFO] Shared JUnit4 Provider Code ........................ SKIPPED
[2020-09-22T12:28:26.916Z] [INFO] Shared JUnit48 Provider Code ....................... SKIPPED
[2020-09-22T12:28:26.916Z] [INFO] SureFire JUnit Runner .............................. SKIPPED
[2020-09-22T12:28:26.917Z] [INFO] SureFire JUnit4 Runner ............................. SKIPPED
[2020-09-22T12:28:26.917Z] [INFO] Maven Surefire Common .............................. SKIPPED
[2020-09-22T12:28:26.917Z] [INFO] SureFire JUnitCore Runner .......................... SKIPPED
[2020-09-22T12:28:26.918Z] [INFO] SureFire JUnit Platform Runner ..................... SKIPPED
[2020-09-22T12:28:26.918Z] [INFO] SureFire TestNG Utils .............................. SKIPPED
[2020-09-22T12:28:26.918Z] [INFO] SureFire TestNG Runner ............................. SKIPPED
[2020-09-22T12:28:26.919Z] [INFO] ShadeFire JUnit3 Provider .......................... SKIPPED
[2020-09-22T12:28:26.919Z] [INFO] Surefire Report Parser ............................. SKIPPED
[2020-09-22T12:28:26.919Z] [INFO] Maven Surefire Plugin .............................. SKIPPED
[2020-09-22T12:28:26.919Z] [INFO] Maven Failsafe Plugin .............................. SKIPPED
[2020-09-22T12:28:26.920Z] [INFO] Maven Surefire Report Plugin ....................... SKIPPED
[2020-09-22T12:28:26.920Z] [INFO] Maven Surefire Integration Tests ................... SKIPPED
[2020-09-22T12:28:26.920Z] [INFO] Surefire Shared Utils .............................. SKIPPED
[2020-09-22T12:28:26.921Z] [INFO] ------------------------------------------------------------------------
[2020-09-22T12:28:26.921Z] [INFO] BUILD FAILURE
[2020-09-22T12:28:26.921Z] [INFO] ------------------------------------------------------------------------
[2020-09-22T12:28:26.921Z] [INFO] Total time: 02:26 min
[2020-09-22T12:28:26.922Z] [INFO] Finished at: 2020-09-22T05:28:26-07:00
[2020-09-22T12:28:26.922Z] [INFO] ------------------------------------------------------------------------
[2020-09-22T12:28:26.922Z] [ERROR] Failed to execute goal org.apache.maven.plugins:maven-checkstyle-plugin:3.0.0:check (checkstyle-check) on project surefire-booter: You have 1 Checkstyle violation. -> [Help 1]
[2020-09-22T12:28:26.923Z] org.apache.maven.lifecycle.LifecycleExecutionException: Failed to execute goal org.apache.maven.plugins:maven-checkstyle-plugin:3.0.0:check (checkstyle-check) on project surefire-booter: You have 1 Checkstyle violation.
[2020-09-22T12:28:26.923Z] at org.apache.maven.lifecycle.internal.MojoExecutor.execute (MojoExecutor.java:215)
[2020-09-22T12:28:26.923Z] at org.apache.maven.lifecycle.internal.MojoExecutor.execute (MojoExecutor.java:156)
[2020-09-22T12:28:26.923Z] at org.apache.maven.lifecycle.internal.MojoExecutor.execute (MojoExecutor.java:148)
[2020-09-22T12:28:26.924Z] at org.apache.maven.lifecycle.internal.LifecycleModuleBuilder.buildProject (LifecycleModuleBuilder.java:117)
[2020-09-22T12:28:26.924Z] at org.apache.maven.lifecycle.internal.LifecycleModuleBuilder.buildProject (LifecycleModuleBuilder.java:81)
[2020-09-22T12:28:26.924Z] at org.apache.maven.lifecycle.internal.builder.singlethreaded.SingleThreadedBuilder.build (SingleThreadedBuilder.java:56)
[2020-09-22T12:28:26.925Z] at org.apache.maven.lifecycle.internal.LifecycleStarter.execute (LifecycleStarter.java:128)
[2020-09-22T12:28:26.925Z] at org.apache.maven.DefaultMaven.doExecute (DefaultMaven.java:305)
[2020-09-22T12:28:26.925Z] at org.apache.maven.DefaultMaven.doExecute (DefaultMaven.java:192)
[2020-09-22T12:28:26.925Z] at org.apache.maven.DefaultMaven.execute (DefaultMaven.java:105)
[2020-09-22T12:28:26.926Z] at org.apache.maven.cli.MavenCli.execute (MavenCli.java:956)
[2020-09-22T12:28:26.926Z] at org.apache.maven.cli.MavenCli.doMain (MavenCli.java:288)
[2020-09-22T12:28:26.926Z] at org.apache.maven.cli.MavenCli.main (MavenCli.java:192)
[2020-09-22T12:28:26.926Z] at sun.reflect.NativeMethodAccessorImpl.invoke0 (Native Method)
[2020-09-22T12:28:26.926Z] at sun.reflect.NativeMethodAccessorImpl.invoke (NativeMethodAccessorImpl.java:62)
[2020-09-22T12:28:26.927Z] at sun.reflect.DelegatingMethodAccessorImpl.invoke (DelegatingMethodAccessorImpl.java:43)
[2020-09-22T12:28:26.927Z] at java.lang.reflect.Method.invoke (Method.java:498)
[2020-09-22T12:28:26.927Z] at org.codehaus.plexus.classworlds.launcher.Launcher.launchEnhanced (Launcher.java:282)
[2020-09-22T12:28:26.927Z] at org.codehaus.plexus.classworlds.launcher.Launcher.launch (Launcher.java:225)
[2020-09-22T12:28:26.927Z] at org.codehaus.plexus.classworlds.launcher.Launcher.mainWithExitCode (Launcher.java:406)
[2020-09-22T12:28:26.928Z] at org.codehaus.plexus.classworlds.launcher.Launcher.main (Launcher.java:347)
[2020-09-22T12:28:26.928Z] Caused by: org.apache.maven.plugin.MojoFailureException: You have 1 Checkstyle violation.
[2020-09-22T12:28:26.928Z] at org.apache.maven.plugins.checkstyle.CheckstyleViolationCheckMojo.execute (CheckstyleViolationCheckMojo.java:576)
[2020-09-22T12:28:26.928Z] at org.apache.maven.plugin.DefaultBuildPluginManager.executeMojo (DefaultBuildPluginManager.java:137)
[2020-09-22T12:28:26.928Z] at org.apache.maven.lifecycle.internal.MojoExecutor.execute (MojoExecutor.java:210)
[2020-09-22T12:28:26.929Z] at org.apache.maven.lifecycle.internal.MojoExecutor.execute (MojoExecutor.java:156)
[2020-09-22T12:28:26.929Z] at org.apache.maven.lifecycle.internal.MojoExecutor.execute (MojoExecutor.java:148)
[2020-09-22T12:28:26.929Z] at org.apache.maven.lifecycle.internal.LifecycleModuleBuilder.buildProject (LifecycleModuleBuilder.java:117)
[2020-09-22T12:28:26.929Z] at org.apache.maven.lifecycle.internal.LifecycleModuleBuilder.buildProject (LifecycleModuleBuilder.java:81)
[2020-09-22T12:28:26.929Z] at org.apache.maven.lifecycle.internal.builder.singlethreaded.SingleThreadedBuilder.build (SingleThreadedBuilder.java:56)
[2020-09-22T12:28:26.929Z] at org.apache.maven.lifecycle.internal.LifecycleStarter.execute (LifecycleStarter.java:128)
[2020-09-22T12:28:26.930Z] at org.apache.maven.DefaultMaven.doExecute (DefaultMaven.java:305)
[2020-09-22T12:28:26.930Z] at org.apache.maven.DefaultMaven.doExecute (DefaultMaven.java:192)
[2020-09-22T12:28:26.930Z] at org.apache.maven.DefaultMaven.execute (DefaultMaven.java:105)
[2020-09-22T12:28:26.930Z] at org.apache.maven.cli.MavenCli.execute (MavenCli.java:956)
[2020-09-22T12:28:26.930Z] at org.apache.maven.cli.MavenCli.doMain (MavenCli.java:288)
[2020-09-22T12:28:26.931Z] at org.apache.maven.cli.MavenCli.main (MavenCli.java:192)
[2020-09-22T12:28:26.931Z] at sun.reflect.NativeMethodAccessorImpl.invoke0 (Native Method)
[2020-09-22T12:28:26.931Z] at sun.reflect.NativeMethodAccessorImpl.invoke (NativeMethodAccessorImpl.java:62)
[2020-09-22T12:28:26.931Z] at sun.reflect.DelegatingMethodAccessorImpl.invoke (DelegatingMethodAccessorImpl.java:43)
[2020-09-22T12:28:26.931Z] at java.lang.reflect.Method.invoke (Method.java:498)
[2020-09-22T12:28:26.932Z] at org.codehaus.plexus.classworlds.launcher.Launcher.launchEnhanced (Launcher.java:282)
[2020-09-22T12:28:26.932Z] at org.codehaus.plexus.classworlds.launcher.Launcher.launch (Launcher.java:225)
[2020-09-22T12:28:26.932Z] at org.codehaus.plexus.classworlds.launcher.Launcher.mainWithExitCode (Launcher.java:406)
[2020-09-22T12:28:26.932Z] at org.codehaus.plexus.classworlds.launcher.Launcher.main (Launcher.java:347)
[2020-09-22T12:28:26.932Z] [ERROR]
[2020-09-22T12:28:26.933Z] [ERROR] Re-run Maven using the -X switch to enable full debug logging.
[2020-09-22T12:28:26.933Z] [ERROR]
[2020-09-22T12:28:26.933Z] [ERROR] For more information about the errors and possible solutions, please read the following articles:
[2020-09-22T12:28:26.933Z] [ERROR] [Help 1] http://cwiki.apache.org/confluence/display/MAVEN/MojoFailureException
[2020-09-22T12:28:26.933Z] [ERROR]
[2020-09-22T12:28:26.934Z] [ERROR] After correcting the problems, you can resume the build with the command
[2020-09-22T12:28:26.934Z] [ERROR] mvn <args> -rf :surefire-booter
[Pipeline] // stage
[Pipeline] fileExists
[Pipeline] }
[Pipeline] // withEnv
[Pipeline] fileExists
[Pipeline] }
[Pipeline] // stage
[Pipeline] archiveArtifacts
[Pipeline] fileExists
[2020-09-22T12:28:27.775Z] Archiving artifacts
[Pipeline] fileExists
[Pipeline] archiveArtifacts
[2020-09-22T12:28:28.024Z] Archiving artifacts
[Pipeline] cleanWs
[2020-09-22T12:28:28.745Z] [WS-CLEANUP] Deleting project workspace...
[2020-09-22T12:28:28.745Z] [WS-CLEANUP] Deferred wipeout is used...
[Pipeline] cleanWs
[2020-09-22T12:28:28.820Z] [WS-CLEANUP] done
[2020-09-22T12:28:28.867Z] [WS-CLEANUP] Deleting project workspace...
[2020-09-22T12:28:28.867Z] [WS-CLEANUP] Deferred wipeout is used...
[Pipeline] }
[2020-09-22T12:28:28.942Z] [WS-CLEANUP] done
[Pipeline] // ws
[Pipeline] }
[Pipeline] }
[Pipeline] // timestamps
[Pipeline] // ws
[Pipeline] }
[Pipeline] }
[Pipeline] // node
[Pipeline] // timestamps
[Pipeline] }
[Pipeline] }
[Pipeline] // node
[Pipeline] }
[Pipeline] // parallel
[Pipeline] echo
Build result: FAILURE
[Pipeline] jiraIssueSelector
[Pipeline] echo
The authors of changes [tibordigana].
[Pipeline] echo
Sending email ...
[Pipeline] emailext
Build failed in Jenkins: Maven » Maven TLP » maven-surefire » base64 #15
Posted by Apache Jenkins Server <je...@builds.apache.org>.
See https://ci-builds.apache.org/job/Maven/job/maven-box/job/maven-surefire/job/base64/15/
Changes:
* removed unnecessary CharsetDecoder.decode() and improved the performance in 15%, added performance tests
All tests passed
Build log:
[...truncated 6569 lines...]
[2020-09-22T09:55:53.657Z] at org.codehaus.plexus.classworlds.launcher.Launcher.launchEnhanced (Launcher.java:282)
[2020-09-22T09:55:53.657Z] at org.codehaus.plexus.classworlds.launcher.Launcher.launch (Launcher.java:225)
[2020-09-22T09:55:53.657Z] at org.codehaus.plexus.classworlds.launcher.Launcher.mainWithExitCode (Launcher.java:406)
[2020-09-22T09:55:53.657Z] at org.codehaus.plexus.classworlds.launcher.Launcher.main (Launcher.java:347)
[2020-09-22T09:55:53.658Z] [ERROR]
[2020-09-22T09:55:53.658Z] [ERROR] Re-run Maven using the -X switch to enable full debug logging.
[2020-09-22T09:55:53.658Z] [ERROR]
[2020-09-22T09:55:53.658Z] [ERROR] For more information about the errors and possible solutions, please read the following articles:
[2020-09-22T09:55:53.658Z] [ERROR] [Help 1] http://cwiki.apache.org/confluence/display/MAVEN/MojoFailureException
[2020-09-22T09:55:53.659Z] [ERROR]
[2020-09-22T09:55:53.659Z] [ERROR] After correcting the problems, you can resume the build with the command
[2020-09-22T09:55:53.659Z] [ERROR] mvn <args> -rf :surefire-booter
[2020-09-22T09:55:53.837Z] at org.apache.maven.lifecycle.internal.MojoExecutor.execute (MojoExecutor.java:215)
[2020-09-22T09:55:53.838Z] at org.apache.maven.lifecycle.internal.MojoExecutor.execute (MojoExecutor.java:156)
[2020-09-22T09:55:53.838Z] at org.apache.maven.lifecycle.internal.MojoExecutor.execute (MojoExecutor.java:148)
[2020-09-22T09:55:53.839Z] at org.apache.maven.lifecycle.internal.LifecycleModuleBuilder.buildProject (LifecycleModuleBuilder.java:117)
[2020-09-22T09:55:53.839Z] at org.apache.maven.lifecycle.internal.LifecycleModuleBuilder.buildProject (LifecycleModuleBuilder.java:81)
[2020-09-22T09:55:53.840Z] at org.apache.maven.lifecycle.internal.builder.singlethreaded.SingleThreadedBuilder.build (SingleThreadedBuilder.java:56)
[2020-09-22T09:55:53.840Z] at org.apache.maven.lifecycle.internal.LifecycleStarter.execute (LifecycleStarter.java:128)
[2020-09-22T09:55:53.840Z] at org.apache.maven.DefaultMaven.doExecute (DefaultMaven.java:305)
[2020-09-22T09:55:53.841Z] at org.apache.maven.DefaultMaven.doExecute (DefaultMaven.java:192)
[2020-09-22T09:55:53.841Z] at org.apache.maven.DefaultMaven.execute (DefaultMaven.java:105)
[2020-09-22T09:55:53.841Z] at org.apache.maven.cli.MavenCli.execute (MavenCli.java:956)
[2020-09-22T09:55:53.842Z] at org.apache.maven.cli.MavenCli.doMain (MavenCli.java:288)
[2020-09-22T09:55:53.842Z] at org.apache.maven.cli.MavenCli.main (MavenCli.java:192)
[2020-09-22T09:55:53.842Z] at sun.reflect.NativeMethodAccessorImpl.invoke0 (Native Method)
[2020-09-22T09:55:53.843Z] at sun.reflect.NativeMethodAccessorImpl.invoke (NativeMethodAccessorImpl.java:62)
[2020-09-22T09:55:53.843Z] at sun.reflect.DelegatingMethodAccessorImpl.invoke (DelegatingMethodAccessorImpl.java:43)
[2020-09-22T09:55:53.844Z] at java.lang.reflect.Method.invoke (Method.java:498)
[2020-09-22T09:55:53.844Z] at org.codehaus.plexus.classworlds.launcher.Launcher.launchEnhanced (Launcher.java:282)
[2020-09-22T09:55:53.844Z] at org.codehaus.plexus.classworlds.launcher.Launcher.launch (Launcher.java:225)
[2020-09-22T09:55:53.845Z] at org.codehaus.plexus.classworlds.launcher.Launcher.mainWithExitCode (Launcher.java:406)
[2020-09-22T09:55:53.845Z] at org.codehaus.plexus.classworlds.launcher.Launcher.main (Launcher.java:347)
[2020-09-22T09:55:53.845Z] Caused by: org.apache.maven.plugin.MojoFailureException: You have 1 Checkstyle violation.
[2020-09-22T09:55:53.846Z] at org.apache.maven.plugins.checkstyle.CheckstyleViolationCheckMojo.execute (CheckstyleViolationCheckMojo.java:576)
[2020-09-22T09:55:53.846Z] at org.apache.maven.plugin.DefaultBuildPluginManager.executeMojo (DefaultBuildPluginManager.java:137)
[2020-09-22T09:55:53.847Z] at org.apache.maven.lifecycle.internal.MojoExecutor.execute (MojoExecutor.java:210)
[2020-09-22T09:55:53.847Z] at org.apache.maven.lifecycle.internal.MojoExecutor.execute (MojoExecutor.java:156)
[2020-09-22T09:55:53.847Z] at org.apache.maven.lifecycle.internal.MojoExecutor.execute (MojoExecutor.java:148)
[2020-09-22T09:55:53.848Z] at org.apache.maven.lifecycle.internal.LifecycleModuleBuilder.buildProject (LifecycleModuleBuilder.java:117)
[2020-09-22T09:55:53.848Z] at org.apache.maven.lifecycle.internal.LifecycleModuleBuilder.buildProject (LifecycleModuleBuilder.java:81)
[2020-09-22T09:55:53.848Z] at org.apache.maven.lifecycle.internal.builder.singlethreaded.SingleThreadedBuilder.build (SingleThreadedBuilder.java:56)
[2020-09-22T09:55:53.849Z] at org.apache.maven.lifecycle.internal.LifecycleStarter.execute (LifecycleStarter.java:128)
[2020-09-22T09:55:53.849Z] at org.apache.maven.DefaultMaven.doExecute (DefaultMaven.java:305)
[2020-09-22T09:55:53.849Z] at org.apache.maven.DefaultMaven.doExecute (DefaultMaven.java:192)
[2020-09-22T09:55:53.849Z] at org.apache.maven.DefaultMaven.execute (DefaultMaven.java:105)
[2020-09-22T09:55:53.850Z] at org.apache.maven.cli.MavenCli.execute (MavenCli.java:956)
[2020-09-22T09:55:53.850Z] at org.apache.maven.cli.MavenCli.doMain (MavenCli.java:288)
[2020-09-22T09:55:53.850Z] at org.apache.maven.cli.MavenCli.main (MavenCli.java:192)
[2020-09-22T09:55:53.850Z] at sun.reflect.NativeMethodAccessorImpl.invoke0 (Native Method)
[2020-09-22T09:55:53.850Z] at sun.reflect.NativeMethodAccessorImpl.invoke (NativeMethodAccessorImpl.java:62)
[2020-09-22T09:55:53.851Z] at sun.reflect.DelegatingMethodAccessorImpl.invoke (DelegatingMethodAccessorImpl.java:43)
[2020-09-22T09:55:53.851Z] at java.lang.reflect.Method.invoke (Method.java:498)
[2020-09-22T09:55:53.851Z] at org.codehaus.plexus.classworlds.launcher.Launcher.launchEnhanced (Launcher.java:282)
[2020-09-22T09:55:53.851Z] at org.codehaus.plexus.classworlds.launcher.Launcher.launch (Launcher.java:225)
[2020-09-22T09:55:53.851Z] at org.codehaus.plexus.classworlds.launcher.Launcher.mainWithExitCode (Launcher.java:406)
[2020-09-22T09:55:53.852Z] at org.codehaus.plexus.classworlds.launcher.Launcher.main (Launcher.java:347)
[2020-09-22T09:55:53.852Z] [ERROR]
[2020-09-22T09:55:53.852Z] [ERROR] Re-run Maven using the -X switch to enable full debug logging.
[2020-09-22T09:55:53.852Z] [ERROR]
[2020-09-22T09:55:53.852Z] [ERROR] For more information about the errors and possible solutions, please read the following articles:
[2020-09-22T09:55:53.853Z] [ERROR] [Help 1] http://cwiki.apache.org/confluence/display/MAVEN/MojoFailureException
[2020-09-22T09:55:53.853Z] [ERROR]
[2020-09-22T09:55:53.853Z] [ERROR] After correcting the problems, you can resume the build with the command
[2020-09-22T09:55:53.853Z] [ERROR] mvn <args> -rf :surefire-booter
[Pipeline] }
[Pipeline] // withEnv
[Pipeline] }
[Pipeline] // stage
[Pipeline] fileExists
[Pipeline] }
[Pipeline] // withEnv
[Pipeline] fileExists
[Pipeline] }
[Pipeline] // stage
[Pipeline] archiveArtifacts
[Pipeline] fileExists
[2020-09-22T09:55:54.995Z] Archiving artifacts
[Pipeline] fileExists
[2020-09-22T09:55:55.174Z] [INFO]
[2020-09-22T09:55:55.174Z] [INFO] --- maven-surefire-plugin:3.0.0-M4:test (default-test) @ surefire-booter ---
[2020-09-22T09:55:55.174Z] [INFO] Surefire report directory: C:\Users\jenkins\AppData\Local\Temp\jenkins-Maven-maven-box-maven-surefire-base64-15\surefire-booter\target\surefire-reports
[2020-09-22T09:55:55.175Z] [INFO] Using configured provider org.apache.maven.shadefire.surefire.junit.JUnit3Provider
[2020-09-22T09:55:55.175Z] [WARNING] The system property java.awt.headless is configured twice! The property appears in <argLine/> and any of <systemPropertyVariables/>, <systemProperties/> or user property.
[2020-09-22T09:55:55.176Z] [INFO] parallel='none', perCoreThreadCount=true, threadCount=0, useUnlimitedThreads=false, threadCountSuites=0, threadCountClasses=0, threadCountMethods=0, parallelOptimized=true
[2020-09-22T09:55:55.176Z] [INFO]
[2020-09-22T09:55:55.176Z] [INFO] -------------------------------------------------------
[2020-09-22T09:55:55.177Z] [INFO] T E S T S
[2020-09-22T09:55:55.177Z] [INFO] -------------------------------------------------------
[Pipeline] archiveArtifacts
[2020-09-22T09:55:55.234Z] Archiving artifacts
[Pipeline] cleanWs
[2020-09-22T09:55:55.890Z] [INFO] Running org.apache.maven.surefire.booter.JUnit4SuiteTest
[2020-09-22T09:55:55.942Z] [WS-CLEANUP] Deleting project workspace...
[2020-09-22T09:55:55.943Z] [WS-CLEANUP] Deferred wipeout is used...
[Pipeline] cleanWs
[2020-09-22T09:55:56.018Z] [WS-CLEANUP] done
[2020-09-22T09:55:56.063Z] [WS-CLEANUP] Deleting project workspace...
[2020-09-22T09:55:56.063Z] [WS-CLEANUP] Deferred wipeout is used...
[Pipeline] }
[2020-09-22T09:55:56.137Z] [WS-CLEANUP] done
[Pipeline] // ws
[Pipeline] }
[Pipeline] }
[Pipeline] // timestamps
[Pipeline] // ws
[Pipeline] }
[Pipeline] }
[Pipeline] // node
[Pipeline] // timestamps
[Pipeline] }
[Pipeline] }
[Pipeline] // node
[Pipeline] }
[2020-09-22T09:56:04.794Z] [INFO] Tests run: 159, Failures: 0, Errors: 0, Skipped: 0, Time elapsed: 9.021 s - in org.apache.maven.surefire.booter.JUnit4SuiteTest
[2020-09-22T09:56:05.126Z] [INFO]
[2020-09-22T09:56:05.127Z] [INFO] Results:
[2020-09-22T09:56:05.127Z] [INFO]
[2020-09-22T09:56:05.128Z] [INFO] Tests run: 159, Failures: 0, Errors: 0, Skipped: 0
[2020-09-22T09:56:05.128Z] [INFO]
[2020-09-22T09:56:05.129Z] [INFO]
[2020-09-22T09:56:05.129Z] [INFO] --- maven-jar-plugin:3.2.0:jar (default-jar) @ surefire-booter ---
[2020-09-22T09:56:05.461Z] [INFO] Building jar: C:\Users\jenkins\AppData\Local\Temp\jenkins-Maven-maven-box-maven-surefire-base64-15\surefire-booter\target\surefire-booter-3.0.0-M6-SNAPSHOT.jar
[2020-09-22T09:56:05.462Z] [INFO]
[2020-09-22T09:56:05.462Z] [INFO] --- maven-site-plugin:3.8.2:attach-descriptor (attach-descriptor) @ surefire-booter ---
[2020-09-22T09:56:05.462Z] [INFO] Skipping because packaging 'jar' is not pom.
[2020-09-22T09:56:05.463Z] [INFO]
[2020-09-22T09:56:05.463Z] [INFO] --- maven-checkstyle-plugin:3.0.0:check (checkstyle-check) @ surefire-booter ---
[2020-09-22T09:56:06.175Z] [INFO] There are 2 errors reported by Checkstyle 6.18 with config/maven_checks.xml ruleset.
[2020-09-22T09:56:06.507Z] [ERROR] src\main\java\org\apache\maven\surefire\booter\spi\LegacyMasterProcessChannelEncoder.java:[466,32] (coding) MagicNumber: '0xff' is a magic number.
[2020-09-22T09:56:06.507Z] [INFO] Ignored 1 error, 1 violation remaining.
[2020-09-22T09:56:06.508Z] [INFO] ------------------------------------------------------------------------
[2020-09-22T09:56:06.508Z] [INFO] Reactor Summary for Apache Maven Surefire 3.0.0-M6-SNAPSHOT:
[2020-09-22T09:56:06.509Z] [INFO]
[2020-09-22T09:56:06.509Z] [INFO] Apache Maven Surefire .............................. SUCCESS [ 54.010 s]
[2020-09-22T09:56:06.509Z] [INFO] SureFire Logger API ................................ SUCCESS [ 19.978 s]
[2020-09-22T09:56:06.510Z] [INFO] SureFire API ....................................... SUCCESS [ 22.928 s]
[2020-09-22T09:56:06.510Z] [INFO] Surefire Extensions API ............................ SUCCESS [ 6.573 s]
[2020-09-22T09:56:06.510Z] [INFO] Surefire Extensions SPI ............................ SUCCESS [ 2.388 s]
[2020-09-22T09:56:06.511Z] [INFO] SureFire Booter .................................... FAILURE [ 22.570 s]
[2020-09-22T09:56:06.511Z] [INFO] Maven Surefire Test-Grouping Support ............... SKIPPED
[2020-09-22T09:56:06.511Z] [INFO] SureFire Providers ................................. SKIPPED
[2020-09-22T09:56:06.512Z] [INFO] Shared JUnit3 Provider Code ........................ SKIPPED
[2020-09-22T09:56:06.512Z] [INFO] Shared Java 5 Provider Base ........................ SKIPPED
[2020-09-22T09:56:06.513Z] [INFO] Shared JUnit4 Provider Code ........................ SKIPPED
[2020-09-22T09:56:06.513Z] [INFO] Shared JUnit48 Provider Code ....................... SKIPPED
[2020-09-22T09:56:06.513Z] [INFO] SureFire JUnit Runner .............................. SKIPPED
[2020-09-22T09:56:06.514Z] [INFO] SureFire JUnit4 Runner ............................. SKIPPED
[2020-09-22T09:56:06.514Z] [INFO] Maven Surefire Common .............................. SKIPPED
[2020-09-22T09:56:06.514Z] [INFO] SureFire JUnitCore Runner .......................... SKIPPED
[2020-09-22T09:56:06.515Z] [INFO] SureFire JUnit Platform Runner ..................... SKIPPED
[2020-09-22T09:56:06.515Z] [INFO] SureFire TestNG Utils .............................. SKIPPED
[2020-09-22T09:56:06.515Z] [INFO] SureFire TestNG Runner ............................. SKIPPED
[2020-09-22T09:56:06.516Z] [INFO] ShadeFire JUnit3 Provider .......................... SKIPPED
[2020-09-22T09:56:06.516Z] [INFO] Surefire Report Parser ............................. SKIPPED
[2020-09-22T09:56:06.517Z] [INFO] Maven Surefire Plugin .............................. SKIPPED
[2020-09-22T09:56:06.517Z] [INFO] Maven Failsafe Plugin .............................. SKIPPED
[2020-09-22T09:56:06.517Z] [INFO] Maven Surefire Report Plugin ....................... SKIPPED
[2020-09-22T09:56:06.517Z] [INFO] Maven Surefire Integration Tests ................... SKIPPED
[2020-09-22T09:56:06.518Z] [INFO] Surefire Shared Utils .............................. SKIPPED
[2020-09-22T09:56:06.518Z] [INFO] ------------------------------------------------------------------------
[2020-09-22T09:56:06.518Z] [INFO] BUILD FAILURE
[2020-09-22T09:56:06.518Z] [INFO] ------------------------------------------------------------------------
[2020-09-22T09:56:06.518Z] [INFO] Total time: 02:09 min
[2020-09-22T09:56:06.519Z] [INFO] Finished at: 2020-09-22T02:56:06-07:00
[2020-09-22T09:56:06.519Z] [INFO] ------------------------------------------------------------------------
[2020-09-22T09:56:06.519Z] [ERROR] Failed to execute goal org.apache.maven.plugins:maven-checkstyle-plugin:3.0.0:check (checkstyle-check) on project surefire-booter: You have 1 Checkstyle violation. -> [Help 1]
[2020-09-22T09:56:06.519Z] org.apache.maven.lifecycle.LifecycleExecutionException: Failed to execute goal org.apache.maven.plugins:maven-checkstyle-plugin:3.0.0:check (checkstyle-check) on project surefire-booter: You have 1 Checkstyle violation.
[2020-09-22T09:56:06.520Z] at org.apache.maven.lifecycle.internal.MojoExecutor.execute (MojoExecutor.java:215)
[2020-09-22T09:56:06.520Z] at org.apache.maven.lifecycle.internal.MojoExecutor.execute (MojoExecutor.java:156)
[2020-09-22T09:56:06.520Z] at org.apache.maven.lifecycle.internal.MojoExecutor.execute (MojoExecutor.java:148)
[2020-09-22T09:56:06.520Z] at org.apache.maven.lifecycle.internal.LifecycleModuleBuilder.buildProject (LifecycleModuleBuilder.java:117)
[2020-09-22T09:56:06.520Z] at org.apache.maven.lifecycle.internal.LifecycleModuleBuilder.buildProject (LifecycleModuleBuilder.java:81)
[2020-09-22T09:56:06.521Z] at org.apache.maven.lifecycle.internal.builder.singlethreaded.SingleThreadedBuilder.build (SingleThreadedBuilder.java:56)
[2020-09-22T09:56:06.521Z] at org.apache.maven.lifecycle.internal.LifecycleStarter.execute (LifecycleStarter.java:128)
[2020-09-22T09:56:06.521Z] at org.apache.maven.DefaultMaven.doExecute (DefaultMaven.java:305)
[2020-09-22T09:56:06.521Z] at org.apache.maven.DefaultMaven.doExecute (DefaultMaven.java:192)
[2020-09-22T09:56:06.521Z] at org.apache.maven.DefaultMaven.execute (DefaultMaven.java:105)
[2020-09-22T09:56:06.522Z] at org.apache.maven.cli.MavenCli.execute (MavenCli.java:956)
[2020-09-22T09:56:06.522Z] at org.apache.maven.cli.MavenCli.doMain (MavenCli.java:288)
[2020-09-22T09:56:06.522Z] at org.apache.maven.cli.MavenCli.main (MavenCli.java:192)
[2020-09-22T09:56:06.522Z] at sun.reflect.NativeMethodAccessorImpl.invoke0 (Native Method)
[2020-09-22T09:56:06.522Z] at sun.reflect.NativeMethodAccessorImpl.invoke (NativeMethodAccessorImpl.java:62)
[2020-09-22T09:56:06.523Z] at sun.reflect.DelegatingMethodAccessorImpl.invoke (DelegatingMethodAccessorImpl.java:43)
[2020-09-22T09:56:06.523Z] at java.lang.reflect.Method.invoke (Method.java:498)
[2020-09-22T09:56:06.523Z] at org.codehaus.plexus.classworlds.launcher.Launcher.launchEnhanced (Launcher.java:282)
[2020-09-22T09:56:06.523Z] at org.codehaus.plexus.classworlds.launcher.Launcher.launch (Launcher.java:225)
[2020-09-22T09:56:06.523Z] at org.codehaus.plexus.classworlds.launcher.Launcher.mainWithExitCode (Launcher.java:406)
[2020-09-22T09:56:06.524Z] at org.codehaus.plexus.classworlds.launcher.Launcher.main (Launcher.java:347)
[2020-09-22T09:56:06.524Z] Caused by: org.apache.maven.plugin.MojoFailureException: You have 1 Checkstyle violation.
[2020-09-22T09:56:06.524Z] at org.apache.maven.plugins.checkstyle.CheckstyleViolationCheckMojo.execute (CheckstyleViolationCheckMojo.java:576)
[2020-09-22T09:56:06.524Z] at org.apache.maven.plugin.DefaultBuildPluginManager.executeMojo (DefaultBuildPluginManager.java:137)
[2020-09-22T09:56:06.525Z] at org.apache.maven.lifecycle.internal.MojoExecutor.execute (MojoExecutor.java:210)
[2020-09-22T09:56:06.525Z] at org.apache.maven.lifecycle.internal.MojoExecutor.execute (MojoExecutor.java:156)
[2020-09-22T09:56:06.525Z] at org.apache.maven.lifecycle.internal.MojoExecutor.execute (MojoExecutor.java:148)
[2020-09-22T09:56:06.525Z] at org.apache.maven.lifecycle.internal.LifecycleModuleBuilder.buildProject (LifecycleModuleBuilder.java:117)
[2020-09-22T09:56:06.525Z] at org.apache.maven.lifecycle.internal.LifecycleModuleBuilder.buildProject (LifecycleModuleBuilder.java:81)
[2020-09-22T09:56:06.526Z] at org.apache.maven.lifecycle.internal.builder.singlethreaded.SingleThreadedBuilder.build (SingleThreadedBuilder.java:56)
[2020-09-22T09:56:06.526Z] at org.apache.maven.lifecycle.internal.LifecycleStarter.execute (LifecycleStarter.java:128)
[2020-09-22T09:56:06.526Z] at org.apache.maven.DefaultMaven.doExecute (DefaultMaven.java:305)
[2020-09-22T09:56:06.526Z] at org.apache.maven.DefaultMaven.doExecute (DefaultMaven.java:192)
[2020-09-22T09:56:06.526Z] at org.apache.maven.DefaultMaven.execute (DefaultMaven.java:105)
[2020-09-22T09:56:06.527Z] at org.apache.maven.cli.MavenCli.execute (MavenCli.java:956)
[2020-09-22T09:56:06.527Z] at org.apache.maven.cli.MavenCli.doMain (MavenCli.java:288)
[2020-09-22T09:56:06.527Z] at org.apache.maven.cli.MavenCli.main (MavenCli.java:192)
[2020-09-22T09:56:06.527Z] at sun.reflect.NativeMethodAccessorImpl.invoke0 (Native Method)
[2020-09-22T09:56:06.527Z] at sun.reflect.NativeMethodAccessorImpl.invoke (NativeMethodAccessorImpl.java:62)
[2020-09-22T09:56:06.528Z] at sun.reflect.DelegatingMethodAccessorImpl.invoke (DelegatingMethodAccessorImpl.java:43)
[2020-09-22T09:56:06.528Z] at java.lang.reflect.Method.invoke (Method.java:498)
[2020-09-22T09:56:06.528Z] at org.codehaus.plexus.classworlds.launcher.Launcher.launchEnhanced (Launcher.java:282)
[2020-09-22T09:56:06.528Z] at org.codehaus.plexus.classworlds.launcher.Launcher.launch (Launcher.java:225)
[2020-09-22T09:56:06.528Z] at org.codehaus.plexus.classworlds.launcher.Launcher.mainWithExitCode (Launcher.java:406)
[2020-09-22T09:56:06.529Z] at org.codehaus.plexus.classworlds.launcher.Launcher.main (Launcher.java:347)
[2020-09-22T09:56:06.529Z] [ERROR]
[2020-09-22T09:56:06.529Z] [ERROR] Re-run Maven using the -X switch to enable full debug logging.
[2020-09-22T09:56:06.529Z] [ERROR]
[2020-09-22T09:56:06.530Z] [ERROR] For more information about the errors and possible solutions, please read the following articles:
[2020-09-22T09:56:06.530Z] [ERROR] [Help 1] http://cwiki.apache.org/confluence/display/MAVEN/MojoFailureException
[2020-09-22T09:56:06.530Z] [ERROR]
[2020-09-22T09:56:06.530Z] [ERROR] After correcting the problems, you can resume the build with the command
[2020-09-22T09:56:06.530Z] [ERROR] mvn <args> -rf :surefire-booter
[Pipeline] }
[Pipeline] // withEnv
[Pipeline] }
[Pipeline] // stage
[Pipeline] fileExists
[Pipeline] fileExists
[Pipeline] archiveArtifacts
[2020-09-22T09:56:07.435Z] Archiving artifacts
[Pipeline] cleanWs
[2020-09-22T09:56:08.379Z] [WS-CLEANUP] Deleting project workspace...
[2020-09-22T09:56:08.379Z] [WS-CLEANUP] Deferred wipeout is used...
[2020-09-22T09:56:08.452Z] [WS-CLEANUP] done
[Pipeline] }
[Pipeline] // ws
[Pipeline] }
[Pipeline] // timestamps
[Pipeline] }
[Pipeline] // node
[Pipeline] }
[Pipeline] // parallel
[Pipeline] echo
Build result: FAILURE
[Pipeline] jiraIssueSelector
[Pipeline] echo
The authors of changes [tibordigana].
[Pipeline] echo
Sending email ...
[Pipeline] emailext
Build failed in Jenkins: Maven » Maven TLP » maven-surefire » base64 #14
Posted by Apache Jenkins Server <je...@builds.apache.org>.
See https://ci-builds.apache.org/job/Maven/job/maven-box/job/maven-surefire/job/base64/14/
Changes:
* fixed method readInt() and tests
* fixed the encoder
* fixed the remaining tests
* committed the remaining classes
All tests passed
Build log:
[...truncated 6569 lines...]
[2020-09-21T00:37:30.811Z] [INFO]
[2020-09-21T00:37:30.811Z] [INFO] --- maven-checkstyle-plugin:3.0.0:check (checkstyle-check) @ surefire-booter ---
[2020-09-21T00:37:30.900Z] [INFO] Tests run: 159, Failures: 0, Errors: 0, Skipped: 0, Time elapsed: 11.165 s - in org.apache.maven.surefire.booter.JUnit4SuiteTest
[2020-09-21T00:37:30.901Z] [INFO]
[2020-09-21T00:37:30.902Z] [INFO] Results:
[2020-09-21T00:37:30.902Z] [INFO]
[2020-09-21T00:37:30.902Z] [INFO] Tests run: 159, Failures: 0, Errors: 0, Skipped: 0
[2020-09-21T00:37:30.903Z] [INFO]
[2020-09-21T00:37:30.903Z] [INFO]
[2020-09-21T00:37:30.904Z] [INFO] --- maven-jar-plugin:3.2.0:jar (default-jar) @ surefire-booter ---
[2020-09-21T00:37:30.904Z] [INFO] Building jar: C:\Users\jenkins\AppData\Local\Temp\jenkins-Maven-maven-box-maven-surefire-base64-14@2\surefire-booter\target\surefire-booter-3.0.0-M6-SNAPSHOT.jar
[2020-09-21T00:37:30.904Z] [INFO]
[2020-09-21T00:37:30.905Z] [INFO] --- maven-site-plugin:3.8.2:attach-descriptor (attach-descriptor) @ surefire-booter ---
[2020-09-21T00:37:30.905Z] [INFO] Skipping because packaging 'jar' is not pom.
[2020-09-21T00:37:30.906Z] [INFO]
[2020-09-21T00:37:30.906Z] [INFO] --- maven-checkstyle-plugin:3.0.0:check (checkstyle-check) @ surefire-booter ---
[2020-09-21T00:37:31.840Z] [INFO] There are 2 errors reported by Checkstyle 6.18 with config/maven_checks.xml ruleset.
[2020-09-21T00:37:31.840Z] [INFO] There are 2 errors reported by Checkstyle 6.18 with config/maven_checks.xml ruleset.
[2020-09-21T00:37:31.841Z] [ERROR] src\main\java\org\apache\maven\surefire\booter\spi\LegacyMasterProcessChannelEncoder.java:[467,32] (coding) MagicNumber: '0xff' is a magic number.
[2020-09-21T00:37:31.841Z] [ERROR] src\main\java\org\apache\maven\surefire\booter\spi\LegacyMasterProcessChannelEncoder.java:[467,32] (coding) MagicNumber: '0xff' is a magic number.
[2020-09-21T00:37:31.841Z] [INFO] Ignored 1 error, 1 violation remaining.
[2020-09-21T00:37:31.841Z] [INFO] Ignored 1 error, 1 violation remaining.
[2020-09-21T00:37:31.842Z] [INFO] ------------------------------------------------------------------------
[2020-09-21T00:37:31.842Z] [INFO] ------------------------------------------------------------------------
[2020-09-21T00:37:31.842Z] [INFO] Reactor Summary for Apache Maven Surefire 3.0.0-M6-SNAPSHOT:
[2020-09-21T00:37:31.842Z] [INFO] Reactor Summary for Apache Maven Surefire 3.0.0-M6-SNAPSHOT:
[2020-09-21T00:37:31.843Z] [INFO]
[2020-09-21T00:37:31.843Z] [INFO]
[2020-09-21T00:37:31.843Z] [INFO] Apache Maven Surefire .............................. SUCCESS [01:10 min]
[2020-09-21T00:37:31.843Z] [INFO] Apache Maven Surefire .............................. SUCCESS [01:09 min]
[2020-09-21T00:37:31.843Z] [INFO] SureFire Logger API ................................ SUCCESS [ 23.010 s]
[2020-09-21T00:37:31.844Z] [INFO] SureFire Logger API ................................ SUCCESS [ 23.172 s]
[2020-09-21T00:37:31.844Z] [INFO] SureFire API ....................................... SUCCESS [ 23.795 s]
[2020-09-21T00:37:31.844Z] [INFO] SureFire API ....................................... SUCCESS [ 23.739 s]
[2020-09-21T00:37:31.844Z] [INFO] Surefire Extensions API ............................ SUCCESS [ 7.477 s]
[2020-09-21T00:37:31.845Z] [INFO] Surefire Extensions API ............................ SUCCESS [ 7.367 s]
[2020-09-21T00:37:31.845Z] [INFO] Surefire Extensions SPI ............................ SUCCESS [ 2.114 s]
[2020-09-21T00:37:31.845Z] [INFO] Surefire Extensions SPI ............................ SUCCESS [ 2.271 s]
[2020-09-21T00:37:31.845Z] [INFO] SureFire Booter .................................... FAILURE [ 26.326 s]
[2020-09-21T00:37:31.846Z] [INFO] SureFire Booter .................................... FAILURE [ 26.387 s]
[2020-09-21T00:37:31.846Z] [INFO] Maven Surefire Test-Grouping Support ............... SKIPPED
[2020-09-21T00:37:31.846Z] [INFO] Maven Surefire Test-Grouping Support ............... SKIPPED
[2020-09-21T00:37:31.846Z] [INFO] SureFire Providers ................................. SKIPPED
[2020-09-21T00:37:31.846Z] [INFO] SureFire Providers ................................. SKIPPED
[2020-09-21T00:37:31.847Z] [INFO] Shared JUnit3 Provider Code ........................ SKIPPED
[2020-09-21T00:37:31.847Z] [INFO] Shared JUnit3 Provider Code ........................ SKIPPED
[2020-09-21T00:37:31.847Z] [INFO] Shared Java 5 Provider Base ........................ SKIPPED
[2020-09-21T00:37:31.847Z] [INFO] Shared Java 5 Provider Base ........................ SKIPPED
[2020-09-21T00:37:31.847Z] [INFO] Shared JUnit4 Provider Code ........................ SKIPPED
[2020-09-21T00:37:31.848Z] [INFO] Shared JUnit48 Provider Code ....................... SKIPPED
[2020-09-21T00:37:31.848Z] [INFO] Shared JUnit4 Provider Code ........................ SKIPPED
[2020-09-21T00:37:31.848Z] [INFO] SureFire JUnit Runner .............................. SKIPPED
[2020-09-21T00:37:31.848Z] [INFO] Shared JUnit48 Provider Code ....................... SKIPPED
[2020-09-21T00:37:31.849Z] [INFO] SureFire JUnit4 Runner ............................. SKIPPED
[2020-09-21T00:37:31.849Z] [INFO] SureFire JUnit Runner .............................. SKIPPED
[2020-09-21T00:37:31.849Z] [INFO] Maven Surefire Common .............................. SKIPPED
[2020-09-21T00:37:31.849Z] [INFO] SureFire JUnit4 Runner ............................. SKIPPED
[2020-09-21T00:37:31.850Z] [INFO] SureFire JUnitCore Runner .......................... SKIPPED
[2020-09-21T00:37:31.850Z] [INFO] Maven Surefire Common .............................. SKIPPED
[2020-09-21T00:37:31.850Z] [INFO] SureFire JUnit Platform Runner ..................... SKIPPED
[2020-09-21T00:37:31.850Z] [INFO] SureFire JUnitCore Runner .......................... SKIPPED
[2020-09-21T00:37:31.850Z] [INFO] SureFire TestNG Utils .............................. SKIPPED
[2020-09-21T00:37:31.851Z] [INFO] SureFire JUnit Platform Runner ..................... SKIPPED
[2020-09-21T00:37:31.851Z] [INFO] SureFire TestNG Runner ............................. SKIPPED
[2020-09-21T00:37:31.851Z] [INFO] SureFire TestNG Utils .............................. SKIPPED
[2020-09-21T00:37:31.851Z] [INFO] ShadeFire JUnit3 Provider .......................... SKIPPED
[2020-09-21T00:37:31.852Z] [INFO] SureFire TestNG Runner ............................. SKIPPED
[2020-09-21T00:37:31.852Z] [INFO] Surefire Report Parser ............................. SKIPPED
[2020-09-21T00:37:31.852Z] [INFO] Maven Surefire Plugin .............................. SKIPPED
[2020-09-21T00:37:31.852Z] [INFO] ShadeFire JUnit3 Provider .......................... SKIPPED
[2020-09-21T00:37:31.853Z] [INFO] Surefire Report Parser ............................. SKIPPED
[2020-09-21T00:37:31.853Z] [INFO] Maven Failsafe Plugin .............................. SKIPPED
[2020-09-21T00:37:31.853Z] [INFO] Maven Surefire Plugin .............................. SKIPPED
[2020-09-21T00:37:31.853Z] [INFO] Maven Surefire Report Plugin ....................... SKIPPED
[2020-09-21T00:37:31.853Z] [INFO] Maven Failsafe Plugin .............................. SKIPPED
[2020-09-21T00:37:31.853Z] [INFO] Maven Surefire Report Plugin ....................... SKIPPED
[2020-09-21T00:37:31.854Z] [INFO] Maven Surefire Integration Tests ................... SKIPPED
[2020-09-21T00:37:31.854Z] [INFO] Maven Surefire Integration Tests ................... SKIPPED
[2020-09-21T00:37:31.854Z] [INFO] Surefire Shared Utils .............................. SKIPPED
[2020-09-21T00:37:31.854Z] [INFO] Surefire Shared Utils .............................. SKIPPED
[2020-09-21T00:37:31.854Z] [INFO] ------------------------------------------------------------------------
[2020-09-21T00:37:31.854Z] [INFO] ------------------------------------------------------------------------
[2020-09-21T00:37:31.854Z] [INFO] BUILD FAILURE
[2020-09-21T00:37:31.855Z] [INFO] BUILD FAILURE
[2020-09-21T00:37:31.855Z] [INFO] ------------------------------------------------------------------------
[2020-09-21T00:37:31.855Z] [INFO] ------------------------------------------------------------------------
[2020-09-21T00:37:31.855Z] [INFO] Total time: 02:34 min
[2020-09-21T00:37:31.855Z] [INFO] Finished at: 2020-09-20T17:37:31-07:00
[2020-09-21T00:37:31.855Z] [INFO] Total time: 02:35 min
[2020-09-21T00:37:31.855Z] [INFO] ------------------------------------------------------------------------
[2020-09-21T00:37:31.855Z] [INFO] Finished at: 2020-09-20T17:37:31-07:00
[2020-09-21T00:37:31.856Z] [ERROR] Failed to execute goal org.apache.maven.plugins:maven-checkstyle-plugin:3.0.0:check (checkstyle-check) on project surefire-booter: You have 1 Checkstyle violation. -> [Help 1]
[2020-09-21T00:37:31.856Z] [INFO] ------------------------------------------------------------------------
[2020-09-21T00:37:31.856Z] org.apache.maven.lifecycle.LifecycleExecutionException: Failed to execute goal org.apache.maven.plugins:maven-checkstyle-plugin:3.0.0:check (checkstyle-check) on project surefire-booter: You have 1 Checkstyle violation.
[2020-09-21T00:37:31.856Z] [ERROR] Failed to execute goal org.apache.maven.plugins:maven-checkstyle-plugin:3.0.0:check (checkstyle-check) on project surefire-booter: You have 1 Checkstyle violation. -> [Help 1]
[2020-09-21T00:37:31.856Z] at org.apache.maven.lifecycle.internal.MojoExecutor.execute (MojoExecutor.java:215)
[2020-09-21T00:37:31.856Z] org.apache.maven.lifecycle.LifecycleExecutionException: Failed to execute goal org.apache.maven.plugins:maven-checkstyle-plugin:3.0.0:check (checkstyle-check) on project surefire-booter: You have 1 Checkstyle violation.
[2020-09-21T00:37:31.856Z] at org.apache.maven.lifecycle.internal.MojoExecutor.execute (MojoExecutor.java:156)
[2020-09-21T00:37:31.857Z] at org.apache.maven.lifecycle.internal.MojoExecutor.execute (MojoExecutor.java:215)
[2020-09-21T00:37:31.857Z] at org.apache.maven.lifecycle.internal.MojoExecutor.execute (MojoExecutor.java:148)
[2020-09-21T00:37:31.857Z] at org.apache.maven.lifecycle.internal.MojoExecutor.execute (MojoExecutor.java:156)
[2020-09-21T00:37:31.857Z] at org.apache.maven.lifecycle.internal.LifecycleModuleBuilder.buildProject (LifecycleModuleBuilder.java:117)
[2020-09-21T00:37:31.857Z] at org.apache.maven.lifecycle.internal.MojoExecutor.execute (MojoExecutor.java:148)
[2020-09-21T00:37:31.857Z] at org.apache.maven.lifecycle.internal.LifecycleModuleBuilder.buildProject (LifecycleModuleBuilder.java:81)
[2020-09-21T00:37:31.857Z] at org.apache.maven.lifecycle.internal.LifecycleModuleBuilder.buildProject (LifecycleModuleBuilder.java:117)
[2020-09-21T00:37:31.857Z] at org.apache.maven.lifecycle.internal.builder.singlethreaded.SingleThreadedBuilder.build (SingleThreadedBuilder.java:56)
[2020-09-21T00:37:31.858Z] at org.apache.maven.lifecycle.internal.LifecycleModuleBuilder.buildProject (LifecycleModuleBuilder.java:81)
[2020-09-21T00:37:31.858Z] at org.apache.maven.lifecycle.internal.LifecycleStarter.execute (LifecycleStarter.java:128)
[2020-09-21T00:37:31.858Z] at org.apache.maven.lifecycle.internal.builder.singlethreaded.SingleThreadedBuilder.build (SingleThreadedBuilder.java:56)
[2020-09-21T00:37:31.858Z] at org.apache.maven.DefaultMaven.doExecute (DefaultMaven.java:305)
[2020-09-21T00:37:31.858Z] at org.apache.maven.lifecycle.internal.LifecycleStarter.execute (LifecycleStarter.java:128)
[2020-09-21T00:37:31.858Z] at org.apache.maven.DefaultMaven.doExecute (DefaultMaven.java:192)
[2020-09-21T00:37:31.858Z] at org.apache.maven.DefaultMaven.doExecute (DefaultMaven.java:305)
[2020-09-21T00:37:31.858Z] at org.apache.maven.DefaultMaven.execute (DefaultMaven.java:105)
[2020-09-21T00:37:31.859Z] at org.apache.maven.cli.MavenCli.execute (MavenCli.java:956)
[2020-09-21T00:37:31.859Z] at org.apache.maven.DefaultMaven.doExecute (DefaultMaven.java:192)
[2020-09-21T00:37:31.859Z] at org.apache.maven.cli.MavenCli.doMain (MavenCli.java:288)
[2020-09-21T00:37:31.859Z] at org.apache.maven.DefaultMaven.execute (DefaultMaven.java:105)
[2020-09-21T00:37:31.859Z] at org.apache.maven.cli.MavenCli.main (MavenCli.java:192)
[2020-09-21T00:37:31.859Z] at org.apache.maven.cli.MavenCli.execute (MavenCli.java:956)
[2020-09-21T00:37:31.860Z] at sun.reflect.NativeMethodAccessorImpl.invoke0 (Native Method)
[2020-09-21T00:37:31.860Z] at org.apache.maven.cli.MavenCli.doMain (MavenCli.java:288)
[2020-09-21T00:37:31.860Z] at sun.reflect.NativeMethodAccessorImpl.invoke (NativeMethodAccessorImpl.java:62)
[2020-09-21T00:37:31.860Z] at org.apache.maven.cli.MavenCli.main (MavenCli.java:192)
[2020-09-21T00:37:31.860Z] at sun.reflect.DelegatingMethodAccessorImpl.invoke (DelegatingMethodAccessorImpl.java:43)
[2020-09-21T00:37:31.860Z] at sun.reflect.NativeMethodAccessorImpl.invoke0 (Native Method)
[2020-09-21T00:37:31.860Z] at java.lang.reflect.Method.invoke (Method.java:498)
[2020-09-21T00:37:31.860Z] at sun.reflect.NativeMethodAccessorImpl.invoke (NativeMethodAccessorImpl.java:62)
[2020-09-21T00:37:31.861Z] at org.codehaus.plexus.classworlds.launcher.Launcher.launchEnhanced (Launcher.java:282)
[2020-09-21T00:37:31.861Z] at sun.reflect.DelegatingMethodAccessorImpl.invoke (DelegatingMethodAccessorImpl.java:43)
[2020-09-21T00:37:31.861Z] at org.codehaus.plexus.classworlds.launcher.Launcher.launch (Launcher.java:225)
[2020-09-21T00:37:31.861Z] at java.lang.reflect.Method.invoke (Method.java:498)
[2020-09-21T00:37:31.861Z] at org.codehaus.plexus.classworlds.launcher.Launcher.mainWithExitCode (Launcher.java:406)
[2020-09-21T00:37:31.861Z] at org.codehaus.plexus.classworlds.launcher.Launcher.launchEnhanced (Launcher.java:282)
[2020-09-21T00:37:31.861Z] at org.codehaus.plexus.classworlds.launcher.Launcher.main (Launcher.java:347)
[2020-09-21T00:37:31.862Z] at org.codehaus.plexus.classworlds.launcher.Launcher.launch (Launcher.java:225)
[2020-09-21T00:37:31.862Z] Caused by: org.apache.maven.plugin.MojoFailureException: You have 1 Checkstyle violation.
[2020-09-21T00:37:31.862Z] at org.apache.maven.plugins.checkstyle.CheckstyleViolationCheckMojo.execute (CheckstyleViolationCheckMojo.java:576)
[2020-09-21T00:37:31.862Z] at org.codehaus.plexus.classworlds.launcher.Launcher.mainWithExitCode (Launcher.java:406)
[2020-09-21T00:37:31.862Z] at org.apache.maven.plugin.DefaultBuildPluginManager.executeMojo (DefaultBuildPluginManager.java:137)
[2020-09-21T00:37:31.862Z] at org.codehaus.plexus.classworlds.launcher.Launcher.main (Launcher.java:347)
[2020-09-21T00:37:31.862Z] at org.apache.maven.lifecycle.internal.MojoExecutor.execute (MojoExecutor.java:210)
[2020-09-21T00:37:31.862Z] Caused by: org.apache.maven.plugin.MojoFailureException: You have 1 Checkstyle violation.
[2020-09-21T00:37:31.863Z] at org.apache.maven.lifecycle.internal.MojoExecutor.execute (MojoExecutor.java:156)
[2020-09-21T00:37:31.863Z] at org.apache.maven.plugins.checkstyle.CheckstyleViolationCheckMojo.execute (CheckstyleViolationCheckMojo.java:576)
[2020-09-21T00:37:31.863Z] at org.apache.maven.lifecycle.internal.MojoExecutor.execute (MojoExecutor.java:148)
[2020-09-21T00:37:31.863Z] at org.apache.maven.plugin.DefaultBuildPluginManager.executeMojo (DefaultBuildPluginManager.java:137)
[2020-09-21T00:37:31.863Z] at org.apache.maven.lifecycle.internal.LifecycleModuleBuilder.buildProject (LifecycleModuleBuilder.java:117)
[2020-09-21T00:37:31.863Z] at org.apache.maven.lifecycle.internal.MojoExecutor.execute (MojoExecutor.java:210)
[2020-09-21T00:37:31.863Z] at org.apache.maven.lifecycle.internal.LifecycleModuleBuilder.buildProject (LifecycleModuleBuilder.java:81)
[2020-09-21T00:37:31.863Z] at org.apache.maven.lifecycle.internal.MojoExecutor.execute (MojoExecutor.java:156)
[2020-09-21T00:37:31.864Z] at org.apache.maven.lifecycle.internal.builder.singlethreaded.SingleThreadedBuilder.build (SingleThreadedBuilder.java:56)
[2020-09-21T00:37:31.864Z] at org.apache.maven.lifecycle.internal.MojoExecutor.execute (MojoExecutor.java:148)
[2020-09-21T00:37:31.864Z] at org.apache.maven.lifecycle.internal.LifecycleStarter.execute (LifecycleStarter.java:128)
[2020-09-21T00:37:31.864Z] at org.apache.maven.lifecycle.internal.LifecycleModuleBuilder.buildProject (LifecycleModuleBuilder.java:117)
[2020-09-21T00:37:31.864Z] at org.apache.maven.DefaultMaven.doExecute (DefaultMaven.java:305)
[2020-09-21T00:37:31.864Z] at org.apache.maven.lifecycle.internal.LifecycleModuleBuilder.buildProject (LifecycleModuleBuilder.java:81)
[2020-09-21T00:37:31.864Z] at org.apache.maven.DefaultMaven.doExecute (DefaultMaven.java:192)
[2020-09-21T00:37:31.865Z] at org.apache.maven.lifecycle.internal.builder.singlethreaded.SingleThreadedBuilder.build (SingleThreadedBuilder.java:56)
[2020-09-21T00:37:31.865Z] at org.apache.maven.DefaultMaven.execute (DefaultMaven.java:105)
[2020-09-21T00:37:31.865Z] at org.apache.maven.cli.MavenCli.execute (MavenCli.java:956)
[2020-09-21T00:37:31.865Z] at org.apache.maven.lifecycle.internal.LifecycleStarter.execute (LifecycleStarter.java:128)
[2020-09-21T00:37:31.865Z] at org.apache.maven.cli.MavenCli.doMain (MavenCli.java:288)
[2020-09-21T00:37:31.865Z] at org.apache.maven.DefaultMaven.doExecute (DefaultMaven.java:305)
[2020-09-21T00:37:31.865Z] at org.apache.maven.cli.MavenCli.main (MavenCli.java:192)
[2020-09-21T00:37:31.865Z] at org.apache.maven.DefaultMaven.doExecute (DefaultMaven.java:192)
[2020-09-21T00:37:31.866Z] at sun.reflect.NativeMethodAccessorImpl.invoke0 (Native Method)
[2020-09-21T00:37:31.866Z] at org.apache.maven.DefaultMaven.execute (DefaultMaven.java:105)
[2020-09-21T00:37:31.866Z] at sun.reflect.NativeMethodAccessorImpl.invoke (NativeMethodAccessorImpl.java:62)
[2020-09-21T00:37:31.866Z] at org.apache.maven.cli.MavenCli.execute (MavenCli.java:956)
[2020-09-21T00:37:31.866Z] at sun.reflect.DelegatingMethodAccessorImpl.invoke (DelegatingMethodAccessorImpl.java:43)
[2020-09-21T00:37:31.866Z] at org.apache.maven.cli.MavenCli.doMain (MavenCli.java:288)
[2020-09-21T00:37:31.866Z] at java.lang.reflect.Method.invoke (Method.java:498)
[2020-09-21T00:37:31.867Z] at org.apache.maven.cli.MavenCli.main (MavenCli.java:192)
[2020-09-21T00:37:31.867Z] at org.codehaus.plexus.classworlds.launcher.Launcher.launchEnhanced (Launcher.java:282)
[2020-09-21T00:37:31.867Z] at sun.reflect.NativeMethodAccessorImpl.invoke0 (Native Method)
[2020-09-21T00:37:31.867Z] at org.codehaus.plexus.classworlds.launcher.Launcher.launch (Launcher.java:225)
[2020-09-21T00:37:31.867Z] at sun.reflect.NativeMethodAccessorImpl.invoke (NativeMethodAccessorImpl.java:62)
[2020-09-21T00:37:31.867Z] at org.codehaus.plexus.classworlds.launcher.Launcher.mainWithExitCode (Launcher.java:406)
[2020-09-21T00:37:31.867Z] at sun.reflect.DelegatingMethodAccessorImpl.invoke (DelegatingMethodAccessorImpl.java:43)
[2020-09-21T00:37:31.867Z] at org.codehaus.plexus.classworlds.launcher.Launcher.main (Launcher.java:347)
[2020-09-21T00:37:31.868Z] at java.lang.reflect.Method.invoke (Method.java:498)
[2020-09-21T00:37:31.868Z] [ERROR]
[2020-09-21T00:37:31.868Z] at org.codehaus.plexus.classworlds.launcher.Launcher.launchEnhanced (Launcher.java:282)
[2020-09-21T00:37:31.868Z] [ERROR] Re-run Maven using the -X switch to enable full debug logging.
[2020-09-21T00:37:31.868Z] [ERROR]
[2020-09-21T00:37:31.868Z] at org.codehaus.plexus.classworlds.launcher.Launcher.launch (Launcher.java:225)
[2020-09-21T00:37:31.868Z] [ERROR] For more information about the errors and possible solutions, please read the following articles:
[2020-09-21T00:37:31.869Z] at org.codehaus.plexus.classworlds.launcher.Launcher.mainWithExitCode (Launcher.java:406)
[2020-09-21T00:37:31.869Z] [ERROR] [Help 1] http://cwiki.apache.org/confluence/display/MAVEN/MojoFailureException
[2020-09-21T00:37:31.869Z] at org.codehaus.plexus.classworlds.launcher.Launcher.main (Launcher.java:347)
[2020-09-21T00:37:31.869Z] [ERROR]
[2020-09-21T00:37:31.869Z] [ERROR]
[2020-09-21T00:37:31.869Z] [ERROR] After correcting the problems, you can resume the build with the command
[2020-09-21T00:37:31.869Z] [ERROR] Re-run Maven using the -X switch to enable full debug logging.
[2020-09-21T00:37:31.869Z] [ERROR] mvn <args> -rf :surefire-booter
[2020-09-21T00:37:31.870Z] [ERROR]
[2020-09-21T00:37:31.870Z] [ERROR] For more information about the errors and possible solutions, please read the following articles:
[2020-09-21T00:37:31.870Z] [ERROR] [Help 1] http://cwiki.apache.org/confluence/display/MAVEN/MojoFailureException
[2020-09-21T00:37:31.870Z] [ERROR]
[2020-09-21T00:37:31.871Z] [ERROR] After correcting the problems, you can resume the build with the command
[2020-09-21T00:37:31.871Z] [ERROR] mvn <args> -rf :surefire-booter
[Pipeline] }
[Pipeline] // withEnv
[Pipeline] }
[Pipeline] // stage
[Pipeline] fileExists
[Pipeline] }
[Pipeline] // withEnv
[Pipeline] fileExists
[Pipeline] }
[Pipeline] // stage
[Pipeline] fileExists
[Pipeline] archiveArtifacts
[2020-09-21T00:37:33.158Z] Archiving artifacts
[Pipeline] fileExists
[Pipeline] archiveArtifacts
[2020-09-21T00:37:33.569Z] Archiving artifacts
[Pipeline] cleanWs
[2020-09-21T00:37:34.387Z] [WS-CLEANUP] Deleting project workspace...
[2020-09-21T00:37:34.388Z] [WS-CLEANUP] Deferred wipeout is used...
[Pipeline] cleanWs
[2020-09-21T00:37:34.497Z] [WS-CLEANUP] done
[2020-09-21T00:37:34.536Z] [WS-CLEANUP] Deleting project workspace...
[2020-09-21T00:37:34.536Z] [WS-CLEANUP] Deferred wipeout is used...
[2020-09-21T00:37:34.612Z] [WS-CLEANUP] done
[Pipeline] }
[Pipeline] // ws
[Pipeline] }
[Pipeline] }
[Pipeline] // timestamps
[Pipeline] // ws
[Pipeline] }
[Pipeline] }
[Pipeline] // node
[Pipeline] // timestamps
[Pipeline] }
[Pipeline] }
[Pipeline] // node
[Pipeline] }
[Pipeline] // parallel
[Pipeline] echo
Build result: FAILURE
[Pipeline] jiraIssueSelector
[Pipeline] echo
The authors of changes [tibordigana].
[Pipeline] echo
Sending email ...
[Pipeline] emailext