You are viewing a plain text version of this content. The canonical link for it is here.
Posted to builds@beam.apache.org by Apache Jenkins Server <je...@builds.apache.org> on 2023/02/18 20:13:35 UTC
Build failed in Jenkins: beam_PreCommit_SQL_Java17_Cron #1509
See <https://ci-beam.apache.org/job/beam_PreCommit_SQL_Java17_Cron/1509/display/redirect>
Changes:
------------------------------------------
[...truncated 304.17 KB...]
org.apache.beam.sdk.extensions.sql.meta.provider.text.TextTableProviderTest > testJson FAILED
java.lang.IllegalArgumentException at TextTableProviderTest.java:224
org.apache.beam.sdk.extensions.sql.meta.provider.text.TextTableProviderTest > testWriteCsv FAILED
java.lang.IllegalArgumentException at TextTableProviderTest.java:282
org.apache.beam.sdk.extensions.sql.meta.provider.text.TextTableProviderTest > testWriteJson FAILED
java.lang.IllegalArgumentException at TextTableProviderTest.java:301
org.apache.beam.sdk.extensions.sql.meta.provider.text.TextTableProviderTest > testExplicitCsv FAILED
java.lang.IllegalArgumentException at TextTableProviderTest.java:152
org.apache.beam.sdk.extensions.sql.meta.provider.text.TextTableProviderTest > testExplicitCsvExcel FAILED
java.lang.IllegalArgumentException at TextTableProviderTest.java:180
org.apache.beam.sdk.extensions.sql.meta.provider.text.TextTableProviderTest > testLegacyTdfCsv FAILED
java.lang.IllegalArgumentException at TextTableProviderTest.java:127
715 tests completed, 455 failed, 8 skipped
> Task :sdks:java:extensions:sql:runBasicExample
SLF4J: Class path contains multiple SLF4J bindings.
SLF4J: Found binding in [jar:file:/home/jenkins/.gradle/caches/modules-2/files-2.1/org.slf4j/slf4j-jdk14/1.7.30/d35953dd2fe54ebe39fdf18cfd82fe6eb35b25ed/slf4j-jdk14-1.7.30.jar!/org/slf4j/impl/StaticLoggerBinder.class]
SLF4J: Found binding in [jar:file:/home/jenkins/.gradle/caches/modules-2/files-2.1/org.slf4j/slf4j-reload4j/1.7.36/db708f7d959dee1857ac524636e85ecf2e1781c1/slf4j-reload4j-1.7.36.jar!/org/slf4j/impl/StaticLoggerBinder.class]
SLF4J: Found binding in [jar:file:/home/jenkins/.gradle/caches/modules-2/files-2.1/org.slf4j/slf4j-log4j12/1.7.30/c21f55139d8141d2231214fb1feaf50a1edca95e/slf4j-log4j12-1.7.30.jar!/org/slf4j/impl/StaticLoggerBinder.class]
SLF4J: See http://www.slf4j.org/codes.html#multiple_bindings for an explanation.
SLF4J: Actual binding is of type [org.slf4j.impl.JDK14LoggerFactory]
> Task :runners:flink:1.12:job-server:distZip
> Task :runners:flink:1.13:job-server:distZip
> Task :runners:flink:1.14:job-server:distZip
> Task :runners:flink:1.15:job-server:distZip
> Task :sdks:java:extensions:sql:runBasicExample
Feb 18, 2023 8:12:07 PM org.apache.beam.sdk.extensions.sql.impl.CalciteQueryPlanner convertToBeamRel
INFO: SQL:
SELECT `PCOLLECTION`.`c1`, `PCOLLECTION`.`c2`, `PCOLLECTION`.`c3`
FROM `beam`.`PCOLLECTION` AS `PCOLLECTION`
WHERE `PCOLLECTION`.`c1` > 1
Feb 18, 2023 8:12:08 PM org.apache.beam.sdk.extensions.sql.impl.CalciteQueryPlanner convertToBeamRel
INFO: SQLPlan>
LogicalProject(c1=[$0], c2=[$1], c3=[$2])
LogicalFilter(condition=[>($0, 1)])
BeamIOSourceRel(table=[[beam, PCOLLECTION]])
Feb 18, 2023 8:12:08 PM org.apache.beam.sdk.extensions.sql.impl.CalciteQueryPlanner convertToBeamRel
INFO: BEAMPlan>
BeamCalcRel(expr#0..2=[{inputs}], expr#3=[1], expr#4=[>($t0, $t3)], proj#0..2=[{exprs}], $condition=[$t4])
BeamIOSourceRel(table=[[beam, PCOLLECTION]])
Feb 18, 2023 8:12:08 PM org.apache.beam.sdk.extensions.sql.impl.CalciteQueryPlanner convertToBeamRel
INFO: SQL:
SELECT `CASE1_RESULT`.`c2`, SUM(`CASE1_RESULT`.`c3`)
FROM `beam`.`CASE1_RESULT` AS `CASE1_RESULT`
GROUP BY `CASE1_RESULT`.`c2`
Feb 18, 2023 8:12:08 PM org.apache.beam.sdk.extensions.sql.impl.CalciteQueryPlanner convertToBeamRel
INFO: SQLPlan>
LogicalAggregate(group=[{0}], EXPR$1=[SUM($1)])
LogicalProject(c2=[$1], c3=[$2])
BeamIOSourceRel(table=[[beam, CASE1_RESULT]])
Feb 18, 2023 8:12:08 PM org.apache.beam.sdk.extensions.sql.impl.CalciteQueryPlanner convertToBeamRel
INFO: BEAMPlan>
BeamAggregationRel(group=[{1}], EXPR$1=[SUM($2)])
BeamIOSourceRel(table=[[beam, CASE1_RESULT]])
Feb 18, 2023 8:12:09 PM org.apache.beam.sdk.Pipeline validate
WARNING: The following transforms do not have stable unique names: log_result, SqlTransform
PCOLLECTION: [3, row, 3.0]
PCOLLECTION: [2, row, 2.0]
CASE1_RESULT: [row, 5.0]
> Task :sdks:java:extensions:sql:runPojoExample
SLF4J: Class path contains multiple SLF4J bindings.
SLF4J: Found binding in [jar:file:/home/jenkins/.gradle/caches/modules-2/files-2.1/org.slf4j/slf4j-jdk14/1.7.30/d35953dd2fe54ebe39fdf18cfd82fe6eb35b25ed/slf4j-jdk14-1.7.30.jar!/org/slf4j/impl/StaticLoggerBinder.class]
SLF4J: Found binding in [jar:file:/home/jenkins/.gradle/caches/modules-2/files-2.1/org.slf4j/slf4j-reload4j/1.7.36/db708f7d959dee1857ac524636e85ecf2e1781c1/slf4j-reload4j-1.7.36.jar!/org/slf4j/impl/StaticLoggerBinder.class]
SLF4J: Found binding in [jar:file:/home/jenkins/.gradle/caches/modules-2/files-2.1/org.slf4j/slf4j-log4j12/1.7.30/c21f55139d8141d2231214fb1feaf50a1edca95e/slf4j-log4j12-1.7.30.jar!/org/slf4j/impl/StaticLoggerBinder.class]
SLF4J: See http://www.slf4j.org/codes.html#multiple_bindings for an explanation.
SLF4J: Actual binding is of type [org.slf4j.impl.JDK14LoggerFactory]
Feb 18, 2023 8:12:16 PM org.apache.beam.sdk.extensions.sql.impl.CalciteQueryPlanner convertToBeamRel
INFO: SQL:
SELECT `PCOLLECTION`.`id`, `PCOLLECTION`.`name`
FROM `beam`.`PCOLLECTION` AS `PCOLLECTION`
WHERE `PCOLLECTION`.`countryOfResidence` = 'Wonderland'
Feb 18, 2023 8:12:16 PM org.apache.beam.sdk.extensions.sql.impl.CalciteQueryPlanner convertToBeamRel
INFO: SQLPlan>
LogicalProject(id=[$2], name=[$1])
LogicalFilter(condition=[=($0, 'Wonderland')])
BeamIOSourceRel(table=[[beam, PCOLLECTION]])
Feb 18, 2023 8:12:16 PM org.apache.beam.sdk.extensions.sql.impl.CalciteQueryPlanner convertToBeamRel
INFO: BEAMPlan>
BeamCalcRel(expr#0..2=[{inputs}], expr#3=['Wonderland':VARCHAR], expr#4=[=($t0, $t3)], id=[$t2], name=[$t1], $condition=[$t4])
BeamIOSourceRel(table=[[beam, PCOLLECTION]])
Feb 18, 2023 8:12:17 PM org.apache.beam.sdk.extensions.sql.impl.CalciteQueryPlanner convertToBeamRel
INFO: SQL:
SELECT COUNT(`PCOLLECTION`.`id`)
FROM `beam`.`PCOLLECTION` AS `PCOLLECTION`
Feb 18, 2023 8:12:17 PM org.apache.beam.sdk.extensions.sql.impl.CalciteQueryPlanner convertToBeamRel
INFO: SQLPlan>
LogicalAggregate(group=[{}], EXPR$0=[COUNT()])
BeamIOSourceRel(table=[[beam, PCOLLECTION]])
Feb 18, 2023 8:12:17 PM org.apache.beam.sdk.extensions.sql.impl.CalciteQueryPlanner convertToBeamRel
INFO: BEAMPlan>
BeamAggregationRel(group=[{}], EXPR$0=[COUNT()])
BeamIOSourceRel(table=[[beam, PCOLLECTION]])
Feb 18, 2023 8:12:17 PM org.apache.beam.sdk.extensions.sql.impl.CalciteQueryPlanner convertToBeamRel
INFO: SQL:
SELECT `customers`.`name`, 'order id:' || CAST(`orders`.`id` AS VARCHAR)
FROM `beam`.`orders` AS `orders`
INNER JOIN `beam`.`customers` AS `customers` ON `orders`.`customerId` = `customers`.`id`
WHERE `customers`.`name` = 'Grault'
Feb 18, 2023 8:12:17 PM org.apache.beam.sdk.extensions.sql.impl.CalciteQueryPlanner convertToBeamRel
INFO: SQLPlan>
LogicalProject(name=[$3], EXPR$1=[||('order id:', CAST($1):VARCHAR NOT NULL)])
LogicalFilter(condition=[=($3, 'Grault')])
LogicalJoin(condition=[=($0, $4)], joinType=[inner])
BeamIOSourceRel(table=[[beam, orders]])
BeamIOSourceRel(table=[[beam, customers]])
Feb 18, 2023 8:12:17 PM org.apache.beam.sdk.extensions.sql.impl.CalciteQueryPlanner convertToBeamRel
INFO: BEAMPlan>
BeamCalcRel(expr#0..4=[{inputs}], expr#5=['order id:'], expr#6=[CAST($t1):VARCHAR NOT NULL], expr#7=[||($t5, $t6)], name=[$t3], EXPR$1=[$t7])
BeamCoGBKJoinRel(condition=[=($0, $4)], joinType=[inner])
BeamIOSourceRel(table=[[beam, orders]])
BeamCalcRel(expr#0..2=[{inputs}], expr#3=['Grault':VARCHAR], expr#4=[=($t1, $t3)], proj#0..2=[{exprs}], $condition=[$t4])
BeamIOSourceRel(table=[[beam, customers]])
Feb 18, 2023 8:12:18 PM org.apache.beam.sdk.Pipeline validate
WARNING: The following transforms do not have stable unique names: Create.Values, MapElements, SqlTransform
[4, Grault]: is from Wonderland
[1, Foo]: is from Wonderland
[3, Baz]: is from Wonderland
[3]: total customers in Wonderland
[Grault, order id:8]: ordered by 'Grault'
[Grault, order id:7]: ordered by 'Grault'
> Task :sdks:java:extensions:sql:shell:distZip
> Task :sdks:java:extensions:sql:shell:assemble
> Task :sdks:java:extensions:sql:shell:analyzeClassesDependencies FROM-CACHE
> Task :sdks:java:extensions:sql:shell:analyzeDependencies UP-TO-DATE
> Task :sdks:java:extensions:sql:shell:test NO-SOURCE
> Task :sdks:java:extensions:sql:shell:check UP-TO-DATE
> Task :sdks:java:extensions:sql:shell:build
> Task :sdks:java:extensions:sql:shell:buildDependents
> Task :runners:flink:1.12:job-server:shadowJar FROM-CACHE
> Task :runners:flink:1.13:job-server:shadowJar FROM-CACHE
> Task :runners:flink:1.14:job-server:shadowJar FROM-CACHE
> Task :runners:flink:1.15:job-server:shadowJar FROM-CACHE
> Task :runners:flink:1.12:job-server:startShadowScripts
> Task :runners:flink:1.13:job-server:startShadowScripts
> Task :runners:flink:1.12:job-server:shadowDistTar
> Task :runners:flink:1.13:job-server:shadowDistTar
> Task :runners:flink:1.15:job-server:startShadowScripts
> Task :runners:flink:1.14:job-server:startShadowScripts
> Task :runners:flink:1.15:job-server:shadowDistTar
> Task :runners:flink:1.14:job-server:shadowDistTar
> Task :runners:flink:1.12:job-server:shadowDistZip
> Task :runners:flink:1.12:job-server:assemble
> Task :runners:flink:1.12:job-server:test NO-SOURCE
> Task :runners:flink:1.12:job-server:check UP-TO-DATE
> Task :runners:flink:1.12:job-server:build
> Task :runners:flink:1.12:job-server:buildDependents
> Task :runners:flink:1.13:job-server:shadowDistZip
> Task :runners:flink:1.13:job-server:assemble
> Task :runners:flink:1.13:job-server:test NO-SOURCE
> Task :runners:flink:1.13:job-server:check UP-TO-DATE
> Task :runners:flink:1.13:job-server:build
> Task :runners:flink:1.13:job-server:buildDependents
> Task :runners:flink:1.15:job-server:shadowDistZip
> Task :runners:flink:1.15:job-server:assemble
> Task :runners:flink:1.15:job-server:test NO-SOURCE
> Task :runners:flink:1.15:job-server:check UP-TO-DATE
> Task :runners:flink:1.15:job-server:build
> Task :runners:flink:1.15:job-server:buildDependents
> Task :runners:flink:1.14:job-server:shadowDistZip
> Task :runners:flink:1.14:job-server:assemble
> Task :runners:flink:1.14:job-server:test NO-SOURCE
> Task :runners:flink:1.14:job-server:check UP-TO-DATE
> Task :runners:flink:1.14:job-server:build
> Task :runners:flink:1.14:job-server:buildDependents
> Task :sdks:java:extensions:sql:expansion-service:buildDependents
FAILURE: Build completed with 4 failures.
1: Task failed with an exception.
-----------
* What went wrong:
Execution failed for task ':sdks:java:extensions:sql:jdbc:test'.
> There were failing tests. See the report at: file://<https://ci-beam.apache.org/job/beam_PreCommit_SQL_Java17_Cron/ws/src/sdks/java/extensions/sql/jdbc/build/reports/tests/test/index.html>
* Try:
> Run with --stacktrace option to get the stack trace.
> Run with --info or --debug option to get more log output.
==============================================================================
2: Task failed with an exception.
-----------
* What went wrong:
Execution failed for task ':sdks:java:testing:nexmark:test'.
> There were failing tests. See the report at: file://<https://ci-beam.apache.org/job/beam_PreCommit_SQL_Java17_Cron/ws/src/sdks/java/testing/nexmark/build/reports/tests/test/index.html>
* Try:
> Run with --stacktrace option to get the stack trace.
> Run with --info or --debug option to get more log output.
==============================================================================
3: Task failed with an exception.
-----------
* What went wrong:
Execution failed for task ':sdks:java:extensions:sql:zetasql:test'.
> There were failing tests. See the report at: file://<https://ci-beam.apache.org/job/beam_PreCommit_SQL_Java17_Cron/ws/src/sdks/java/extensions/sql/zetasql/build/reports/tests/test/index.html>
* Try:
> Run with --stacktrace option to get the stack trace.
> Run with --info or --debug option to get more log output.
==============================================================================
4: Task failed with an exception.
-----------
* What went wrong:
Execution failed for task ':sdks:java:extensions:sql:test'.
> There were failing tests. See the report at: file://<https://ci-beam.apache.org/job/beam_PreCommit_SQL_Java17_Cron/ws/src/sdks/java/extensions/sql/build/reports/tests/test/index.html>
* Try:
> Run with --stacktrace option to get the stack trace.
> Run with --info or --debug option to get more log output.
==============================================================================
* Get more help at https://help.gradle.org
Deprecated Gradle features were used in this build, making it incompatible with Gradle 8.0.
You can use '--warning-mode all' to show the individual deprecation warnings and determine if they come from your own scripts or plugins.
See https://docs.gradle.org/7.5.1/userguide/command_line_interface.html#sec:command_line_warnings
BUILD FAILED in 3m 2s
256 actionable tasks: 139 executed, 117 from cache
Publishing build scan...
https://gradle.com/s/mzkfipyxrallk
Build step 'Invoke Gradle script' changed build result to FAILURE
Build step 'Invoke Gradle script' marked build as failure
---------------------------------------------------------------------
To unsubscribe, e-mail: builds-unsubscribe@beam.apache.org
For additional commands, e-mail: builds-help@beam.apache.org
Jenkins build is back to normal : beam_PreCommit_SQL_Java17_Cron #1521
Posted by Apache Jenkins Server <je...@builds.apache.org>.
See <https://ci-beam.apache.org/job/beam_PreCommit_SQL_Java17_Cron/1521/display/redirect?page=changes>
---------------------------------------------------------------------
To unsubscribe, e-mail: builds-unsubscribe@beam.apache.org
For additional commands, e-mail: builds-help@beam.apache.org
Build failed in Jenkins: beam_PreCommit_SQL_Java17_Cron #1520
Posted by Apache Jenkins Server <je...@builds.apache.org>.
See <https://ci-beam.apache.org/job/beam_PreCommit_SQL_Java17_Cron/1520/display/redirect>
Changes:
------------------------------------------
[...truncated 306.11 KB...]
org.apache.beam.sdk.extensions.sql.meta.provider.text.TextTableProviderTest > testJson FAILED
java.lang.IllegalArgumentException at TextTableProviderTest.java:224
org.apache.beam.sdk.extensions.sql.meta.provider.text.TextTableProviderTest > testWriteCsv FAILED
java.lang.IllegalArgumentException at TextTableProviderTest.java:282
org.apache.beam.sdk.extensions.sql.meta.provider.text.TextTableProviderTest > testWriteJson FAILED
java.lang.IllegalArgumentException at TextTableProviderTest.java:301
org.apache.beam.sdk.extensions.sql.meta.provider.text.TextTableProviderTest > testExplicitCsv FAILED
java.lang.IllegalArgumentException at TextTableProviderTest.java:152
org.apache.beam.sdk.extensions.sql.meta.provider.text.TextTableProviderTest > testExplicitCsvExcel FAILED
java.lang.IllegalArgumentException at TextTableProviderTest.java:180
org.apache.beam.sdk.extensions.sql.meta.provider.text.TextTableProviderTest > testLegacyTdfCsv FAILED
java.lang.IllegalArgumentException at TextTableProviderTest.java:127
715 tests completed, 455 failed, 8 skipped
> Task :sdks:java:extensions:sql:test FAILED
> Task :sdks:java:extensions:sql:runBasicExample
SLF4J: Class path contains multiple SLF4J bindings.
SLF4J: Found binding in [jar:file:/home/jenkins/.gradle/caches/modules-2/files-2.1/org.slf4j/slf4j-jdk14/1.7.30/d35953dd2fe54ebe39fdf18cfd82fe6eb35b25ed/slf4j-jdk14-1.7.30.jar!/org/slf4j/impl/StaticLoggerBinder.class]
SLF4J: Found binding in [jar:file:/home/jenkins/.gradle/caches/modules-2/files-2.1/org.slf4j/slf4j-reload4j/1.7.36/db708f7d959dee1857ac524636e85ecf2e1781c1/slf4j-reload4j-1.7.36.jar!/org/slf4j/impl/StaticLoggerBinder.class]
SLF4J: Found binding in [jar:file:/home/jenkins/.gradle/caches/modules-2/files-2.1/org.slf4j/slf4j-log4j12/1.7.30/c21f55139d8141d2231214fb1feaf50a1edca95e/slf4j-log4j12-1.7.30.jar!/org/slf4j/impl/StaticLoggerBinder.class]
SLF4J: See http://www.slf4j.org/codes.html#multiple_bindings for an explanation.
SLF4J: Actual binding is of type [org.slf4j.impl.JDK14LoggerFactory]
> Task :sdks:java:extensions:sql:shell:distZip
> Task :sdks:java:extensions:sql:runBasicExample
Feb 21, 2023 2:17:40 PM org.apache.beam.sdk.extensions.sql.impl.CalciteQueryPlanner convertToBeamRel
INFO: SQL:
SELECT `PCOLLECTION`.`c1`, `PCOLLECTION`.`c2`, `PCOLLECTION`.`c3`
FROM `beam`.`PCOLLECTION` AS `PCOLLECTION`
WHERE `PCOLLECTION`.`c1` > 1
Feb 21, 2023 2:17:40 PM org.apache.beam.sdk.extensions.sql.impl.CalciteQueryPlanner convertToBeamRel
INFO: SQLPlan>
LogicalProject(c1=[$0], c2=[$1], c3=[$2])
LogicalFilter(condition=[>($0, 1)])
BeamIOSourceRel(table=[[beam, PCOLLECTION]])
Feb 21, 2023 2:17:41 PM org.apache.beam.sdk.extensions.sql.impl.CalciteQueryPlanner convertToBeamRel
INFO: BEAMPlan>
BeamCalcRel(expr#0..2=[{inputs}], expr#3=[1], expr#4=[>($t0, $t3)], proj#0..2=[{exprs}], $condition=[$t4])
BeamIOSourceRel(table=[[beam, PCOLLECTION]])
Feb 21, 2023 2:17:41 PM org.apache.beam.sdk.extensions.sql.impl.CalciteQueryPlanner convertToBeamRel
INFO: SQL:
SELECT `CASE1_RESULT`.`c2`, SUM(`CASE1_RESULT`.`c3`)
FROM `beam`.`CASE1_RESULT` AS `CASE1_RESULT`
GROUP BY `CASE1_RESULT`.`c2`
Feb 21, 2023 2:17:41 PM org.apache.beam.sdk.extensions.sql.impl.CalciteQueryPlanner convertToBeamRel
INFO: SQLPlan>
LogicalAggregate(group=[{0}], EXPR$1=[SUM($1)])
LogicalProject(c2=[$1], c3=[$2])
BeamIOSourceRel(table=[[beam, CASE1_RESULT]])
Feb 21, 2023 2:17:42 PM org.apache.beam.sdk.extensions.sql.impl.CalciteQueryPlanner convertToBeamRel
INFO: BEAMPlan>
BeamAggregationRel(group=[{1}], EXPR$1=[SUM($2)])
BeamIOSourceRel(table=[[beam, CASE1_RESULT]])
Feb 21, 2023 2:17:42 PM org.apache.beam.sdk.Pipeline validate
WARNING: The following transforms do not have stable unique names: log_result, SqlTransform
PCOLLECTION: [3, row, 3.0]
PCOLLECTION: [2, row, 2.0]
CASE1_RESULT: [row, 5.0]
> Task :sdks:java:extensions:sql:runPojoExample
SLF4J: Class path contains multiple SLF4J bindings.
SLF4J: Found binding in [jar:file:/home/jenkins/.gradle/caches/modules-2/files-2.1/org.slf4j/slf4j-jdk14/1.7.30/d35953dd2fe54ebe39fdf18cfd82fe6eb35b25ed/slf4j-jdk14-1.7.30.jar!/org/slf4j/impl/StaticLoggerBinder.class]
SLF4J: Found binding in [jar:file:/home/jenkins/.gradle/caches/modules-2/files-2.1/org.slf4j/slf4j-reload4j/1.7.36/db708f7d959dee1857ac524636e85ecf2e1781c1/slf4j-reload4j-1.7.36.jar!/org/slf4j/impl/StaticLoggerBinder.class]
SLF4J: Found binding in [jar:file:/home/jenkins/.gradle/caches/modules-2/files-2.1/org.slf4j/slf4j-log4j12/1.7.30/c21f55139d8141d2231214fb1feaf50a1edca95e/slf4j-log4j12-1.7.30.jar!/org/slf4j/impl/StaticLoggerBinder.class]
SLF4J: See http://www.slf4j.org/codes.html#multiple_bindings for an explanation.
SLF4J: Actual binding is of type [org.slf4j.impl.JDK14LoggerFactory]
> Task :sdks:java:extensions:sql:shell:assemble
> Task :sdks:java:extensions:sql:shell:analyzeClassesDependencies FROM-CACHE
> Task :sdks:java:extensions:sql:shell:analyzeDependencies UP-TO-DATE
> Task :sdks:java:extensions:sql:shell:test NO-SOURCE
> Task :sdks:java:extensions:sql:shell:check UP-TO-DATE
> Task :sdks:java:extensions:sql:shell:build
> Task :sdks:java:extensions:sql:shell:buildDependents
> Task :sdks:java:extensions:sql:runPojoExample
Feb 21, 2023 2:17:52 PM org.apache.beam.sdk.extensions.sql.impl.CalciteQueryPlanner convertToBeamRel
INFO: SQL:
SELECT `PCOLLECTION`.`id`, `PCOLLECTION`.`name`
FROM `beam`.`PCOLLECTION` AS `PCOLLECTION`
WHERE `PCOLLECTION`.`countryOfResidence` = 'Wonderland'
Feb 21, 2023 2:17:52 PM org.apache.beam.sdk.extensions.sql.impl.CalciteQueryPlanner convertToBeamRel
INFO: SQLPlan>
LogicalProject(id=[$2], name=[$1])
LogicalFilter(condition=[=($0, 'Wonderland')])
BeamIOSourceRel(table=[[beam, PCOLLECTION]])
Feb 21, 2023 2:17:53 PM org.apache.beam.sdk.extensions.sql.impl.CalciteQueryPlanner convertToBeamRel
INFO: BEAMPlan>
BeamCalcRel(expr#0..2=[{inputs}], expr#3=['Wonderland':VARCHAR], expr#4=[=($t0, $t3)], id=[$t2], name=[$t1], $condition=[$t4])
BeamIOSourceRel(table=[[beam, PCOLLECTION]])
Feb 21, 2023 2:17:53 PM org.apache.beam.sdk.extensions.sql.impl.CalciteQueryPlanner convertToBeamRel
INFO: SQL:
SELECT COUNT(`PCOLLECTION`.`id`)
FROM `beam`.`PCOLLECTION` AS `PCOLLECTION`
Feb 21, 2023 2:17:53 PM org.apache.beam.sdk.extensions.sql.impl.CalciteQueryPlanner convertToBeamRel
INFO: SQLPlan>
LogicalAggregate(group=[{}], EXPR$0=[COUNT()])
BeamIOSourceRel(table=[[beam, PCOLLECTION]])
Feb 21, 2023 2:17:54 PM org.apache.beam.sdk.extensions.sql.impl.CalciteQueryPlanner convertToBeamRel
INFO: BEAMPlan>
BeamAggregationRel(group=[{}], EXPR$0=[COUNT()])
BeamIOSourceRel(table=[[beam, PCOLLECTION]])
Feb 21, 2023 2:17:54 PM org.apache.beam.sdk.extensions.sql.impl.CalciteQueryPlanner convertToBeamRel
INFO: SQL:
SELECT `customers`.`name`, 'order id:' || CAST(`orders`.`id` AS VARCHAR)
FROM `beam`.`orders` AS `orders`
INNER JOIN `beam`.`customers` AS `customers` ON `orders`.`customerId` = `customers`.`id`
WHERE `customers`.`name` = 'Grault'
Feb 21, 2023 2:17:54 PM org.apache.beam.sdk.extensions.sql.impl.CalciteQueryPlanner convertToBeamRel
INFO: SQLPlan>
LogicalProject(name=[$3], EXPR$1=[||('order id:', CAST($1):VARCHAR NOT NULL)])
LogicalFilter(condition=[=($3, 'Grault')])
LogicalJoin(condition=[=($0, $4)], joinType=[inner])
BeamIOSourceRel(table=[[beam, orders]])
BeamIOSourceRel(table=[[beam, customers]])
Feb 21, 2023 2:17:55 PM org.apache.beam.sdk.extensions.sql.impl.CalciteQueryPlanner convertToBeamRel
INFO: BEAMPlan>
BeamCalcRel(expr#0..4=[{inputs}], expr#5=['order id:'], expr#6=[CAST($t1):VARCHAR NOT NULL], expr#7=[||($t5, $t6)], name=[$t3], EXPR$1=[$t7])
BeamCoGBKJoinRel(condition=[=($0, $4)], joinType=[inner])
BeamIOSourceRel(table=[[beam, orders]])
BeamCalcRel(expr#0..2=[{inputs}], expr#3=['Grault':VARCHAR], expr#4=[=($t1, $t3)], proj#0..2=[{exprs}], $condition=[$t4])
BeamIOSourceRel(table=[[beam, customers]])
Feb 21, 2023 2:17:56 PM org.apache.beam.sdk.Pipeline validate
WARNING: The following transforms do not have stable unique names: Create.Values, MapElements, SqlTransform
[3, Baz]: is from Wonderland
[4, Grault]: is from Wonderland
[1, Foo]: is from Wonderland
[3]: total customers in Wonderland
[Grault, order id:7]: ordered by 'Grault'
[Grault, order id:8]: ordered by 'Grault'
> Task :runners:flink:1.12:job-server:shadowJar FROM-CACHE
> Task :runners:flink:1.13:job-server:shadowJar FROM-CACHE
> Task :runners:flink:1.15:job-server:shadowJar FROM-CACHE
> Task :runners:flink:1.14:job-server:shadowJar FROM-CACHE
> Task :runners:flink:1.12:job-server:startShadowScripts
> Task :runners:flink:1.13:job-server:startShadowScripts
> Task :runners:flink:1.12:job-server:shadowDistTar
> Task :runners:flink:1.13:job-server:shadowDistTar
> Task :runners:flink:1.15:job-server:startShadowScripts
> Task :runners:flink:1.14:job-server:startShadowScripts
> Task :runners:flink:1.15:job-server:shadowDistTar
> Task :runners:flink:1.14:job-server:shadowDistTar
> Task :runners:flink:1.12:job-server:shadowDistZip
> Task :runners:flink:1.13:job-server:shadowDistZip
> Task :runners:flink:1.12:job-server:assemble
> Task :runners:flink:1.12:job-server:test NO-SOURCE
> Task :runners:flink:1.12:job-server:check UP-TO-DATE
> Task :runners:flink:1.12:job-server:build
> Task :runners:flink:1.12:job-server:buildDependents
> Task :runners:flink:1.13:job-server:assemble
> Task :runners:flink:1.13:job-server:test NO-SOURCE
> Task :runners:flink:1.13:job-server:check UP-TO-DATE
> Task :runners:flink:1.13:job-server:build
> Task :runners:flink:1.13:job-server:buildDependents
> Task :runners:flink:1.15:job-server:shadowDistZip
> Task :runners:flink:1.14:job-server:shadowDistZip
> Task :runners:flink:1.15:job-server:assemble
> Task :runners:flink:1.15:job-server:test NO-SOURCE
> Task :runners:flink:1.15:job-server:check UP-TO-DATE
> Task :runners:flink:1.15:job-server:build
> Task :runners:flink:1.15:job-server:buildDependents
> Task :runners:flink:1.14:job-server:assemble
> Task :runners:flink:1.14:job-server:test NO-SOURCE
> Task :runners:flink:1.14:job-server:check UP-TO-DATE
> Task :runners:flink:1.14:job-server:build
> Task :runners:flink:1.14:job-server:buildDependents
> Task :sdks:java:extensions:sql:expansion-service:buildDependents
FAILURE: Build completed with 4 failures.
1: Task failed with an exception.
-----------
* What went wrong:
Execution failed for task ':sdks:java:extensions:sql:jdbc:test'.
> There were failing tests. See the report at: file://<https://ci-beam.apache.org/job/beam_PreCommit_SQL_Java17_Cron/ws/src/sdks/java/extensions/sql/jdbc/build/reports/tests/test/index.html>
* Try:
> Run with --stacktrace option to get the stack trace.
> Run with --info or --debug option to get more log output.
==============================================================================
2: Task failed with an exception.
-----------
* What went wrong:
Execution failed for task ':sdks:java:extensions:sql:zetasql:test'.
> There were failing tests. See the report at: file://<https://ci-beam.apache.org/job/beam_PreCommit_SQL_Java17_Cron/ws/src/sdks/java/extensions/sql/zetasql/build/reports/tests/test/index.html>
* Try:
> Run with --stacktrace option to get the stack trace.
> Run with --info or --debug option to get more log output.
==============================================================================
3: Task failed with an exception.
-----------
* What went wrong:
Execution failed for task ':sdks:java:testing:nexmark:test'.
> There were failing tests. See the report at: file://<https://ci-beam.apache.org/job/beam_PreCommit_SQL_Java17_Cron/ws/src/sdks/java/testing/nexmark/build/reports/tests/test/index.html>
* Try:
> Run with --stacktrace option to get the stack trace.
> Run with --info or --debug option to get more log output.
==============================================================================
4: Task failed with an exception.
-----------
* What went wrong:
Execution failed for task ':sdks:java:extensions:sql:test'.
> There were failing tests. See the report at: file://<https://ci-beam.apache.org/job/beam_PreCommit_SQL_Java17_Cron/ws/src/sdks/java/extensions/sql/build/reports/tests/test/index.html>
* Try:
> Run with --stacktrace option to get the stack trace.
> Run with --info or --debug option to get more log output.
==============================================================================
* Get more help at https://help.gradle.org
Deprecated Gradle features were used in this build, making it incompatible with Gradle 8.0.
You can use '--warning-mode all' to show the individual deprecation warnings and determine if they come from your own scripts or plugins.
See https://docs.gradle.org/7.5.1/userguide/command_line_interface.html#sec:command_line_warnings
BUILD FAILED in 5m 12s
256 actionable tasks: 139 executed, 117 from cache
Publishing build scan...
https://gradle.com/s/47sjtn5mxntes
Build step 'Invoke Gradle script' changed build result to FAILURE
Build step 'Invoke Gradle script' marked build as failure
---------------------------------------------------------------------
To unsubscribe, e-mail: builds-unsubscribe@beam.apache.org
For additional commands, e-mail: builds-help@beam.apache.org
Build failed in Jenkins: beam_PreCommit_SQL_Java17_Cron #1519
Posted by Apache Jenkins Server <je...@builds.apache.org>.
See <https://ci-beam.apache.org/job/beam_PreCommit_SQL_Java17_Cron/1519/display/redirect>
Changes:
------------------------------------------
[...truncated 303.77 KB...]
org.apache.beam.sdk.nexmark.queries.sql.SqlQuery2Test > org.apache.beam.sdk.nexmark.queries.sql.SqlQuery2Test$SqlQuery2TestCalcite.testSkipsEveryThirdElement FAILED
java.lang.IllegalArgumentException at SqlQuery2Test.java:92
org.apache.beam.sdk.nexmark.queries.sql.SqlQuery3Test > org.apache.beam.sdk.nexmark.queries.sql.SqlQuery3Test$SqlQuery3TestZetaSql.testJoinsPeopleWithAuctions FAILED
java.lang.IllegalArgumentException at SqlQuery3Test.java:110
org.apache.beam.sdk.nexmark.queries.sql.SqlQuery3Test > org.apache.beam.sdk.nexmark.queries.sql.SqlQuery3Test$SqlQuery3TestCalcite.testJoinsPeopleWithAuctions FAILED
java.lang.IllegalArgumentException at SqlQuery3Test.java:102
org.apache.beam.sdk.nexmark.queries.sql.SqlQuery7Test > testBids FAILED
java.lang.IllegalArgumentException at SqlQuery7Test.java:61
85 tests completed, 61 failed, 12 skipped
> Task :sdks:java:extensions:sql:test FAILED
org.apache.beam.sdk.extensions.sql.meta.provider.text.TextTableProviderTest > testLegacyTdfCsv FAILED
java.lang.IllegalArgumentException at TextTableProviderTest.java:127
715 tests completed, 455 failed, 8 skipped
> Task :sdks:java:extensions:sql:runBasicExample
SLF4J: Class path contains multiple SLF4J bindings.
SLF4J: Found binding in [jar:file:/home/jenkins/.gradle/caches/modules-2/files-2.1/org.slf4j/slf4j-jdk14/1.7.30/d35953dd2fe54ebe39fdf18cfd82fe6eb35b25ed/slf4j-jdk14-1.7.30.jar!/org/slf4j/impl/StaticLoggerBinder.class]
SLF4J: Found binding in [jar:file:/home/jenkins/.gradle/caches/modules-2/files-2.1/org.slf4j/slf4j-reload4j/1.7.36/db708f7d959dee1857ac524636e85ecf2e1781c1/slf4j-reload4j-1.7.36.jar!/org/slf4j/impl/StaticLoggerBinder.class]
SLF4J: Found binding in [jar:file:/home/jenkins/.gradle/caches/modules-2/files-2.1/org.slf4j/slf4j-log4j12/1.7.30/c21f55139d8141d2231214fb1feaf50a1edca95e/slf4j-log4j12-1.7.30.jar!/org/slf4j/impl/StaticLoggerBinder.class]
SLF4J: See http://www.slf4j.org/codes.html#multiple_bindings for an explanation.
SLF4J: Actual binding is of type [org.slf4j.impl.JDK14LoggerFactory]
> Task :runners:flink:1.12:job-server:distZip
> Task :runners:flink:1.13:job-server:distZip
> Task :runners:flink:1.14:job-server:distZip
> Task :runners:flink:1.15:job-server:distZip
> Task :sdks:java:extensions:sql:runBasicExample
Feb 21, 2023 8:12:06 AM org.apache.beam.sdk.extensions.sql.impl.CalciteQueryPlanner convertToBeamRel
INFO: SQL:
SELECT `PCOLLECTION`.`c1`, `PCOLLECTION`.`c2`, `PCOLLECTION`.`c3`
FROM `beam`.`PCOLLECTION` AS `PCOLLECTION`
WHERE `PCOLLECTION`.`c1` > 1
Feb 21, 2023 8:12:07 AM org.apache.beam.sdk.extensions.sql.impl.CalciteQueryPlanner convertToBeamRel
INFO: SQLPlan>
LogicalProject(c1=[$0], c2=[$1], c3=[$2])
LogicalFilter(condition=[>($0, 1)])
BeamIOSourceRel(table=[[beam, PCOLLECTION]])
Feb 21, 2023 8:12:07 AM org.apache.beam.sdk.extensions.sql.impl.CalciteQueryPlanner convertToBeamRel
INFO: BEAMPlan>
BeamCalcRel(expr#0..2=[{inputs}], expr#3=[1], expr#4=[>($t0, $t3)], proj#0..2=[{exprs}], $condition=[$t4])
BeamIOSourceRel(table=[[beam, PCOLLECTION]])
Feb 21, 2023 8:12:07 AM org.apache.beam.sdk.extensions.sql.impl.CalciteQueryPlanner convertToBeamRel
INFO: SQL:
SELECT `CASE1_RESULT`.`c2`, SUM(`CASE1_RESULT`.`c3`)
FROM `beam`.`CASE1_RESULT` AS `CASE1_RESULT`
GROUP BY `CASE1_RESULT`.`c2`
Feb 21, 2023 8:12:07 AM org.apache.beam.sdk.extensions.sql.impl.CalciteQueryPlanner convertToBeamRel
INFO: SQLPlan>
LogicalAggregate(group=[{0}], EXPR$1=[SUM($1)])
LogicalProject(c2=[$1], c3=[$2])
BeamIOSourceRel(table=[[beam, CASE1_RESULT]])
Feb 21, 2023 8:12:08 AM org.apache.beam.sdk.extensions.sql.impl.CalciteQueryPlanner convertToBeamRel
INFO: BEAMPlan>
BeamAggregationRel(group=[{1}], EXPR$1=[SUM($2)])
BeamIOSourceRel(table=[[beam, CASE1_RESULT]])
Feb 21, 2023 8:12:08 AM org.apache.beam.sdk.Pipeline validate
WARNING: The following transforms do not have stable unique names: log_result, SqlTransform
PCOLLECTION: [2, row, 2.0]
PCOLLECTION: [3, row, 3.0]
CASE1_RESULT: [row, 5.0]
> Task :sdks:java:extensions:sql:runPojoExample
SLF4J: Class path contains multiple SLF4J bindings.
SLF4J: Found binding in [jar:file:/home/jenkins/.gradle/caches/modules-2/files-2.1/org.slf4j/slf4j-jdk14/1.7.30/d35953dd2fe54ebe39fdf18cfd82fe6eb35b25ed/slf4j-jdk14-1.7.30.jar!/org/slf4j/impl/StaticLoggerBinder.class]
SLF4J: Found binding in [jar:file:/home/jenkins/.gradle/caches/modules-2/files-2.1/org.slf4j/slf4j-reload4j/1.7.36/db708f7d959dee1857ac524636e85ecf2e1781c1/slf4j-reload4j-1.7.36.jar!/org/slf4j/impl/StaticLoggerBinder.class]
SLF4J: Found binding in [jar:file:/home/jenkins/.gradle/caches/modules-2/files-2.1/org.slf4j/slf4j-log4j12/1.7.30/c21f55139d8141d2231214fb1feaf50a1edca95e/slf4j-log4j12-1.7.30.jar!/org/slf4j/impl/StaticLoggerBinder.class]
SLF4J: See http://www.slf4j.org/codes.html#multiple_bindings for an explanation.
SLF4J: Actual binding is of type [org.slf4j.impl.JDK14LoggerFactory]
Feb 21, 2023 8:12:15 AM org.apache.beam.sdk.extensions.sql.impl.CalciteQueryPlanner convertToBeamRel
INFO: SQL:
SELECT `PCOLLECTION`.`id`, `PCOLLECTION`.`name`
FROM `beam`.`PCOLLECTION` AS `PCOLLECTION`
WHERE `PCOLLECTION`.`countryOfResidence` = 'Wonderland'
Feb 21, 2023 8:12:15 AM org.apache.beam.sdk.extensions.sql.impl.CalciteQueryPlanner convertToBeamRel
INFO: SQLPlan>
LogicalProject(id=[$1], name=[$0])
LogicalFilter(condition=[=($2, 'Wonderland')])
BeamIOSourceRel(table=[[beam, PCOLLECTION]])
Feb 21, 2023 8:12:15 AM org.apache.beam.sdk.extensions.sql.impl.CalciteQueryPlanner convertToBeamRel
INFO: BEAMPlan>
BeamCalcRel(expr#0..2=[{inputs}], expr#3=['Wonderland':VARCHAR], expr#4=[=($t2, $t3)], id=[$t1], name=[$t0], $condition=[$t4])
BeamIOSourceRel(table=[[beam, PCOLLECTION]])
Feb 21, 2023 8:12:16 AM org.apache.beam.sdk.extensions.sql.impl.CalciteQueryPlanner convertToBeamRel
INFO: SQL:
SELECT COUNT(`PCOLLECTION`.`id`)
FROM `beam`.`PCOLLECTION` AS `PCOLLECTION`
Feb 21, 2023 8:12:16 AM org.apache.beam.sdk.extensions.sql.impl.CalciteQueryPlanner convertToBeamRel
INFO: SQLPlan>
LogicalAggregate(group=[{}], EXPR$0=[COUNT()])
BeamIOSourceRel(table=[[beam, PCOLLECTION]])
Feb 21, 2023 8:12:16 AM org.apache.beam.sdk.extensions.sql.impl.CalciteQueryPlanner convertToBeamRel
INFO: BEAMPlan>
BeamAggregationRel(group=[{}], EXPR$0=[COUNT()])
BeamIOSourceRel(table=[[beam, PCOLLECTION]])
Feb 21, 2023 8:12:16 AM org.apache.beam.sdk.extensions.sql.impl.CalciteQueryPlanner convertToBeamRel
INFO: SQL:
SELECT `customers`.`name`, 'order id:' || CAST(`orders`.`id` AS VARCHAR)
FROM `beam`.`orders` AS `orders`
INNER JOIN `beam`.`customers` AS `customers` ON `orders`.`customerId` = `customers`.`id`
WHERE `customers`.`name` = 'Grault'
Feb 21, 2023 8:12:16 AM org.apache.beam.sdk.extensions.sql.impl.CalciteQueryPlanner convertToBeamRel
INFO: SQLPlan>
LogicalProject(name=[$2], EXPR$1=[||('order id:', CAST($0):VARCHAR NOT NULL)])
LogicalFilter(condition=[=($2, 'Grault')])
LogicalJoin(condition=[=($1, $3)], joinType=[inner])
BeamIOSourceRel(table=[[beam, orders]])
BeamIOSourceRel(table=[[beam, customers]])
Feb 21, 2023 8:12:16 AM org.apache.beam.sdk.extensions.sql.impl.CalciteQueryPlanner convertToBeamRel
INFO: BEAMPlan>
BeamCalcRel(expr#0..4=[{inputs}], expr#5=['order id:'], expr#6=[CAST($t0):VARCHAR NOT NULL], expr#7=[||($t5, $t6)], name=[$t2], EXPR$1=[$t7])
BeamCoGBKJoinRel(condition=[=($1, $3)], joinType=[inner])
BeamIOSourceRel(table=[[beam, orders]])
BeamCalcRel(expr#0..2=[{inputs}], expr#3=['Grault':VARCHAR], expr#4=[=($t0, $t3)], proj#0..2=[{exprs}], $condition=[$t4])
BeamIOSourceRel(table=[[beam, customers]])
Feb 21, 2023 8:12:16 AM org.apache.beam.sdk.Pipeline validate
WARNING: The following transforms do not have stable unique names: Create.Values, MapElements, SqlTransform
[3, Baz]: is from Wonderland
[4, Grault]: is from Wonderland
[1, Foo]: is from Wonderland
[3]: total customers in Wonderland
[Grault, order id:8]: ordered by 'Grault'
[Grault, order id:7]: ordered by 'Grault'
> Task :sdks:java:extensions:sql:shell:distZip
> Task :sdks:java:extensions:sql:shell:assemble
> Task :sdks:java:extensions:sql:shell:analyzeClassesDependencies FROM-CACHE
> Task :sdks:java:extensions:sql:shell:analyzeDependencies UP-TO-DATE
> Task :sdks:java:extensions:sql:shell:test NO-SOURCE
> Task :sdks:java:extensions:sql:shell:check UP-TO-DATE
> Task :sdks:java:extensions:sql:shell:build
> Task :sdks:java:extensions:sql:shell:buildDependents
> Task :runners:flink:1.13:job-server:shadowJar FROM-CACHE
> Task :runners:flink:1.12:job-server:shadowJar FROM-CACHE
> Task :runners:flink:1.15:job-server:shadowJar FROM-CACHE
> Task :runners:flink:1.14:job-server:shadowJar FROM-CACHE
> Task :runners:flink:1.13:job-server:startShadowScripts
> Task :runners:flink:1.12:job-server:startShadowScripts
> Task :runners:flink:1.13:job-server:shadowDistTar
> Task :runners:flink:1.12:job-server:shadowDistTar
> Task :runners:flink:1.15:job-server:startShadowScripts
> Task :runners:flink:1.14:job-server:startShadowScripts
> Task :runners:flink:1.15:job-server:shadowDistTar
> Task :runners:flink:1.14:job-server:shadowDistTar
> Task :runners:flink:1.13:job-server:shadowDistZip
> Task :runners:flink:1.13:job-server:assemble
> Task :runners:flink:1.13:job-server:test NO-SOURCE
> Task :runners:flink:1.13:job-server:check UP-TO-DATE
> Task :runners:flink:1.13:job-server:build
> Task :runners:flink:1.13:job-server:buildDependents
> Task :runners:flink:1.12:job-server:shadowDistZip
> Task :runners:flink:1.12:job-server:assemble
> Task :runners:flink:1.12:job-server:test NO-SOURCE
> Task :runners:flink:1.12:job-server:check UP-TO-DATE
> Task :runners:flink:1.12:job-server:build
> Task :runners:flink:1.12:job-server:buildDependents
> Task :runners:flink:1.15:job-server:shadowDistZip
> Task :runners:flink:1.15:job-server:assemble
> Task :runners:flink:1.15:job-server:test NO-SOURCE
> Task :runners:flink:1.15:job-server:check UP-TO-DATE
> Task :runners:flink:1.15:job-server:build
> Task :runners:flink:1.15:job-server:buildDependents
> Task :runners:flink:1.14:job-server:shadowDistZip
> Task :runners:flink:1.14:job-server:assemble
> Task :runners:flink:1.14:job-server:test NO-SOURCE
> Task :runners:flink:1.14:job-server:check UP-TO-DATE
> Task :runners:flink:1.14:job-server:build
> Task :runners:flink:1.14:job-server:buildDependents
> Task :sdks:java:extensions:sql:expansion-service:buildDependents
FAILURE: Build completed with 4 failures.
1: Task failed with an exception.
-----------
* What went wrong:
Execution failed for task ':sdks:java:extensions:sql:jdbc:test'.
> There were failing tests. See the report at: file://<https://ci-beam.apache.org/job/beam_PreCommit_SQL_Java17_Cron/ws/src/sdks/java/extensions/sql/jdbc/build/reports/tests/test/index.html>
* Try:
> Run with --stacktrace option to get the stack trace.
> Run with --info or --debug option to get more log output.
==============================================================================
2: Task failed with an exception.
-----------
* What went wrong:
Execution failed for task ':sdks:java:extensions:sql:zetasql:test'.
> There were failing tests. See the report at: file://<https://ci-beam.apache.org/job/beam_PreCommit_SQL_Java17_Cron/ws/src/sdks/java/extensions/sql/zetasql/build/reports/tests/test/index.html>
* Try:
> Run with --stacktrace option to get the stack trace.
> Run with --info or --debug option to get more log output.
==============================================================================
3: Task failed with an exception.
-----------
* What went wrong:
Execution failed for task ':sdks:java:testing:nexmark:test'.
> There were failing tests. See the report at: file://<https://ci-beam.apache.org/job/beam_PreCommit_SQL_Java17_Cron/ws/src/sdks/java/testing/nexmark/build/reports/tests/test/index.html>
* Try:
> Run with --stacktrace option to get the stack trace.
> Run with --info or --debug option to get more log output.
==============================================================================
4: Task failed with an exception.
-----------
* What went wrong:
Execution failed for task ':sdks:java:extensions:sql:test'.
> There were failing tests. See the report at: file://<https://ci-beam.apache.org/job/beam_PreCommit_SQL_Java17_Cron/ws/src/sdks/java/extensions/sql/build/reports/tests/test/index.html>
* Try:
> Run with --stacktrace option to get the stack trace.
> Run with --info or --debug option to get more log output.
==============================================================================
* Get more help at https://help.gradle.org
Deprecated Gradle features were used in this build, making it incompatible with Gradle 8.0.
You can use '--warning-mode all' to show the individual deprecation warnings and determine if they come from your own scripts or plugins.
See https://docs.gradle.org/7.5.1/userguide/command_line_interface.html#sec:command_line_warnings
BUILD FAILED in 3m 2s
256 actionable tasks: 139 executed, 117 from cache
Publishing build scan...
https://gradle.com/s/qyjq2uqmjcy6k
Build step 'Invoke Gradle script' changed build result to FAILURE
Build step 'Invoke Gradle script' marked build as failure
---------------------------------------------------------------------
To unsubscribe, e-mail: builds-unsubscribe@beam.apache.org
For additional commands, e-mail: builds-help@beam.apache.org
Build failed in Jenkins: beam_PreCommit_SQL_Java17_Cron #1518
Posted by Apache Jenkins Server <je...@builds.apache.org>.
See <https://ci-beam.apache.org/job/beam_PreCommit_SQL_Java17_Cron/1518/display/redirect?page=changes>
Changes:
[noreply] [prism] Add in element manager (#25565)
------------------------------------------
[...truncated 304.79 KB...]
org.apache.beam.sdk.extensions.sql.meta.provider.test.TestTableProviderWithFilterPushDown > testIOSourceRel_withSupportedFilter_selectInRandomOrder FAILED
java.lang.IllegalArgumentException at TestTableProviderWithFilterPushDown.java:144
org.apache.beam.sdk.extensions.sql.meta.provider.test.TestTableProviderWithFilterPushDown > testIOSourceRel_selectAll_withSupportedFilter_shouldDropCalc FAILED
java.lang.IllegalArgumentException at TestTableProviderWithFilterPushDown.java:123
org.apache.beam.sdk.extensions.sql.meta.provider.test.TestTableProviderWithFilterPushDown > testIOSourceRel_withFilter_shouldProjectAllFields FAILED
java.lang.IllegalArgumentException at TestTableProviderWithFilterPushDown.java:101
org.apache.beam.sdk.extensions.sql.meta.provider.test.TestTableProviderWithFilterPushDown > testIOSourceRel_selectAllFieldsInRandomOrder_shouldPushDownSupportedFilter FAILED
java.lang.IllegalArgumentException at TestTableProviderWithFilterPushDown.java:194
org.apache.beam.sdk.extensions.sql.meta.provider.test.TestTableProviderWithFilterPushDown > testIOSourceRel_selectOneFieldsMoreThanOnce_withSupportedPredicate FAILED
java.lang.IllegalArgumentException at TestTableProviderWithFilterPushDown.java:261
org.apache.beam.sdk.extensions.sql.meta.provider.test.TestTableProviderWithFilterPushDown > testIOSourceRel_selectOneFieldsMoreThanOnce FAILED
java.lang.IllegalArgumentException at TestTableProviderWithFilterPushDown.java:226
org.apache.beam.sdk.extensions.sql.meta.provider.test.TestTableProviderWithFilterPushDown > testIOSourceRel_withUnsupportedFilter_calcPreservesCondition FAILED
java.lang.IllegalArgumentException at TestTableProviderWithFilterPushDown.java:172
org.apache.beam.sdk.extensions.sql.meta.provider.test.TestTableProviderWithProjectPushDown > testIOSourceRel_withPredicate FAILED
java.lang.IllegalArgumentException at TestTableProviderWithProjectPushDown.java:134
org.apache.beam.sdk.extensions.sql.meta.provider.test.TestTableProviderWithProjectPushDown > testIOSourceRel_withNoPredicate FAILED
java.lang.IllegalArgumentException at TestTableProviderWithProjectPushDown.java:97
org.apache.beam.sdk.extensions.sql.meta.provider.test.TestTableProviderWithProjectPushDown > testIOSourceRel_withPredicate_withRename FAILED
java.lang.IllegalArgumentException at TestTableProviderWithProjectPushDown.java:152
org.apache.beam.sdk.extensions.sql.meta.provider.test.TestTableProviderWithProjectPushDown > testIOSourceRel_AllFields FAILED
java.lang.IllegalArgumentException at TestTableProviderWithProjectPushDown.java:171
org.apache.beam.sdk.extensions.sql.meta.provider.test.TestTableProviderWithProjectPushDown > testIOSourceRel_withNoPredicate_withRename FAILED
java.lang.IllegalArgumentException at TestTableProviderWithProjectPushDown.java:115
org.apache.beam.sdk.extensions.sql.meta.provider.test.TestTableProviderWithProjectPushDown > testIOSourceRel_selectOneFieldsMoreThanOnce_withSupportedPredicate FAILED
java.lang.IllegalArgumentException at TestTableProviderWithProjectPushDown.java:224
org.apache.beam.sdk.extensions.sql.meta.provider.test.TestTableProviderWithProjectPushDown > testIOSourceRel_selectOneFieldsMoreThanOnce FAILED
java.lang.IllegalArgumentException at TestTableProviderWithProjectPushDown.java:193
org.apache.beam.sdk.extensions.sql.meta.provider.text.TextTableProviderTest > testLegacyDefaultCsv FAILED
java.lang.IllegalArgumentException at TextTableProviderTest.java:94
org.apache.beam.sdk.extensions.sql.meta.provider.text.TextTableProviderTest > testWriteLines FAILED
java.lang.IllegalArgumentException at TextTableProviderTest.java:262
org.apache.beam.sdk.extensions.sql.meta.provider.text.TextTableProviderTest > testLines FAILED
java.lang.IllegalArgumentException at TextTableProviderTest.java:205
org.apache.beam.sdk.extensions.sql.meta.provider.text.TextTableProviderTest > testJson FAILED
java.lang.IllegalArgumentException at TextTableProviderTest.java:224
org.apache.beam.sdk.extensions.sql.meta.provider.text.TextTableProviderTest > testWriteCsv FAILED
java.lang.IllegalArgumentException at TextTableProviderTest.java:282
org.apache.beam.sdk.extensions.sql.meta.provider.text.TextTableProviderTest > testWriteJson FAILED
java.lang.IllegalArgumentException at TextTableProviderTest.java:301
org.apache.beam.sdk.extensions.sql.meta.provider.text.TextTableProviderTest > testExplicitCsv FAILED
java.lang.IllegalArgumentException at TextTableProviderTest.java:152
org.apache.beam.sdk.extensions.sql.meta.provider.text.TextTableProviderTest > testExplicitCsvExcel FAILED
java.lang.IllegalArgumentException at TextTableProviderTest.java:180
org.apache.beam.sdk.extensions.sql.meta.provider.text.TextTableProviderTest > testLegacyTdfCsv FAILED
java.lang.IllegalArgumentException at TextTableProviderTest.java:127
715 tests completed, 455 failed, 8 skipped
> Task :sdks:java:extensions:sql:runPojoExample
SLF4J: Class path contains multiple SLF4J bindings.
SLF4J: Found binding in [jar:file:/home/jenkins/.gradle/caches/modules-2/files-2.1/org.slf4j/slf4j-jdk14/1.7.30/d35953dd2fe54ebe39fdf18cfd82fe6eb35b25ed/slf4j-jdk14-1.7.30.jar!/org/slf4j/impl/StaticLoggerBinder.class]
SLF4J: Found binding in [jar:file:/home/jenkins/.gradle/caches/modules-2/files-2.1/org.slf4j/slf4j-reload4j/1.7.36/db708f7d959dee1857ac524636e85ecf2e1781c1/slf4j-reload4j-1.7.36.jar!/org/slf4j/impl/StaticLoggerBinder.class]
SLF4J: Found binding in [jar:file:/home/jenkins/.gradle/caches/modules-2/files-2.1/org.slf4j/slf4j-log4j12/1.7.30/c21f55139d8141d2231214fb1feaf50a1edca95e/slf4j-log4j12-1.7.30.jar!/org/slf4j/impl/StaticLoggerBinder.class]
SLF4J: See http://www.slf4j.org/codes.html#multiple_bindings for an explanation.
SLF4J: Actual binding is of type [org.slf4j.impl.JDK14LoggerFactory]
Feb 21, 2023 2:12:17 AM org.apache.beam.sdk.extensions.sql.impl.CalciteQueryPlanner convertToBeamRel
INFO: SQL:
SELECT `PCOLLECTION`.`id`, `PCOLLECTION`.`name`
FROM `beam`.`PCOLLECTION` AS `PCOLLECTION`
WHERE `PCOLLECTION`.`countryOfResidence` = 'Wonderland'
Feb 21, 2023 2:12:17 AM org.apache.beam.sdk.extensions.sql.impl.CalciteQueryPlanner convertToBeamRel
INFO: SQLPlan>
LogicalProject(id=[$2], name=[$1])
LogicalFilter(condition=[=($0, 'Wonderland')])
BeamIOSourceRel(table=[[beam, PCOLLECTION]])
Feb 21, 2023 2:12:18 AM org.apache.beam.sdk.extensions.sql.impl.CalciteQueryPlanner convertToBeamRel
INFO: BEAMPlan>
BeamCalcRel(expr#0..2=[{inputs}], expr#3=['Wonderland':VARCHAR], expr#4=[=($t0, $t3)], id=[$t2], name=[$t1], $condition=[$t4])
BeamIOSourceRel(table=[[beam, PCOLLECTION]])
Feb 21, 2023 2:12:18 AM org.apache.beam.sdk.extensions.sql.impl.CalciteQueryPlanner convertToBeamRel
INFO: SQL:
SELECT COUNT(`PCOLLECTION`.`id`)
FROM `beam`.`PCOLLECTION` AS `PCOLLECTION`
Feb 21, 2023 2:12:18 AM org.apache.beam.sdk.extensions.sql.impl.CalciteQueryPlanner convertToBeamRel
INFO: SQLPlan>
LogicalAggregate(group=[{}], EXPR$0=[COUNT()])
BeamIOSourceRel(table=[[beam, PCOLLECTION]])
Feb 21, 2023 2:12:18 AM org.apache.beam.sdk.extensions.sql.impl.CalciteQueryPlanner convertToBeamRel
INFO: BEAMPlan>
BeamAggregationRel(group=[{}], EXPR$0=[COUNT()])
BeamIOSourceRel(table=[[beam, PCOLLECTION]])
Feb 21, 2023 2:12:18 AM org.apache.beam.sdk.extensions.sql.impl.CalciteQueryPlanner convertToBeamRel
INFO: SQL:
SELECT `customers`.`name`, 'order id:' || CAST(`orders`.`id` AS VARCHAR)
FROM `beam`.`orders` AS `orders`
INNER JOIN `beam`.`customers` AS `customers` ON `orders`.`customerId` = `customers`.`id`
WHERE `customers`.`name` = 'Grault'
Feb 21, 2023 2:12:18 AM org.apache.beam.sdk.extensions.sql.impl.CalciteQueryPlanner convertToBeamRel
INFO: SQLPlan>
LogicalProject(name=[$3], EXPR$1=[||('order id:', CAST($1):VARCHAR NOT NULL)])
LogicalFilter(condition=[=($3, 'Grault')])
LogicalJoin(condition=[=($0, $4)], joinType=[inner])
BeamIOSourceRel(table=[[beam, orders]])
BeamIOSourceRel(table=[[beam, customers]])
Feb 21, 2023 2:12:19 AM org.apache.beam.sdk.extensions.sql.impl.CalciteQueryPlanner convertToBeamRel
INFO: BEAMPlan>
BeamCalcRel(expr#0..4=[{inputs}], expr#5=['order id:'], expr#6=[CAST($t1):VARCHAR NOT NULL], expr#7=[||($t5, $t6)], name=[$t3], EXPR$1=[$t7])
BeamCoGBKJoinRel(condition=[=($0, $4)], joinType=[inner])
BeamIOSourceRel(table=[[beam, orders]])
BeamCalcRel(expr#0..2=[{inputs}], expr#3=['Grault':VARCHAR], expr#4=[=($t1, $t3)], proj#0..2=[{exprs}], $condition=[$t4])
BeamIOSourceRel(table=[[beam, customers]])
Feb 21, 2023 2:12:19 AM org.apache.beam.sdk.Pipeline validate
WARNING: The following transforms do not have stable unique names: Create.Values, MapElements, SqlTransform
[4, Grault]: is from Wonderland
[1, Foo]: is from Wonderland
[3, Baz]: is from Wonderland
[3]: total customers in Wonderland
[Grault, order id:8]: ordered by 'Grault'
[Grault, order id:7]: ordered by 'Grault'
> Task :sdks:java:extensions:sql:shell:distZip
> Task :sdks:java:extensions:sql:shell:assemble
> Task :sdks:java:extensions:sql:shell:analyzeClassesDependencies FROM-CACHE
> Task :sdks:java:extensions:sql:shell:analyzeDependencies UP-TO-DATE
> Task :sdks:java:extensions:sql:shell:test NO-SOURCE
> Task :sdks:java:extensions:sql:shell:check UP-TO-DATE
> Task :sdks:java:extensions:sql:shell:build
> Task :sdks:java:extensions:sql:shell:buildDependents
> Task :runners:flink:1.13:job-server:shadowJar FROM-CACHE
> Task :runners:flink:1.12:job-server:shadowJar
> Task :runners:flink:1.12:job-server:shadowJar FROM-CACHE
> Task :runners:flink:1.14:job-server:shadowJar FROM-CACHE
> Task :runners:flink:1.15:job-server:shadowJar FROM-CACHE
> Task :runners:flink:1.13:job-server:startShadowScripts
> Task :runners:flink:1.12:job-server:startShadowScripts
> Task :runners:flink:1.13:job-server:shadowDistTar
> Task :runners:flink:1.12:job-server:shadowDistTar
> Task :runners:flink:1.14:job-server:startShadowScripts
> Task :runners:flink:1.15:job-server:startShadowScripts
> Task :runners:flink:1.15:job-server:shadowDistTar
> Task :runners:flink:1.14:job-server:shadowDistTar
> Task :runners:flink:1.13:job-server:shadowDistZip
> Task :runners:flink:1.13:job-server:assemble
> Task :runners:flink:1.13:job-server:test NO-SOURCE
> Task :runners:flink:1.13:job-server:check UP-TO-DATE
> Task :runners:flink:1.13:job-server:build
> Task :runners:flink:1.13:job-server:buildDependents
> Task :runners:flink:1.12:job-server:shadowDistZip
> Task :runners:flink:1.12:job-server:assemble
> Task :runners:flink:1.12:job-server:test NO-SOURCE
> Task :runners:flink:1.12:job-server:check UP-TO-DATE
> Task :runners:flink:1.12:job-server:build
> Task :runners:flink:1.12:job-server:buildDependents
> Task :runners:flink:1.15:job-server:shadowDistZip
> Task :runners:flink:1.15:job-server:assemble
> Task :runners:flink:1.15:job-server:test NO-SOURCE
> Task :runners:flink:1.15:job-server:check UP-TO-DATE
> Task :runners:flink:1.15:job-server:build
> Task :runners:flink:1.15:job-server:buildDependents
> Task :runners:flink:1.14:job-server:shadowDistZip
> Task :runners:flink:1.14:job-server:assemble
> Task :runners:flink:1.14:job-server:test NO-SOURCE
> Task :runners:flink:1.14:job-server:check UP-TO-DATE
> Task :runners:flink:1.14:job-server:build
> Task :runners:flink:1.14:job-server:buildDependents
> Task :sdks:java:extensions:sql:expansion-service:buildDependents
FAILURE: Build completed with 4 failures.
1: Task failed with an exception.
-----------
* What went wrong:
Execution failed for task ':sdks:java:extensions:sql:jdbc:test'.
> There were failing tests. See the report at: file://<https://ci-beam.apache.org/job/beam_PreCommit_SQL_Java17_Cron/ws/src/sdks/java/extensions/sql/jdbc/build/reports/tests/test/index.html>
* Try:
> Run with --stacktrace option to get the stack trace.
> Run with --info or --debug option to get more log output.
==============================================================================
2: Task failed with an exception.
-----------
* What went wrong:
Execution failed for task ':sdks:java:extensions:sql:zetasql:test'.
> There were failing tests. See the report at: file://<https://ci-beam.apache.org/job/beam_PreCommit_SQL_Java17_Cron/ws/src/sdks/java/extensions/sql/zetasql/build/reports/tests/test/index.html>
* Try:
> Run with --stacktrace option to get the stack trace.
> Run with --info or --debug option to get more log output.
==============================================================================
3: Task failed with an exception.
-----------
* What went wrong:
Execution failed for task ':sdks:java:testing:nexmark:test'.
> There were failing tests. See the report at: file://<https://ci-beam.apache.org/job/beam_PreCommit_SQL_Java17_Cron/ws/src/sdks/java/testing/nexmark/build/reports/tests/test/index.html>
* Try:
> Run with --stacktrace option to get the stack trace.
> Run with --info or --debug option to get more log output.
==============================================================================
4: Task failed with an exception.
-----------
* What went wrong:
Execution failed for task ':sdks:java:extensions:sql:test'.
> There were failing tests. See the report at: file://<https://ci-beam.apache.org/job/beam_PreCommit_SQL_Java17_Cron/ws/src/sdks/java/extensions/sql/build/reports/tests/test/index.html>
* Try:
> Run with --stacktrace option to get the stack trace.
> Run with --info or --debug option to get more log output.
==============================================================================
* Get more help at https://help.gradle.org
Deprecated Gradle features were used in this build, making it incompatible with Gradle 8.0.
You can use '--warning-mode all' to show the individual deprecation warnings and determine if they come from your own scripts or plugins.
See https://docs.gradle.org/7.5.1/userguide/command_line_interface.html#sec:command_line_warnings
BUILD FAILED in 3m 24s
256 actionable tasks: 139 executed, 117 from cache
Publishing build scan...
https://gradle.com/s/rqekt3hizwf5e
Build step 'Invoke Gradle script' changed build result to FAILURE
Build step 'Invoke Gradle script' marked build as failure
---------------------------------------------------------------------
To unsubscribe, e-mail: builds-unsubscribe@beam.apache.org
For additional commands, e-mail: builds-help@beam.apache.org
Build failed in Jenkins: beam_PreCommit_SQL_Java17_Cron #1517
Posted by Apache Jenkins Server <je...@builds.apache.org>.
See <https://ci-beam.apache.org/job/beam_PreCommit_SQL_Java17_Cron/1517/display/redirect?page=changes>
Changes:
[noreply] [#24789][prism] Add testdofns for later (#25557)
[noreply] [#24789][prism] Minimum required jobservices (#25556)
[noreply] [#24789][prism] Handlers for combine, ParDo, GBK, Flatten (#25558)
[noreply] [prism] Tiny lint fixes (#25564)
[noreply] minor error handling fixes (#25555)
------------------------------------------
[...truncated 312.49 KB...]
Caused by: java.lang.IllegalArgumentException at ClassInjector.java:1635
org.apache.beam.sdk.nexmark.queries.QueryTest > query4MatchesModelStreaming FAILED
org.apache.beam.sdk.Pipeline$PipelineExecutionException at QueryTest.java:69
Caused by: java.lang.IllegalArgumentException at ClassInjector.java:1635
org.apache.beam.sdk.nexmark.queries.QueryTest > query8MatchesModelStreaming FAILED
org.apache.beam.sdk.Pipeline$PipelineExecutionException at QueryTest.java:69
Caused by: java.lang.IllegalArgumentException at ClassInjector.java:1635
org.apache.beam.sdk.nexmark.queries.SessionSideInputJoinTest > queryMatchesModelBatchDirect FAILED
org.apache.beam.sdk.Pipeline$PipelineExecutionException at SessionSideInputJoinTest.java:97
Caused by: java.lang.IllegalArgumentException at ClassInjector.java:1635
org.apache.beam.sdk.nexmark.queries.SessionSideInputJoinTest > queryMatchesModelBatchCsv FAILED
org.apache.beam.sdk.Pipeline$PipelineExecutionException at SessionSideInputJoinTest.java:97
Caused by: java.lang.IllegalArgumentException at ClassInjector.java:1635
org.apache.beam.sdk.nexmark.queries.SessionSideInputJoinTest > queryMatchesModelStreamingCsv FAILED
org.apache.beam.sdk.Pipeline$PipelineExecutionException at SessionSideInputJoinTest.java:97
Caused by: java.lang.IllegalArgumentException at ClassInjector.java:1635
org.apache.beam.sdk.nexmark.queries.SessionSideInputJoinTest > queryMatchesModelStreamingDirect FAILED
org.apache.beam.sdk.Pipeline$PipelineExecutionException at SessionSideInputJoinTest.java:97
Caused by: java.lang.IllegalArgumentException at ClassInjector.java:1635
org.apache.beam.sdk.nexmark.queries.SessionSideInputJoinTest > inputOutputSameEvents FAILED
org.apache.beam.sdk.Pipeline$PipelineExecutionException at SessionSideInputJoinTest.java:140
Caused by: java.lang.IllegalArgumentException at ClassInjector.java:1635
org.apache.beam.sdk.nexmark.queries.SqlQueryTest > org.apache.beam.sdk.nexmark.queries.SqlQueryTest$SqlQueryTestZetaSql.sqlQuery2MatchesModelBatch FAILED
org.apache.beam.sdk.Pipeline$PipelineExecutionException at SqlQueryTest.java:175
Caused by: java.lang.IllegalArgumentException at ClassInjector.java:1635
org.apache.beam.sdk.nexmark.queries.SqlQueryTest > org.apache.beam.sdk.nexmark.queries.SqlQueryTest$SqlQueryTestZetaSql.sqlQuery3MatchesModelStreaming FAILED
org.apache.beam.sdk.Pipeline$PipelineExecutionException at SqlQueryTest.java:175
Caused by: java.lang.IllegalArgumentException at ClassInjector.java:1635
org.apache.beam.sdk.nexmark.queries.SqlQueryTest > org.apache.beam.sdk.nexmark.queries.SqlQueryTest$SqlQueryTestZetaSql.sqlQuery2MatchesModelStreaming FAILED
org.apache.beam.sdk.Pipeline$PipelineExecutionException at SqlQueryTest.java:175
Caused by: java.lang.IllegalArgumentException at ClassInjector.java:1635
org.apache.beam.sdk.nexmark.queries.SqlQueryTest > org.apache.beam.sdk.nexmark.queries.SqlQueryTest$SqlQueryTestZetaSql.sqlQuery3MatchesModelBatch FAILED
org.apache.beam.sdk.Pipeline$PipelineExecutionException at SqlQueryTest.java:175
Caused by: java.lang.IllegalArgumentException at ClassInjector.java:1635
org.apache.beam.sdk.nexmark.queries.SqlQueryTest > org.apache.beam.sdk.nexmark.queries.SqlQueryTest$SqlQueryTestCalcite.sqlQuery7MatchesModelBatch FAILED
org.apache.beam.sdk.Pipeline$PipelineExecutionException at SqlQueryTest.java:147
Caused by: java.lang.IllegalArgumentException at ClassInjector.java:1635
org.apache.beam.sdk.nexmark.queries.SqlQueryTest > org.apache.beam.sdk.nexmark.queries.SqlQueryTest$SqlQueryTestCalcite.sqlQuery2MatchesModelBatch FAILED
org.apache.beam.sdk.Pipeline$PipelineExecutionException at SqlQueryTest.java:147
Caused by: java.lang.IllegalArgumentException at ClassInjector.java:1635
org.apache.beam.sdk.nexmark.queries.SqlQueryTest > org.apache.beam.sdk.nexmark.queries.SqlQueryTest$SqlQueryTestCalcite.sqlQuery1MatchesModelStreaming FAILED
org.apache.beam.sdk.Pipeline$PipelineExecutionException at SqlQueryTest.java:147
Caused by: java.lang.IllegalArgumentException at ClassInjector.java:1635
org.apache.beam.sdk.nexmark.queries.SqlQueryTest > org.apache.beam.sdk.nexmark.queries.SqlQueryTest$SqlQueryTestCalcite.sqlQuery3MatchesModelStreaming FAILED
org.apache.beam.sdk.Pipeline$PipelineExecutionException at SqlQueryTest.java:147
Caused by: java.lang.IllegalArgumentException at ClassInjector.java:1635
org.apache.beam.sdk.nexmark.queries.SqlQueryTest > org.apache.beam.sdk.nexmark.queries.SqlQueryTest$SqlQueryTestCalcite.sqlQuery7MatchesModelStreaming FAILED
org.apache.beam.sdk.Pipeline$PipelineExecutionException at SqlQueryTest.java:147
Caused by: java.lang.IllegalArgumentException at ClassInjector.java:1635
org.apache.beam.sdk.nexmark.queries.SqlQueryTest > org.apache.beam.sdk.nexmark.queries.SqlQueryTest$SqlQueryTestCalcite.sqlQuery1MatchesModelBatch FAILED
org.apache.beam.sdk.Pipeline$PipelineExecutionException at SqlQueryTest.java:147
Caused by: java.lang.IllegalArgumentException at ClassInjector.java:1635
org.apache.beam.sdk.nexmark.queries.SqlQueryTest > org.apache.beam.sdk.nexmark.queries.SqlQueryTest$SqlQueryTestCalcite.sqlQuery2MatchesModelStreaming FAILED
org.apache.beam.sdk.Pipeline$PipelineExecutionException at SqlQueryTest.java:147
Caused by: java.lang.IllegalArgumentException at ClassInjector.java:1635
org.apache.beam.sdk.nexmark.queries.SqlQueryTest > org.apache.beam.sdk.nexmark.queries.SqlQueryTest$SqlQueryTestCalcite.sqlQuery3MatchesModelBatch FAILED
org.apache.beam.sdk.Pipeline$PipelineExecutionException at SqlQueryTest.java:147
Caused by: java.lang.IllegalArgumentException at ClassInjector.java:1635
org.apache.beam.sdk.nexmark.queries.sql.SqlBoundedSideInputJoinTest > org.apache.beam.sdk.nexmark.queries.sql.SqlBoundedSideInputJoinTest$SqlBoundedSideInputJoinTestZetaSql.queryMatchesModelBatchDirect FAILED
org.apache.beam.sdk.Pipeline$PipelineExecutionException at SqlBoundedSideInputJoinTest.java:224
Caused by: java.lang.IllegalArgumentException at ClassInjector.java:1635
org.apache.beam.sdk.nexmark.queries.sql.SqlBoundedSideInputJoinTest > org.apache.beam.sdk.nexmark.queries.sql.SqlBoundedSideInputJoinTest$SqlBoundedSideInputJoinTestZetaSql.queryMatchesModelBatchCsv FAILED
org.apache.beam.sdk.Pipeline$PipelineExecutionException at SqlBoundedSideInputJoinTest.java:224
Caused by: java.lang.IllegalArgumentException at ClassInjector.java:1635
org.apache.beam.sdk.nexmark.queries.sql.SqlBoundedSideInputJoinTest > org.apache.beam.sdk.nexmark.queries.sql.SqlBoundedSideInputJoinTest$SqlBoundedSideInputJoinTestZetaSql.queryMatchesModelStreamingCsv FAILED
org.apache.beam.sdk.Pipeline$PipelineExecutionException at SqlBoundedSideInputJoinTest.java:224
Caused by: java.lang.IllegalArgumentException at ClassInjector.java:1635
org.apache.beam.sdk.nexmark.queries.sql.SqlBoundedSideInputJoinTest > org.apache.beam.sdk.nexmark.queries.sql.SqlBoundedSideInputJoinTest$SqlBoundedSideInputJoinTestZetaSql.queryMatchesModelStreamingDirect FAILED
org.apache.beam.sdk.Pipeline$PipelineExecutionException at SqlBoundedSideInputJoinTest.java:224
Caused by: java.lang.IllegalArgumentException at ClassInjector.java:1635
org.apache.beam.sdk.nexmark.queries.sql.SqlBoundedSideInputJoinTest > org.apache.beam.sdk.nexmark.queries.sql.SqlBoundedSideInputJoinTest$SqlBoundedSideInputJoinTestZetaSql.inputOutputSameEvents FAILED
org.apache.beam.sdk.Pipeline$PipelineExecutionException at SqlBoundedSideInputJoinTest.java:224
Caused by: java.lang.IllegalArgumentException at ClassInjector.java:1635
org.apache.beam.sdk.nexmark.queries.sql.SqlBoundedSideInputJoinTest > org.apache.beam.sdk.nexmark.queries.sql.SqlBoundedSideInputJoinTest$SqlBoundedSideInputJoinTestCalcite.queryMatchesModelBatchDirect FAILED
org.apache.beam.sdk.Pipeline$PipelineExecutionException at SqlBoundedSideInputJoinTest.java:216
Caused by: java.lang.IllegalArgumentException at ClassInjector.java:1635
org.apache.beam.sdk.nexmark.queries.sql.SqlBoundedSideInputJoinTest > org.apache.beam.sdk.nexmark.queries.sql.SqlBoundedSideInputJoinTest$SqlBoundedSideInputJoinTestCalcite.queryMatchesModelBatchCsv FAILED
org.apache.beam.sdk.Pipeline$PipelineExecutionException at SqlBoundedSideInputJoinTest.java:216
Caused by: java.lang.IllegalArgumentException at ClassInjector.java:1635
org.apache.beam.sdk.nexmark.queries.sql.SqlBoundedSideInputJoinTest > org.apache.beam.sdk.nexmark.queries.sql.SqlBoundedSideInputJoinTest$SqlBoundedSideInputJoinTestCalcite.queryMatchesModelStreamingCsv FAILED
org.apache.beam.sdk.Pipeline$PipelineExecutionException at SqlBoundedSideInputJoinTest.java:216
Caused by: java.lang.IllegalArgumentException at ClassInjector.java:1635
org.apache.beam.sdk.nexmark.queries.sql.SqlBoundedSideInputJoinTest > org.apache.beam.sdk.nexmark.queries.sql.SqlBoundedSideInputJoinTest$SqlBoundedSideInputJoinTestCalcite.queryMatchesModelStreamingDirect FAILED
org.apache.beam.sdk.Pipeline$PipelineExecutionException at SqlBoundedSideInputJoinTest.java:216
Caused by: java.lang.IllegalArgumentException at ClassInjector.java:1635
org.apache.beam.sdk.nexmark.queries.sql.SqlBoundedSideInputJoinTest > org.apache.beam.sdk.nexmark.queries.sql.SqlBoundedSideInputJoinTest$SqlBoundedSideInputJoinTestCalcite.inputOutputSameEvents FAILED
org.apache.beam.sdk.Pipeline$PipelineExecutionException at SqlBoundedSideInputJoinTest.java:216
Caused by: java.lang.IllegalArgumentException at ClassInjector.java:1635
org.apache.beam.sdk.nexmark.queries.sql.SqlQuery0Test > org.apache.beam.sdk.nexmark.queries.sql.SqlQuery0Test$SqlQuery0TestZetaSql.testPassesBidsThrough FAILED
java.lang.IllegalArgumentException at SqlQuery0Test.java:77
org.apache.beam.sdk.nexmark.queries.sql.SqlQuery0Test > org.apache.beam.sdk.nexmark.queries.sql.SqlQuery0Test$SqlQuery0TestCalcite.testPassesBidsThrough FAILED
java.lang.IllegalArgumentException at SqlQuery0Test.java:69
org.apache.beam.sdk.nexmark.queries.sql.SqlQuery1Test > testConvertsPriceToEur FAILED
java.lang.IllegalArgumentException at SqlQuery1Test.java:67
org.apache.beam.sdk.nexmark.queries.sql.SqlQuery2Test > org.apache.beam.sdk.nexmark.queries.sql.SqlQuery2Test$SqlQuery2TestZetaSql.testSkipsEverySecondElement FAILED
java.lang.IllegalArgumentException at SqlQuery2Test.java:100
org.apache.beam.sdk.nexmark.queries.sql.SqlQuery2Test > org.apache.beam.sdk.nexmark.queries.sql.SqlQuery2Test$SqlQuery2TestZetaSql.testSkipsEveryThirdElement FAILED
java.lang.IllegalArgumentException at SqlQuery2Test.java:100
org.apache.beam.sdk.nexmark.queries.sql.SqlQuery2Test > org.apache.beam.sdk.nexmark.queries.sql.SqlQuery2Test$SqlQuery2TestCalcite.testSkipsEverySecondElement FAILED
java.lang.IllegalArgumentException at SqlQuery2Test.java:92
org.apache.beam.sdk.nexmark.queries.sql.SqlQuery2Test > org.apache.beam.sdk.nexmark.queries.sql.SqlQuery2Test$SqlQuery2TestCalcite.testSkipsEveryThirdElement FAILED
java.lang.IllegalArgumentException at SqlQuery2Test.java:92
org.apache.beam.sdk.nexmark.queries.sql.SqlQuery3Test > org.apache.beam.sdk.nexmark.queries.sql.SqlQuery3Test$SqlQuery3TestZetaSql.testJoinsPeopleWithAuctions FAILED
java.lang.IllegalArgumentException at SqlQuery3Test.java:110
org.apache.beam.sdk.nexmark.queries.sql.SqlQuery3Test > org.apache.beam.sdk.nexmark.queries.sql.SqlQuery3Test$SqlQuery3TestCalcite.testJoinsPeopleWithAuctions FAILED
java.lang.IllegalArgumentException at SqlQuery3Test.java:102
org.apache.beam.sdk.nexmark.queries.sql.SqlQuery7Test > testBids FAILED
java.lang.IllegalArgumentException at SqlQuery7Test.java:61
85 tests completed, 61 failed, 12 skipped
> Task :sdks:java:testing:nexmark:test FAILED
> Task :runners:flink:1.15:job-server:shadowDistZip
> Task :runners:flink:1.15:job-server:assemble
> Task :runners:flink:1.15:job-server:test NO-SOURCE
> Task :runners:flink:1.15:job-server:check
> Task :runners:flink:1.15:job-server:build
> Task :runners:flink:1.15:job-server:buildDependents
> Task :sdks:java:extensions:sql:expansion-service:buildDependents
> Task :sdks:java:extensions:sql:jdbc:test
org.apache.beam.sdk.extensions.sql.jdbc.BeamSqlLineTest > testSqlLine_slidingWindow FAILED
java.lang.AssertionError at BeamSqlLineTest.java:191
org.apache.beam.sdk.extensions.sql.jdbc.BeamSqlLineTest > testSqlLine_fixedWindow FAILED
java.lang.AssertionError at BeamSqlLineTest.java:169
org.apache.beam.sdk.extensions.sql.jdbc.BeamSqlLineTest > testSqlLine_selectFromTable FAILED
java.lang.AssertionError at BeamSqlLineTest.java:114
org.apache.beam.sdk.extensions.sql.jdbc.BeamSqlLineTest > testSqlLine_select FAILED
java.lang.AssertionError at BeamSqlLineTest.java:96
org.apache.beam.sdk.extensions.sql.jdbc.BeamSqlLineTest > testSqlLine_insertSelect FAILED
java.lang.AssertionError at BeamSqlLineTest.java:133
org.apache.beam.sdk.extensions.sql.jdbc.BeamSqlLineTest > testSqlLine_GroupBy FAILED
java.lang.AssertionError at BeamSqlLineTest.java:150
org.apache.beam.sdk.extensions.sql.jdbc.JdbcJarTest > classLoader_parse FAILED
java.sql.SQLException at JdbcJarTest.java:67
Caused by: java.lang.IllegalArgumentException at JdbcJarTest.java:67
16 tests completed, 7 failed
> Task :sdks:java:extensions:sql:jdbc:test FAILED
FAILURE: Build completed with 4 failures.
1: Task failed with an exception.
-----------
* What went wrong:
Execution failed for task ':sdks:java:extensions:sql:zetasql:test'.
> There were failing tests. See the report at: file://<https://ci-beam.apache.org/job/beam_PreCommit_SQL_Java17_Cron/ws/src/sdks/java/extensions/sql/zetasql/build/reports/tests/test/index.html>
* Try:
> Run with --stacktrace option to get the stack trace.
> Run with --info or --debug option to get more log output.
==============================================================================
2: Task failed with an exception.
-----------
* What went wrong:
Execution failed for task ':sdks:java:extensions:sql:test'.
> There were failing tests. See the report at: file://<https://ci-beam.apache.org/job/beam_PreCommit_SQL_Java17_Cron/ws/src/sdks/java/extensions/sql/build/reports/tests/test/index.html>
* Try:
> Run with --stacktrace option to get the stack trace.
> Run with --info or --debug option to get more log output.
==============================================================================
3: Task failed with an exception.
-----------
* What went wrong:
Execution failed for task ':sdks:java:testing:nexmark:test'.
> There were failing tests. See the report at: file://<https://ci-beam.apache.org/job/beam_PreCommit_SQL_Java17_Cron/ws/src/sdks/java/testing/nexmark/build/reports/tests/test/index.html>
* Try:
> Run with --stacktrace option to get the stack trace.
> Run with --info or --debug option to get more log output.
==============================================================================
4: Task failed with an exception.
-----------
* What went wrong:
Execution failed for task ':sdks:java:extensions:sql:jdbc:test'.
> There were failing tests. See the report at: file://<https://ci-beam.apache.org/job/beam_PreCommit_SQL_Java17_Cron/ws/src/sdks/java/extensions/sql/jdbc/build/reports/tests/test/index.html>
* Try:
> Run with --stacktrace option to get the stack trace.
> Run with --info or --debug option to get more log output.
==============================================================================
* Get more help at https://help.gradle.org
Deprecated Gradle features were used in this build, making it incompatible with Gradle 8.0.
You can use '--warning-mode all' to show the individual deprecation warnings and determine if they come from your own scripts or plugins.
See https://docs.gradle.org/7.5.1/userguide/command_line_interface.html#sec:command_line_warnings
BUILD FAILED in 4m 44s
256 actionable tasks: 180 executed, 76 from cache
Publishing build scan...
https://gradle.com/s/cszccymybcqju
Build step 'Invoke Gradle script' changed build result to FAILURE
Build step 'Invoke Gradle script' marked build as failure
---------------------------------------------------------------------
To unsubscribe, e-mail: builds-unsubscribe@beam.apache.org
For additional commands, e-mail: builds-help@beam.apache.org
Build failed in Jenkins: beam_PreCommit_SQL_Java17_Cron #1516
Posted by Apache Jenkins Server <je...@builds.apache.org>.
See <https://ci-beam.apache.org/job/beam_PreCommit_SQL_Java17_Cron/1516/display/redirect>
Changes:
------------------------------------------
[...truncated 305.75 KB...]
org.apache.beam.sdk.nexmark.queries.SqlQueryTest > org.apache.beam.sdk.nexmark.queries.SqlQueryTest$SqlQueryTestCalcite.sqlQuery1MatchesModelBatch FAILED
org.apache.beam.sdk.Pipeline$PipelineExecutionException at SqlQueryTest.java:147
Caused by: java.lang.IllegalArgumentException at ClassInjector.java:1635
org.apache.beam.sdk.nexmark.queries.SqlQueryTest > org.apache.beam.sdk.nexmark.queries.SqlQueryTest$SqlQueryTestCalcite.sqlQuery2MatchesModelStreaming FAILED
org.apache.beam.sdk.Pipeline$PipelineExecutionException at SqlQueryTest.java:147
Caused by: java.lang.IllegalArgumentException at ClassInjector.java:1635
org.apache.beam.sdk.nexmark.queries.SqlQueryTest > org.apache.beam.sdk.nexmark.queries.SqlQueryTest$SqlQueryTestCalcite.sqlQuery3MatchesModelBatch FAILED
org.apache.beam.sdk.Pipeline$PipelineExecutionException at SqlQueryTest.java:147
Caused by: java.lang.IllegalArgumentException at ClassInjector.java:1635
org.apache.beam.sdk.nexmark.queries.sql.SqlBoundedSideInputJoinTest > org.apache.beam.sdk.nexmark.queries.sql.SqlBoundedSideInputJoinTest$SqlBoundedSideInputJoinTestZetaSql.queryMatchesModelBatchDirect FAILED
org.apache.beam.sdk.Pipeline$PipelineExecutionException at SqlBoundedSideInputJoinTest.java:224
Caused by: java.lang.IllegalArgumentException at ClassInjector.java:1635
org.apache.beam.sdk.nexmark.queries.sql.SqlBoundedSideInputJoinTest > org.apache.beam.sdk.nexmark.queries.sql.SqlBoundedSideInputJoinTest$SqlBoundedSideInputJoinTestZetaSql.queryMatchesModelBatchCsv FAILED
org.apache.beam.sdk.Pipeline$PipelineExecutionException at SqlBoundedSideInputJoinTest.java:224
Caused by: java.lang.IllegalArgumentException at ClassInjector.java:1635
org.apache.beam.sdk.nexmark.queries.sql.SqlBoundedSideInputJoinTest > org.apache.beam.sdk.nexmark.queries.sql.SqlBoundedSideInputJoinTest$SqlBoundedSideInputJoinTestZetaSql.queryMatchesModelStreamingCsv FAILED
org.apache.beam.sdk.Pipeline$PipelineExecutionException at SqlBoundedSideInputJoinTest.java:224
Caused by: java.lang.IllegalArgumentException at ClassInjector.java:1635
org.apache.beam.sdk.nexmark.queries.sql.SqlBoundedSideInputJoinTest > org.apache.beam.sdk.nexmark.queries.sql.SqlBoundedSideInputJoinTest$SqlBoundedSideInputJoinTestZetaSql.queryMatchesModelStreamingDirect FAILED
org.apache.beam.sdk.Pipeline$PipelineExecutionException at SqlBoundedSideInputJoinTest.java:224
Caused by: java.lang.IllegalArgumentException at ClassInjector.java:1635
org.apache.beam.sdk.nexmark.queries.sql.SqlBoundedSideInputJoinTest > org.apache.beam.sdk.nexmark.queries.sql.SqlBoundedSideInputJoinTest$SqlBoundedSideInputJoinTestZetaSql.inputOutputSameEvents FAILED
org.apache.beam.sdk.Pipeline$PipelineExecutionException at SqlBoundedSideInputJoinTest.java:224
Caused by: java.lang.IllegalArgumentException at ClassInjector.java:1635
org.apache.beam.sdk.nexmark.queries.sql.SqlBoundedSideInputJoinTest > org.apache.beam.sdk.nexmark.queries.sql.SqlBoundedSideInputJoinTest$SqlBoundedSideInputJoinTestCalcite.queryMatchesModelBatchDirect FAILED
org.apache.beam.sdk.Pipeline$PipelineExecutionException at SqlBoundedSideInputJoinTest.java:216
Caused by: java.lang.IllegalArgumentException at ClassInjector.java:1635
org.apache.beam.sdk.nexmark.queries.sql.SqlBoundedSideInputJoinTest > org.apache.beam.sdk.nexmark.queries.sql.SqlBoundedSideInputJoinTest$SqlBoundedSideInputJoinTestCalcite.queryMatchesModelBatchCsv FAILED
org.apache.beam.sdk.Pipeline$PipelineExecutionException at SqlBoundedSideInputJoinTest.java:216
Caused by: java.lang.IllegalArgumentException at ClassInjector.java:1635
org.apache.beam.sdk.nexmark.queries.sql.SqlBoundedSideInputJoinTest > org.apache.beam.sdk.nexmark.queries.sql.SqlBoundedSideInputJoinTest$SqlBoundedSideInputJoinTestCalcite.queryMatchesModelStreamingCsv FAILED
org.apache.beam.sdk.Pipeline$PipelineExecutionException at SqlBoundedSideInputJoinTest.java:216
Caused by: java.lang.IllegalArgumentException at ClassInjector.java:1635
org.apache.beam.sdk.nexmark.queries.sql.SqlBoundedSideInputJoinTest > org.apache.beam.sdk.nexmark.queries.sql.SqlBoundedSideInputJoinTest$SqlBoundedSideInputJoinTestCalcite.queryMatchesModelStreamingDirect FAILED
org.apache.beam.sdk.Pipeline$PipelineExecutionException at SqlBoundedSideInputJoinTest.java:216
Caused by: java.lang.IllegalArgumentException at ClassInjector.java:1635
org.apache.beam.sdk.nexmark.queries.sql.SqlBoundedSideInputJoinTest > org.apache.beam.sdk.nexmark.queries.sql.SqlBoundedSideInputJoinTest$SqlBoundedSideInputJoinTestCalcite.inputOutputSameEvents FAILED
org.apache.beam.sdk.Pipeline$PipelineExecutionException at SqlBoundedSideInputJoinTest.java:216
Caused by: java.lang.IllegalArgumentException at ClassInjector.java:1635
org.apache.beam.sdk.nexmark.queries.sql.SqlQuery0Test > org.apache.beam.sdk.nexmark.queries.sql.SqlQuery0Test$SqlQuery0TestZetaSql.testPassesBidsThrough FAILED
java.lang.IllegalArgumentException at SqlQuery0Test.java:77
org.apache.beam.sdk.nexmark.queries.sql.SqlQuery0Test > org.apache.beam.sdk.nexmark.queries.sql.SqlQuery0Test$SqlQuery0TestCalcite.testPassesBidsThrough FAILED
java.lang.IllegalArgumentException at SqlQuery0Test.java:69
org.apache.beam.sdk.nexmark.queries.sql.SqlQuery1Test > testConvertsPriceToEur FAILED
java.lang.IllegalArgumentException at SqlQuery1Test.java:67
org.apache.beam.sdk.nexmark.queries.sql.SqlQuery2Test > org.apache.beam.sdk.nexmark.queries.sql.SqlQuery2Test$SqlQuery2TestZetaSql.testSkipsEverySecondElement FAILED
java.lang.IllegalArgumentException at SqlQuery2Test.java:100
org.apache.beam.sdk.nexmark.queries.sql.SqlQuery2Test > org.apache.beam.sdk.nexmark.queries.sql.SqlQuery2Test$SqlQuery2TestZetaSql.testSkipsEveryThirdElement FAILED
java.lang.IllegalArgumentException at SqlQuery2Test.java:100
org.apache.beam.sdk.nexmark.queries.sql.SqlQuery2Test > org.apache.beam.sdk.nexmark.queries.sql.SqlQuery2Test$SqlQuery2TestCalcite.testSkipsEverySecondElement FAILED
java.lang.IllegalArgumentException at SqlQuery2Test.java:92
org.apache.beam.sdk.nexmark.queries.sql.SqlQuery2Test > org.apache.beam.sdk.nexmark.queries.sql.SqlQuery2Test$SqlQuery2TestCalcite.testSkipsEveryThirdElement FAILED
java.lang.IllegalArgumentException at SqlQuery2Test.java:92
org.apache.beam.sdk.nexmark.queries.sql.SqlQuery3Test > org.apache.beam.sdk.nexmark.queries.sql.SqlQuery3Test$SqlQuery3TestZetaSql.testJoinsPeopleWithAuctions FAILED
java.lang.IllegalArgumentException at SqlQuery3Test.java:110
org.apache.beam.sdk.nexmark.queries.sql.SqlQuery3Test > org.apache.beam.sdk.nexmark.queries.sql.SqlQuery3Test$SqlQuery3TestCalcite.testJoinsPeopleWithAuctions FAILED
java.lang.IllegalArgumentException at SqlQuery3Test.java:102
org.apache.beam.sdk.nexmark.queries.sql.SqlQuery7Test > testBids FAILED
java.lang.IllegalArgumentException at SqlQuery7Test.java:61
85 tests completed, 61 failed, 12 skipped
> Task :sdks:java:testing:nexmark:test FAILED
> Task :sdks:java:extensions:sql:expansion-service:compileTestJava NO-SOURCE
> Task :sdks:java:extensions:sql:expansion-service:testClasses UP-TO-DATE
> Task :sdks:java:extensions:sql:expansion-service:packageTests
> Task :sdks:java:extensions:sql:expansion-service:assemble
> Task :sdks:java:extensions:sql:expansion-service:analyzeClassesDependencies
> Task :sdks:java:extensions:sql:expansion-service:analyzeTestClassesDependencies SKIPPED
> Task :sdks:java:extensions:sql:expansion-service:analyzeDependencies
> Task :sdks:java:extensions:sql:expansion-service:checkstyleMain SKIPPED
> Task :sdks:java:extensions:sql:expansion-service:checkstyleTest SKIPPED
> Task :sdks:java:extensions:sql:expansion-service:javadoc FROM-CACHE
> Task :sdks:java:extensions:sql:expansion-service:spotbugsTest SKIPPED
> Task :sdks:java:extensions:sql:expansion-service:test NO-SOURCE
> Task :sdks:java:extensions:sql:shell:distZip
> Task :sdks:java:extensions:sql:shell:assemble
> Task :sdks:java:extensions:sql:shell:analyzeClassesDependencies
> Task :sdks:java:extensions:sql:shell:analyzeDependencies
> Task :sdks:java:extensions:sql:shell:test NO-SOURCE
> Task :sdks:java:extensions:sql:shell:check
> Task :sdks:java:extensions:sql:shell:build
> Task :sdks:java:extensions:sql:shell:buildDependents
> Task :sdks:java:extensions:sql:expansion-service:spotbugsMain
> Task :sdks:java:extensions:sql:expansion-service:check
> Task :sdks:java:extensions:sql:expansion-service:build
> Task :runners:flink:1.12:job-server:startScripts
> Task :runners:flink:1.14:job-server:startScripts
> Task :runners:flink:1.15:job-server:startScripts
> Task :runners:flink:1.13:job-server:startScripts
> Task :runners:flink:1.15:job-server:distTar
> Task :runners:flink:1.14:job-server:distTar
> Task :runners:flink:1.12:job-server:distTar
> Task :runners:flink:1.13:job-server:distTar
> Task :runners:flink:1.15:job-server:distZip
> Task :runners:flink:1.14:job-server:distZip
> Task :runners:flink:1.12:job-server:distZip
> Task :runners:flink:1.13:job-server:distZip
> Task :sdks:java:extensions:sql:jdbc:test
org.apache.beam.sdk.extensions.sql.jdbc.BeamSqlLineTest > testSqlLine_slidingWindow FAILED
java.lang.AssertionError at BeamSqlLineTest.java:191
org.apache.beam.sdk.extensions.sql.jdbc.BeamSqlLineTest > testSqlLine_fixedWindow FAILED
java.lang.AssertionError at BeamSqlLineTest.java:169
org.apache.beam.sdk.extensions.sql.jdbc.BeamSqlLineTest > testSqlLine_selectFromTable FAILED
java.lang.AssertionError at BeamSqlLineTest.java:114
org.apache.beam.sdk.extensions.sql.jdbc.BeamSqlLineTest > testSqlLine_select FAILED
java.lang.AssertionError at BeamSqlLineTest.java:96
org.apache.beam.sdk.extensions.sql.jdbc.BeamSqlLineTest > testSqlLine_insertSelect FAILED
java.lang.AssertionError at BeamSqlLineTest.java:133
org.apache.beam.sdk.extensions.sql.jdbc.BeamSqlLineTest > testSqlLine_GroupBy FAILED
java.lang.AssertionError at BeamSqlLineTest.java:150
org.apache.beam.sdk.extensions.sql.jdbc.JdbcJarTest > classLoader_parse FAILED
java.sql.SQLException at JdbcJarTest.java:67
Caused by: java.lang.IllegalArgumentException at JdbcJarTest.java:67
16 tests completed, 7 failed
> Task :sdks:java:extensions:sql:jdbc:test FAILED
> Task :runners:flink:1.13:job-server:shadowJar
> Task :runners:flink:1.12:job-server:shadowJar
> Task :runners:flink:1.15:job-server:shadowJar
> Task :runners:flink:1.14:job-server:shadowJar
> Task :runners:flink:1.13:job-server:startShadowScripts
> Task :runners:flink:1.12:job-server:startShadowScripts
> Task :runners:flink:1.13:job-server:shadowDistTar
> Task :runners:flink:1.12:job-server:shadowDistTar
> Task :runners:flink:1.15:job-server:startShadowScripts
> Task :runners:flink:1.15:job-server:shadowDistTar
> Task :runners:flink:1.14:job-server:startShadowScripts
> Task :runners:flink:1.14:job-server:shadowDistTar
> Task :runners:flink:1.13:job-server:shadowDistZip
> Task :runners:flink:1.13:job-server:assemble
> Task :runners:flink:1.13:job-server:test NO-SOURCE
> Task :runners:flink:1.13:job-server:check
> Task :runners:flink:1.13:job-server:build
> Task :runners:flink:1.13:job-server:buildDependents
> Task :runners:flink:1.12:job-server:shadowDistZip
> Task :runners:flink:1.12:job-server:assemble
> Task :runners:flink:1.12:job-server:test NO-SOURCE
> Task :runners:flink:1.12:job-server:check
> Task :runners:flink:1.12:job-server:build
> Task :runners:flink:1.12:job-server:buildDependents
> Task :runners:flink:1.15:job-server:shadowDistZip
> Task :runners:flink:1.15:job-server:assemble
> Task :runners:flink:1.15:job-server:test NO-SOURCE
> Task :runners:flink:1.15:job-server:check
> Task :runners:flink:1.15:job-server:build
> Task :runners:flink:1.15:job-server:buildDependents
> Task :runners:flink:1.14:job-server:shadowDistZip
> Task :runners:flink:1.14:job-server:assemble
> Task :runners:flink:1.14:job-server:test NO-SOURCE
> Task :runners:flink:1.14:job-server:check
> Task :runners:flink:1.14:job-server:build
> Task :runners:flink:1.14:job-server:buildDependents
> Task :sdks:java:extensions:sql:expansion-service:buildDependents
FAILURE: Build completed with 4 failures.
1: Task failed with an exception.
-----------
* What went wrong:
Execution failed for task ':sdks:java:extensions:sql:zetasql:test'.
> There were failing tests. See the report at: file://<https://ci-beam.apache.org/job/beam_PreCommit_SQL_Java17_Cron/ws/src/sdks/java/extensions/sql/zetasql/build/reports/tests/test/index.html>
* Try:
> Run with --stacktrace option to get the stack trace.
> Run with --info or --debug option to get more log output.
==============================================================================
2: Task failed with an exception.
-----------
* What went wrong:
Execution failed for task ':sdks:java:extensions:sql:test'.
> There were failing tests. See the report at: file://<https://ci-beam.apache.org/job/beam_PreCommit_SQL_Java17_Cron/ws/src/sdks/java/extensions/sql/build/reports/tests/test/index.html>
* Try:
> Run with --stacktrace option to get the stack trace.
> Run with --info or --debug option to get more log output.
==============================================================================
3: Task failed with an exception.
-----------
* What went wrong:
Execution failed for task ':sdks:java:testing:nexmark:test'.
> There were failing tests. See the report at: file://<https://ci-beam.apache.org/job/beam_PreCommit_SQL_Java17_Cron/ws/src/sdks/java/testing/nexmark/build/reports/tests/test/index.html>
* Try:
> Run with --stacktrace option to get the stack trace.
> Run with --info or --debug option to get more log output.
==============================================================================
4: Task failed with an exception.
-----------
* What went wrong:
Execution failed for task ':sdks:java:extensions:sql:jdbc:test'.
> There were failing tests. See the report at: file://<https://ci-beam.apache.org/job/beam_PreCommit_SQL_Java17_Cron/ws/src/sdks/java/extensions/sql/jdbc/build/reports/tests/test/index.html>
* Try:
> Run with --stacktrace option to get the stack trace.
> Run with --info or --debug option to get more log output.
==============================================================================
* Get more help at https://help.gradle.org
Deprecated Gradle features were used in this build, making it incompatible with Gradle 8.0.
You can use '--warning-mode all' to show the individual deprecation warnings and determine if they come from your own scripts or plugins.
See https://docs.gradle.org/7.5.1/userguide/command_line_interface.html#sec:command_line_warnings
BUILD FAILED in 9m 40s
256 actionable tasks: 215 executed, 41 from cache
Publishing build scan...
https://gradle.com/s/nemmjvlhiitni
Build step 'Invoke Gradle script' changed build result to FAILURE
Build step 'Invoke Gradle script' marked build as failure
---------------------------------------------------------------------
To unsubscribe, e-mail: builds-unsubscribe@beam.apache.org
For additional commands, e-mail: builds-help@beam.apache.org
Build failed in Jenkins: beam_PreCommit_SQL_Java17_Cron #1515
Posted by Apache Jenkins Server <je...@builds.apache.org>.
See <https://ci-beam.apache.org/job/beam_PreCommit_SQL_Java17_Cron/1515/display/redirect?page=changes>
Changes:
[noreply] Bump github.com/tetratelabs/wazero from 1.0.0-pre.7 to 1.0.0-pre.9 in
------------------------------------------
[...truncated 303.35 KB...]
java.lang.IllegalArgumentException at SqlQuery2Test.java:100
org.apache.beam.sdk.nexmark.queries.sql.SqlQuery2Test > org.apache.beam.sdk.nexmark.queries.sql.SqlQuery2Test$SqlQuery2TestZetaSql.testSkipsEveryThirdElement FAILED
java.lang.IllegalArgumentException at SqlQuery2Test.java:100
org.apache.beam.sdk.nexmark.queries.sql.SqlQuery2Test > org.apache.beam.sdk.nexmark.queries.sql.SqlQuery2Test$SqlQuery2TestCalcite.testSkipsEverySecondElement FAILED
java.lang.IllegalArgumentException at SqlQuery2Test.java:92
org.apache.beam.sdk.nexmark.queries.sql.SqlQuery2Test > org.apache.beam.sdk.nexmark.queries.sql.SqlQuery2Test$SqlQuery2TestCalcite.testSkipsEveryThirdElement FAILED
java.lang.IllegalArgumentException at SqlQuery2Test.java:92
org.apache.beam.sdk.nexmark.queries.sql.SqlQuery3Test > org.apache.beam.sdk.nexmark.queries.sql.SqlQuery3Test$SqlQuery3TestZetaSql.testJoinsPeopleWithAuctions FAILED
java.lang.IllegalArgumentException at SqlQuery3Test.java:110
org.apache.beam.sdk.nexmark.queries.sql.SqlQuery3Test > org.apache.beam.sdk.nexmark.queries.sql.SqlQuery3Test$SqlQuery3TestCalcite.testJoinsPeopleWithAuctions FAILED
java.lang.IllegalArgumentException at SqlQuery3Test.java:102
org.apache.beam.sdk.nexmark.queries.sql.SqlQuery7Test > testBids FAILED
java.lang.IllegalArgumentException at SqlQuery7Test.java:61
85 tests completed, 61 failed, 12 skipped
> Task :sdks:java:extensions:sql:test FAILED
> Task :runners:flink:1.12:job-server:distZip
> Task :runners:flink:1.13:job-server:distZip
> Task :runners:flink:1.14:job-server:distZip
> Task :runners:flink:1.15:job-server:distZip
> Task :sdks:java:extensions:sql:runBasicExample
SLF4J: Class path contains multiple SLF4J bindings.
SLF4J: Found binding in [jar:file:/home/jenkins/.gradle/caches/modules-2/files-2.1/org.slf4j/slf4j-jdk14/1.7.30/d35953dd2fe54ebe39fdf18cfd82fe6eb35b25ed/slf4j-jdk14-1.7.30.jar!/org/slf4j/impl/StaticLoggerBinder.class]
SLF4J: Found binding in [jar:file:/home/jenkins/.gradle/caches/modules-2/files-2.1/org.slf4j/slf4j-reload4j/1.7.36/db708f7d959dee1857ac524636e85ecf2e1781c1/slf4j-reload4j-1.7.36.jar!/org/slf4j/impl/StaticLoggerBinder.class]
SLF4J: Found binding in [jar:file:/home/jenkins/.gradle/caches/modules-2/files-2.1/org.slf4j/slf4j-log4j12/1.7.30/c21f55139d8141d2231214fb1feaf50a1edca95e/slf4j-log4j12-1.7.30.jar!/org/slf4j/impl/StaticLoggerBinder.class]
SLF4J: See http://www.slf4j.org/codes.html#multiple_bindings for an explanation.
SLF4J: Actual binding is of type [org.slf4j.impl.JDK14LoggerFactory]
Feb 20, 2023 8:12:15 AM org.apache.beam.sdk.extensions.sql.impl.CalciteQueryPlanner convertToBeamRel
INFO: SQL:
SELECT `PCOLLECTION`.`c1`, `PCOLLECTION`.`c2`, `PCOLLECTION`.`c3`
FROM `beam`.`PCOLLECTION` AS `PCOLLECTION`
WHERE `PCOLLECTION`.`c1` > 1
Feb 20, 2023 8:12:15 AM org.apache.beam.sdk.extensions.sql.impl.CalciteQueryPlanner convertToBeamRel
INFO: SQLPlan>
LogicalProject(c1=[$0], c2=[$1], c3=[$2])
LogicalFilter(condition=[>($0, 1)])
BeamIOSourceRel(table=[[beam, PCOLLECTION]])
Feb 20, 2023 8:12:15 AM org.apache.beam.sdk.extensions.sql.impl.CalciteQueryPlanner convertToBeamRel
INFO: BEAMPlan>
BeamCalcRel(expr#0..2=[{inputs}], expr#3=[1], expr#4=[>($t0, $t3)], proj#0..2=[{exprs}], $condition=[$t4])
BeamIOSourceRel(table=[[beam, PCOLLECTION]])
Feb 20, 2023 8:12:16 AM org.apache.beam.sdk.extensions.sql.impl.CalciteQueryPlanner convertToBeamRel
INFO: SQL:
SELECT `CASE1_RESULT`.`c2`, SUM(`CASE1_RESULT`.`c3`)
FROM `beam`.`CASE1_RESULT` AS `CASE1_RESULT`
GROUP BY `CASE1_RESULT`.`c2`
Feb 20, 2023 8:12:16 AM org.apache.beam.sdk.extensions.sql.impl.CalciteQueryPlanner convertToBeamRel
INFO: SQLPlan>
LogicalAggregate(group=[{0}], EXPR$1=[SUM($1)])
LogicalProject(c2=[$1], c3=[$2])
BeamIOSourceRel(table=[[beam, CASE1_RESULT]])
Feb 20, 2023 8:12:16 AM org.apache.beam.sdk.extensions.sql.impl.CalciteQueryPlanner convertToBeamRel
INFO: BEAMPlan>
BeamAggregationRel(group=[{1}], EXPR$1=[SUM($2)])
BeamIOSourceRel(table=[[beam, CASE1_RESULT]])
Feb 20, 2023 8:12:16 AM org.apache.beam.sdk.Pipeline validate
WARNING: The following transforms do not have stable unique names: log_result, SqlTransform
PCOLLECTION: [3, row, 3.0]
PCOLLECTION: [2, row, 2.0]
CASE1_RESULT: [row, 5.0]
> Task :sdks:java:extensions:sql:runPojoExample
SLF4J: Class path contains multiple SLF4J bindings.
SLF4J: Found binding in [jar:file:/home/jenkins/.gradle/caches/modules-2/files-2.1/org.slf4j/slf4j-jdk14/1.7.30/d35953dd2fe54ebe39fdf18cfd82fe6eb35b25ed/slf4j-jdk14-1.7.30.jar!/org/slf4j/impl/StaticLoggerBinder.class]
SLF4J: Found binding in [jar:file:/home/jenkins/.gradle/caches/modules-2/files-2.1/org.slf4j/slf4j-reload4j/1.7.36/db708f7d959dee1857ac524636e85ecf2e1781c1/slf4j-reload4j-1.7.36.jar!/org/slf4j/impl/StaticLoggerBinder.class]
SLF4J: Found binding in [jar:file:/home/jenkins/.gradle/caches/modules-2/files-2.1/org.slf4j/slf4j-log4j12/1.7.30/c21f55139d8141d2231214fb1feaf50a1edca95e/slf4j-log4j12-1.7.30.jar!/org/slf4j/impl/StaticLoggerBinder.class]
SLF4J: See http://www.slf4j.org/codes.html#multiple_bindings for an explanation.
SLF4J: Actual binding is of type [org.slf4j.impl.JDK14LoggerFactory]
Feb 20, 2023 8:12:23 AM org.apache.beam.sdk.extensions.sql.impl.CalciteQueryPlanner convertToBeamRel
INFO: SQL:
SELECT `PCOLLECTION`.`id`, `PCOLLECTION`.`name`
FROM `beam`.`PCOLLECTION` AS `PCOLLECTION`
WHERE `PCOLLECTION`.`countryOfResidence` = 'Wonderland'
Feb 20, 2023 8:12:24 AM org.apache.beam.sdk.extensions.sql.impl.CalciteQueryPlanner convertToBeamRel
INFO: SQLPlan>
LogicalProject(id=[$2], name=[$1])
LogicalFilter(condition=[=($0, 'Wonderland')])
BeamIOSourceRel(table=[[beam, PCOLLECTION]])
Feb 20, 2023 8:12:24 AM org.apache.beam.sdk.extensions.sql.impl.CalciteQueryPlanner convertToBeamRel
INFO: BEAMPlan>
BeamCalcRel(expr#0..2=[{inputs}], expr#3=['Wonderland':VARCHAR], expr#4=[=($t0, $t3)], id=[$t2], name=[$t1], $condition=[$t4])
BeamIOSourceRel(table=[[beam, PCOLLECTION]])
Feb 20, 2023 8:12:24 AM org.apache.beam.sdk.extensions.sql.impl.CalciteQueryPlanner convertToBeamRel
INFO: SQL:
SELECT COUNT(`PCOLLECTION`.`id`)
FROM `beam`.`PCOLLECTION` AS `PCOLLECTION`
Feb 20, 2023 8:12:24 AM org.apache.beam.sdk.extensions.sql.impl.CalciteQueryPlanner convertToBeamRel
INFO: SQLPlan>
LogicalAggregate(group=[{}], EXPR$0=[COUNT()])
BeamIOSourceRel(table=[[beam, PCOLLECTION]])
Feb 20, 2023 8:12:24 AM org.apache.beam.sdk.extensions.sql.impl.CalciteQueryPlanner convertToBeamRel
INFO: BEAMPlan>
BeamAggregationRel(group=[{}], EXPR$0=[COUNT()])
BeamIOSourceRel(table=[[beam, PCOLLECTION]])
Feb 20, 2023 8:12:24 AM org.apache.beam.sdk.extensions.sql.impl.CalciteQueryPlanner convertToBeamRel
INFO: SQL:
SELECT `customers`.`name`, 'order id:' || CAST(`orders`.`id` AS VARCHAR)
FROM `beam`.`orders` AS `orders`
INNER JOIN `beam`.`customers` AS `customers` ON `orders`.`customerId` = `customers`.`id`
WHERE `customers`.`name` = 'Grault'
Feb 20, 2023 8:12:24 AM org.apache.beam.sdk.extensions.sql.impl.CalciteQueryPlanner convertToBeamRel
INFO: SQLPlan>
LogicalProject(name=[$3], EXPR$1=[||('order id:', CAST($1):VARCHAR NOT NULL)])
LogicalFilter(condition=[=($3, 'Grault')])
LogicalJoin(condition=[=($0, $4)], joinType=[inner])
BeamIOSourceRel(table=[[beam, orders]])
BeamIOSourceRel(table=[[beam, customers]])
Feb 20, 2023 8:12:25 AM org.apache.beam.sdk.extensions.sql.impl.CalciteQueryPlanner convertToBeamRel
INFO: BEAMPlan>
BeamCalcRel(expr#0..4=[{inputs}], expr#5=['order id:'], expr#6=[CAST($t1):VARCHAR NOT NULL], expr#7=[||($t5, $t6)], name=[$t3], EXPR$1=[$t7])
BeamCoGBKJoinRel(condition=[=($0, $4)], joinType=[inner])
BeamIOSourceRel(table=[[beam, orders]])
BeamCalcRel(expr#0..2=[{inputs}], expr#3=['Grault':VARCHAR], expr#4=[=($t1, $t3)], proj#0..2=[{exprs}], $condition=[$t4])
BeamIOSourceRel(table=[[beam, customers]])
Feb 20, 2023 8:12:25 AM org.apache.beam.sdk.Pipeline validate
WARNING: The following transforms do not have stable unique names: Create.Values, MapElements, SqlTransform
[4, Grault]: is from Wonderland
[3, Baz]: is from Wonderland
[1, Foo]: is from Wonderland
[3]: total customers in Wonderland
[Grault, order id:7]: ordered by 'Grault'
[Grault, order id:8]: ordered by 'Grault'
> Task :sdks:java:extensions:sql:shell:distZip
> Task :sdks:java:extensions:sql:shell:assemble
> Task :sdks:java:extensions:sql:shell:analyzeClassesDependencies FROM-CACHE
> Task :sdks:java:extensions:sql:shell:analyzeDependencies UP-TO-DATE
> Task :sdks:java:extensions:sql:shell:test NO-SOURCE
> Task :sdks:java:extensions:sql:shell:check UP-TO-DATE
> Task :sdks:java:extensions:sql:shell:build
> Task :sdks:java:extensions:sql:shell:buildDependents
> Task :runners:flink:1.13:job-server:shadowJar FROM-CACHE
> Task :runners:flink:1.12:job-server:shadowJar FROM-CACHE
> Task :runners:flink:1.14:job-server:shadowJar FROM-CACHE
> Task :runners:flink:1.15:job-server:shadowJar FROM-CACHE
> Task :runners:flink:1.13:job-server:startShadowScripts
> Task :runners:flink:1.13:job-server:shadowDistTar
> Task :runners:flink:1.12:job-server:startShadowScripts
> Task :runners:flink:1.12:job-server:shadowDistTar
> Task :runners:flink:1.14:job-server:startShadowScripts
> Task :runners:flink:1.15:job-server:startShadowScripts
> Task :runners:flink:1.14:job-server:shadowDistTar
> Task :runners:flink:1.15:job-server:shadowDistTar
> Task :runners:flink:1.13:job-server:shadowDistZip
> Task :runners:flink:1.13:job-server:assemble
> Task :runners:flink:1.13:job-server:test NO-SOURCE
> Task :runners:flink:1.13:job-server:check UP-TO-DATE
> Task :runners:flink:1.13:job-server:build
> Task :runners:flink:1.13:job-server:buildDependents
> Task :runners:flink:1.12:job-server:shadowDistZip
> Task :runners:flink:1.12:job-server:assemble
> Task :runners:flink:1.12:job-server:test NO-SOURCE
> Task :runners:flink:1.12:job-server:check UP-TO-DATE
> Task :runners:flink:1.12:job-server:build
> Task :runners:flink:1.12:job-server:buildDependents
> Task :runners:flink:1.15:job-server:shadowDistZip
> Task :runners:flink:1.15:job-server:assemble
> Task :runners:flink:1.15:job-server:test NO-SOURCE
> Task :runners:flink:1.15:job-server:check UP-TO-DATE
> Task :runners:flink:1.15:job-server:build
> Task :runners:flink:1.15:job-server:buildDependents
> Task :runners:flink:1.14:job-server:shadowDistZip
> Task :runners:flink:1.14:job-server:assemble
> Task :runners:flink:1.14:job-server:test NO-SOURCE
> Task :runners:flink:1.14:job-server:check UP-TO-DATE
> Task :runners:flink:1.14:job-server:build
> Task :runners:flink:1.14:job-server:buildDependents
> Task :sdks:java:extensions:sql:expansion-service:buildDependents
FAILURE: Build completed with 4 failures.
1: Task failed with an exception.
-----------
* What went wrong:
Execution failed for task ':sdks:java:extensions:sql:jdbc:test'.
> There were failing tests. See the report at: file://<https://ci-beam.apache.org/job/beam_PreCommit_SQL_Java17_Cron/ws/src/sdks/java/extensions/sql/jdbc/build/reports/tests/test/index.html>
* Try:
> Run with --stacktrace option to get the stack trace.
> Run with --info or --debug option to get more log output.
==============================================================================
2: Task failed with an exception.
-----------
* What went wrong:
Execution failed for task ':sdks:java:extensions:sql:zetasql:test'.
> There were failing tests. See the report at: file://<https://ci-beam.apache.org/job/beam_PreCommit_SQL_Java17_Cron/ws/src/sdks/java/extensions/sql/zetasql/build/reports/tests/test/index.html>
* Try:
> Run with --stacktrace option to get the stack trace.
> Run with --info or --debug option to get more log output.
==============================================================================
3: Task failed with an exception.
-----------
* What went wrong:
Execution failed for task ':sdks:java:testing:nexmark:test'.
> There were failing tests. See the report at: file://<https://ci-beam.apache.org/job/beam_PreCommit_SQL_Java17_Cron/ws/src/sdks/java/testing/nexmark/build/reports/tests/test/index.html>
* Try:
> Run with --stacktrace option to get the stack trace.
> Run with --info or --debug option to get more log output.
==============================================================================
4: Task failed with an exception.
-----------
* What went wrong:
Execution failed for task ':sdks:java:extensions:sql:test'.
> There were failing tests. See the report at: file://<https://ci-beam.apache.org/job/beam_PreCommit_SQL_Java17_Cron/ws/src/sdks/java/extensions/sql/build/reports/tests/test/index.html>
* Try:
> Run with --stacktrace option to get the stack trace.
> Run with --info or --debug option to get more log output.
==============================================================================
* Get more help at https://help.gradle.org
Deprecated Gradle features were used in this build, making it incompatible with Gradle 8.0.
You can use '--warning-mode all' to show the individual deprecation warnings and determine if they come from your own scripts or plugins.
See https://docs.gradle.org/7.5.1/userguide/command_line_interface.html#sec:command_line_warnings
BUILD FAILED in 3m 5s
256 actionable tasks: 139 executed, 117 from cache
Publishing build scan...
https://gradle.com/s/4t3yinejzsbvu
Build step 'Invoke Gradle script' changed build result to FAILURE
Build step 'Invoke Gradle script' marked build as failure
---------------------------------------------------------------------
To unsubscribe, e-mail: builds-unsubscribe@beam.apache.org
For additional commands, e-mail: builds-help@beam.apache.org
Build failed in Jenkins: beam_PreCommit_SQL_Java17_Cron #1514
Posted by Apache Jenkins Server <je...@builds.apache.org>.
See <https://ci-beam.apache.org/job/beam_PreCommit_SQL_Java17_Cron/1514/display/redirect?page=changes>
Changes:
[noreply] [Go SDK]: Retrieve file size in CreateInitialRestriction in textio.Read
[noreply] [#24789][prism] internal/worker + tentative data (#25478)
[noreply] [#24789][prism] add preprocessor and test (#25520)
------------------------------------------
[...truncated 303.08 KB...]
java.lang.IllegalArgumentException at SqlQuery2Test.java:100
org.apache.beam.sdk.nexmark.queries.sql.SqlQuery2Test > org.apache.beam.sdk.nexmark.queries.sql.SqlQuery2Test$SqlQuery2TestZetaSql.testSkipsEveryThirdElement FAILED
java.lang.IllegalArgumentException at SqlQuery2Test.java:100
org.apache.beam.sdk.nexmark.queries.sql.SqlQuery2Test > org.apache.beam.sdk.nexmark.queries.sql.SqlQuery2Test$SqlQuery2TestCalcite.testSkipsEverySecondElement FAILED
java.lang.IllegalArgumentException at SqlQuery2Test.java:92
org.apache.beam.sdk.nexmark.queries.sql.SqlQuery2Test > org.apache.beam.sdk.nexmark.queries.sql.SqlQuery2Test$SqlQuery2TestCalcite.testSkipsEveryThirdElement FAILED
java.lang.IllegalArgumentException at SqlQuery2Test.java:92
org.apache.beam.sdk.nexmark.queries.sql.SqlQuery3Test > org.apache.beam.sdk.nexmark.queries.sql.SqlQuery3Test$SqlQuery3TestZetaSql.testJoinsPeopleWithAuctions FAILED
java.lang.IllegalArgumentException at SqlQuery3Test.java:110
org.apache.beam.sdk.nexmark.queries.sql.SqlQuery3Test > org.apache.beam.sdk.nexmark.queries.sql.SqlQuery3Test$SqlQuery3TestCalcite.testJoinsPeopleWithAuctions FAILED
java.lang.IllegalArgumentException at SqlQuery3Test.java:102
org.apache.beam.sdk.nexmark.queries.sql.SqlQuery7Test > testBids FAILED
java.lang.IllegalArgumentException at SqlQuery7Test.java:61
85 tests completed, 61 failed, 12 skipped
> Task :sdks:java:extensions:sql:test FAILED
> Task :runners:flink:1.12:job-server:distZip
> Task :runners:flink:1.13:job-server:distZip
> Task :runners:flink:1.14:job-server:distZip
> Task :runners:flink:1.15:job-server:distZip
> Task :sdks:java:extensions:sql:runBasicExample
SLF4J: Class path contains multiple SLF4J bindings.
SLF4J: Found binding in [jar:file:/home/jenkins/.gradle/caches/modules-2/files-2.1/org.slf4j/slf4j-jdk14/1.7.30/d35953dd2fe54ebe39fdf18cfd82fe6eb35b25ed/slf4j-jdk14-1.7.30.jar!/org/slf4j/impl/StaticLoggerBinder.class]
SLF4J: Found binding in [jar:file:/home/jenkins/.gradle/caches/modules-2/files-2.1/org.slf4j/slf4j-reload4j/1.7.36/db708f7d959dee1857ac524636e85ecf2e1781c1/slf4j-reload4j-1.7.36.jar!/org/slf4j/impl/StaticLoggerBinder.class]
SLF4J: Found binding in [jar:file:/home/jenkins/.gradle/caches/modules-2/files-2.1/org.slf4j/slf4j-log4j12/1.7.30/c21f55139d8141d2231214fb1feaf50a1edca95e/slf4j-log4j12-1.7.30.jar!/org/slf4j/impl/StaticLoggerBinder.class]
SLF4J: See http://www.slf4j.org/codes.html#multiple_bindings for an explanation.
SLF4J: Actual binding is of type [org.slf4j.impl.JDK14LoggerFactory]
Feb 20, 2023 2:12:10 AM org.apache.beam.sdk.extensions.sql.impl.CalciteQueryPlanner convertToBeamRel
INFO: SQL:
SELECT `PCOLLECTION`.`c1`, `PCOLLECTION`.`c2`, `PCOLLECTION`.`c3`
FROM `beam`.`PCOLLECTION` AS `PCOLLECTION`
WHERE `PCOLLECTION`.`c1` > 1
Feb 20, 2023 2:12:10 AM org.apache.beam.sdk.extensions.sql.impl.CalciteQueryPlanner convertToBeamRel
INFO: SQLPlan>
LogicalProject(c1=[$0], c2=[$1], c3=[$2])
LogicalFilter(condition=[>($0, 1)])
BeamIOSourceRel(table=[[beam, PCOLLECTION]])
Feb 20, 2023 2:12:11 AM org.apache.beam.sdk.extensions.sql.impl.CalciteQueryPlanner convertToBeamRel
INFO: BEAMPlan>
BeamCalcRel(expr#0..2=[{inputs}], expr#3=[1], expr#4=[>($t0, $t3)], proj#0..2=[{exprs}], $condition=[$t4])
BeamIOSourceRel(table=[[beam, PCOLLECTION]])
Feb 20, 2023 2:12:11 AM org.apache.beam.sdk.extensions.sql.impl.CalciteQueryPlanner convertToBeamRel
INFO: SQL:
SELECT `CASE1_RESULT`.`c2`, SUM(`CASE1_RESULT`.`c3`)
FROM `beam`.`CASE1_RESULT` AS `CASE1_RESULT`
GROUP BY `CASE1_RESULT`.`c2`
Feb 20, 2023 2:12:11 AM org.apache.beam.sdk.extensions.sql.impl.CalciteQueryPlanner convertToBeamRel
INFO: SQLPlan>
LogicalAggregate(group=[{0}], EXPR$1=[SUM($1)])
LogicalProject(c2=[$1], c3=[$2])
BeamIOSourceRel(table=[[beam, CASE1_RESULT]])
Feb 20, 2023 2:12:11 AM org.apache.beam.sdk.extensions.sql.impl.CalciteQueryPlanner convertToBeamRel
INFO: BEAMPlan>
BeamAggregationRel(group=[{1}], EXPR$1=[SUM($2)])
BeamIOSourceRel(table=[[beam, CASE1_RESULT]])
Feb 20, 2023 2:12:11 AM org.apache.beam.sdk.Pipeline validate
WARNING: The following transforms do not have stable unique names: log_result, SqlTransform
PCOLLECTION: [3, row, 3.0]
PCOLLECTION: [2, row, 2.0]
CASE1_RESULT: [row, 5.0]
> Task :sdks:java:extensions:sql:runPojoExample
SLF4J: Class path contains multiple SLF4J bindings.
SLF4J: Found binding in [jar:file:/home/jenkins/.gradle/caches/modules-2/files-2.1/org.slf4j/slf4j-jdk14/1.7.30/d35953dd2fe54ebe39fdf18cfd82fe6eb35b25ed/slf4j-jdk14-1.7.30.jar!/org/slf4j/impl/StaticLoggerBinder.class]
SLF4J: Found binding in [jar:file:/home/jenkins/.gradle/caches/modules-2/files-2.1/org.slf4j/slf4j-reload4j/1.7.36/db708f7d959dee1857ac524636e85ecf2e1781c1/slf4j-reload4j-1.7.36.jar!/org/slf4j/impl/StaticLoggerBinder.class]
SLF4J: Found binding in [jar:file:/home/jenkins/.gradle/caches/modules-2/files-2.1/org.slf4j/slf4j-log4j12/1.7.30/c21f55139d8141d2231214fb1feaf50a1edca95e/slf4j-log4j12-1.7.30.jar!/org/slf4j/impl/StaticLoggerBinder.class]
SLF4J: See http://www.slf4j.org/codes.html#multiple_bindings for an explanation.
SLF4J: Actual binding is of type [org.slf4j.impl.JDK14LoggerFactory]
Feb 20, 2023 2:12:19 AM org.apache.beam.sdk.extensions.sql.impl.CalciteQueryPlanner convertToBeamRel
INFO: SQL:
SELECT `PCOLLECTION`.`id`, `PCOLLECTION`.`name`
FROM `beam`.`PCOLLECTION` AS `PCOLLECTION`
WHERE `PCOLLECTION`.`countryOfResidence` = 'Wonderland'
Feb 20, 2023 2:12:19 AM org.apache.beam.sdk.extensions.sql.impl.CalciteQueryPlanner convertToBeamRel
INFO: SQLPlan>
LogicalProject(id=[$1], name=[$0])
LogicalFilter(condition=[=($2, 'Wonderland')])
BeamIOSourceRel(table=[[beam, PCOLLECTION]])
Feb 20, 2023 2:12:19 AM org.apache.beam.sdk.extensions.sql.impl.CalciteQueryPlanner convertToBeamRel
INFO: BEAMPlan>
BeamCalcRel(expr#0..2=[{inputs}], expr#3=['Wonderland':VARCHAR], expr#4=[=($t2, $t3)], id=[$t1], name=[$t0], $condition=[$t4])
BeamIOSourceRel(table=[[beam, PCOLLECTION]])
Feb 20, 2023 2:12:20 AM org.apache.beam.sdk.extensions.sql.impl.CalciteQueryPlanner convertToBeamRel
INFO: SQL:
SELECT COUNT(`PCOLLECTION`.`id`)
FROM `beam`.`PCOLLECTION` AS `PCOLLECTION`
Feb 20, 2023 2:12:20 AM org.apache.beam.sdk.extensions.sql.impl.CalciteQueryPlanner convertToBeamRel
INFO: SQLPlan>
LogicalAggregate(group=[{}], EXPR$0=[COUNT()])
BeamIOSourceRel(table=[[beam, PCOLLECTION]])
Feb 20, 2023 2:12:20 AM org.apache.beam.sdk.extensions.sql.impl.CalciteQueryPlanner convertToBeamRel
INFO: BEAMPlan>
BeamAggregationRel(group=[{}], EXPR$0=[COUNT()])
BeamIOSourceRel(table=[[beam, PCOLLECTION]])
Feb 20, 2023 2:12:20 AM org.apache.beam.sdk.extensions.sql.impl.CalciteQueryPlanner convertToBeamRel
INFO: SQL:
SELECT `customers`.`name`, 'order id:' || CAST(`orders`.`id` AS VARCHAR)
FROM `beam`.`orders` AS `orders`
INNER JOIN `beam`.`customers` AS `customers` ON `orders`.`customerId` = `customers`.`id`
WHERE `customers`.`name` = 'Grault'
Feb 20, 2023 2:12:20 AM org.apache.beam.sdk.extensions.sql.impl.CalciteQueryPlanner convertToBeamRel
INFO: SQLPlan>
LogicalProject(name=[$2], EXPR$1=[||('order id:', CAST($0):VARCHAR NOT NULL)])
LogicalFilter(condition=[=($2, 'Grault')])
LogicalJoin(condition=[=($1, $3)], joinType=[inner])
BeamIOSourceRel(table=[[beam, orders]])
BeamIOSourceRel(table=[[beam, customers]])
Feb 20, 2023 2:12:20 AM org.apache.beam.sdk.extensions.sql.impl.CalciteQueryPlanner convertToBeamRel
INFO: BEAMPlan>
BeamCalcRel(expr#0..4=[{inputs}], expr#5=['order id:'], expr#6=[CAST($t0):VARCHAR NOT NULL], expr#7=[||($t5, $t6)], name=[$t2], EXPR$1=[$t7])
BeamCoGBKJoinRel(condition=[=($1, $3)], joinType=[inner])
BeamIOSourceRel(table=[[beam, orders]])
BeamCalcRel(expr#0..2=[{inputs}], expr#3=['Grault':VARCHAR], expr#4=[=($t0, $t3)], proj#0..2=[{exprs}], $condition=[$t4])
BeamIOSourceRel(table=[[beam, customers]])
Feb 20, 2023 2:12:20 AM org.apache.beam.sdk.Pipeline validate
WARNING: The following transforms do not have stable unique names: Create.Values, MapElements, SqlTransform
[4, Grault]: is from Wonderland
[1, Foo]: is from Wonderland
[3, Baz]: is from Wonderland
[3]: total customers in Wonderland
[Grault, order id:7]: ordered by 'Grault'
[Grault, order id:8]: ordered by 'Grault'
> Task :sdks:java:extensions:sql:shell:distZip
> Task :sdks:java:extensions:sql:shell:assemble
> Task :sdks:java:extensions:sql:shell:analyzeClassesDependencies FROM-CACHE
> Task :sdks:java:extensions:sql:shell:analyzeDependencies UP-TO-DATE
> Task :sdks:java:extensions:sql:shell:test NO-SOURCE
> Task :sdks:java:extensions:sql:shell:check UP-TO-DATE
> Task :sdks:java:extensions:sql:shell:build
> Task :sdks:java:extensions:sql:shell:buildDependents
> Task :runners:flink:1.12:job-server:shadowJar FROM-CACHE
> Task :runners:flink:1.13:job-server:shadowJar FROM-CACHE
> Task :runners:flink:1.14:job-server:shadowJar FROM-CACHE
> Task :runners:flink:1.15:job-server:shadowJar FROM-CACHE
> Task :runners:flink:1.12:job-server:startShadowScripts
> Task :runners:flink:1.13:job-server:startShadowScripts
> Task :runners:flink:1.12:job-server:shadowDistTar
> Task :runners:flink:1.13:job-server:shadowDistTar
> Task :runners:flink:1.14:job-server:startShadowScripts
> Task :runners:flink:1.15:job-server:startShadowScripts
> Task :runners:flink:1.14:job-server:shadowDistTar
> Task :runners:flink:1.15:job-server:shadowDistTar
> Task :runners:flink:1.12:job-server:shadowDistZip
> Task :runners:flink:1.12:job-server:assemble
> Task :runners:flink:1.12:job-server:test NO-SOURCE
> Task :runners:flink:1.12:job-server:check UP-TO-DATE
> Task :runners:flink:1.12:job-server:build
> Task :runners:flink:1.12:job-server:buildDependents
> Task :runners:flink:1.13:job-server:shadowDistZip
> Task :runners:flink:1.13:job-server:assemble
> Task :runners:flink:1.13:job-server:test NO-SOURCE
> Task :runners:flink:1.13:job-server:check UP-TO-DATE
> Task :runners:flink:1.13:job-server:build
> Task :runners:flink:1.13:job-server:buildDependents
> Task :runners:flink:1.14:job-server:shadowDistZip
> Task :runners:flink:1.15:job-server:shadowDistZip
> Task :runners:flink:1.15:job-server:assemble
> Task :runners:flink:1.15:job-server:test NO-SOURCE
> Task :runners:flink:1.15:job-server:check UP-TO-DATE
> Task :runners:flink:1.15:job-server:build
> Task :runners:flink:1.15:job-server:buildDependents
> Task :runners:flink:1.14:job-server:assemble
> Task :runners:flink:1.14:job-server:test NO-SOURCE
> Task :runners:flink:1.14:job-server:check UP-TO-DATE
> Task :runners:flink:1.14:job-server:build
> Task :runners:flink:1.14:job-server:buildDependents
> Task :sdks:java:extensions:sql:expansion-service:buildDependents
FAILURE: Build completed with 4 failures.
1: Task failed with an exception.
-----------
* What went wrong:
Execution failed for task ':sdks:java:extensions:sql:jdbc:test'.
> There were failing tests. See the report at: file://<https://ci-beam.apache.org/job/beam_PreCommit_SQL_Java17_Cron/ws/src/sdks/java/extensions/sql/jdbc/build/reports/tests/test/index.html>
* Try:
> Run with --stacktrace option to get the stack trace.
> Run with --info or --debug option to get more log output.
==============================================================================
2: Task failed with an exception.
-----------
* What went wrong:
Execution failed for task ':sdks:java:extensions:sql:zetasql:test'.
> There were failing tests. See the report at: file://<https://ci-beam.apache.org/job/beam_PreCommit_SQL_Java17_Cron/ws/src/sdks/java/extensions/sql/zetasql/build/reports/tests/test/index.html>
* Try:
> Run with --stacktrace option to get the stack trace.
> Run with --info or --debug option to get more log output.
==============================================================================
3: Task failed with an exception.
-----------
* What went wrong:
Execution failed for task ':sdks:java:testing:nexmark:test'.
> There were failing tests. See the report at: file://<https://ci-beam.apache.org/job/beam_PreCommit_SQL_Java17_Cron/ws/src/sdks/java/testing/nexmark/build/reports/tests/test/index.html>
* Try:
> Run with --stacktrace option to get the stack trace.
> Run with --info or --debug option to get more log output.
==============================================================================
4: Task failed with an exception.
-----------
* What went wrong:
Execution failed for task ':sdks:java:extensions:sql:test'.
> There were failing tests. See the report at: file://<https://ci-beam.apache.org/job/beam_PreCommit_SQL_Java17_Cron/ws/src/sdks/java/extensions/sql/build/reports/tests/test/index.html>
* Try:
> Run with --stacktrace option to get the stack trace.
> Run with --info or --debug option to get more log output.
==============================================================================
* Get more help at https://help.gradle.org
Deprecated Gradle features were used in this build, making it incompatible with Gradle 8.0.
You can use '--warning-mode all' to show the individual deprecation warnings and determine if they come from your own scripts or plugins.
See https://docs.gradle.org/7.5.1/userguide/command_line_interface.html#sec:command_line_warnings
BUILD FAILED in 3m 3s
256 actionable tasks: 139 executed, 117 from cache
Publishing build scan...
https://gradle.com/s/hzwxzlgbcnkri
Build step 'Invoke Gradle script' changed build result to FAILURE
Build step 'Invoke Gradle script' marked build as failure
---------------------------------------------------------------------
To unsubscribe, e-mail: builds-unsubscribe@beam.apache.org
For additional commands, e-mail: builds-help@beam.apache.org
Build failed in Jenkins: beam_PreCommit_SQL_Java17_Cron #1513
Posted by Apache Jenkins Server <je...@builds.apache.org>.
See <https://ci-beam.apache.org/job/beam_PreCommit_SQL_Java17_Cron/1513/display/redirect?page=changes>
Changes:
[noreply] Fix Tensorflow intergration test model path (#25553)
------------------------------------------
[...truncated 302.86 KB...]
java.lang.IllegalArgumentException at SqlQuery2Test.java:100
org.apache.beam.sdk.nexmark.queries.sql.SqlQuery2Test > org.apache.beam.sdk.nexmark.queries.sql.SqlQuery2Test$SqlQuery2TestZetaSql.testSkipsEveryThirdElement FAILED
java.lang.IllegalArgumentException at SqlQuery2Test.java:100
org.apache.beam.sdk.nexmark.queries.sql.SqlQuery2Test > org.apache.beam.sdk.nexmark.queries.sql.SqlQuery2Test$SqlQuery2TestCalcite.testSkipsEverySecondElement FAILED
java.lang.IllegalArgumentException at SqlQuery2Test.java:92
org.apache.beam.sdk.nexmark.queries.sql.SqlQuery2Test > org.apache.beam.sdk.nexmark.queries.sql.SqlQuery2Test$SqlQuery2TestCalcite.testSkipsEveryThirdElement FAILED
java.lang.IllegalArgumentException at SqlQuery2Test.java:92
org.apache.beam.sdk.nexmark.queries.sql.SqlQuery3Test > org.apache.beam.sdk.nexmark.queries.sql.SqlQuery3Test$SqlQuery3TestZetaSql.testJoinsPeopleWithAuctions FAILED
java.lang.IllegalArgumentException at SqlQuery3Test.java:110
org.apache.beam.sdk.nexmark.queries.sql.SqlQuery3Test > org.apache.beam.sdk.nexmark.queries.sql.SqlQuery3Test$SqlQuery3TestCalcite.testJoinsPeopleWithAuctions FAILED
java.lang.IllegalArgumentException at SqlQuery3Test.java:102
org.apache.beam.sdk.nexmark.queries.sql.SqlQuery7Test > testBids FAILED
java.lang.IllegalArgumentException at SqlQuery7Test.java:61
85 tests completed, 61 failed, 12 skipped
> Task :sdks:java:extensions:sql:test FAILED
> Task :runners:flink:1.12:job-server:distZip
> Task :runners:flink:1.13:job-server:distZip
> Task :runners:flink:1.14:job-server:distZip
> Task :runners:flink:1.15:job-server:distZip
> Task :sdks:java:extensions:sql:runBasicExample
SLF4J: Class path contains multiple SLF4J bindings.
SLF4J: Found binding in [jar:file:/home/jenkins/.gradle/caches/modules-2/files-2.1/org.slf4j/slf4j-jdk14/1.7.30/d35953dd2fe54ebe39fdf18cfd82fe6eb35b25ed/slf4j-jdk14-1.7.30.jar!/org/slf4j/impl/StaticLoggerBinder.class]
SLF4J: Found binding in [jar:file:/home/jenkins/.gradle/caches/modules-2/files-2.1/org.slf4j/slf4j-reload4j/1.7.36/db708f7d959dee1857ac524636e85ecf2e1781c1/slf4j-reload4j-1.7.36.jar!/org/slf4j/impl/StaticLoggerBinder.class]
SLF4J: Found binding in [jar:file:/home/jenkins/.gradle/caches/modules-2/files-2.1/org.slf4j/slf4j-log4j12/1.7.30/c21f55139d8141d2231214fb1feaf50a1edca95e/slf4j-log4j12-1.7.30.jar!/org/slf4j/impl/StaticLoggerBinder.class]
SLF4J: See http://www.slf4j.org/codes.html#multiple_bindings for an explanation.
SLF4J: Actual binding is of type [org.slf4j.impl.JDK14LoggerFactory]
Feb 19, 2023 8:12:06 PM org.apache.beam.sdk.extensions.sql.impl.CalciteQueryPlanner convertToBeamRel
INFO: SQL:
SELECT `PCOLLECTION`.`c1`, `PCOLLECTION`.`c2`, `PCOLLECTION`.`c3`
FROM `beam`.`PCOLLECTION` AS `PCOLLECTION`
WHERE `PCOLLECTION`.`c1` > 1
Feb 19, 2023 8:12:07 PM org.apache.beam.sdk.extensions.sql.impl.CalciteQueryPlanner convertToBeamRel
INFO: SQLPlan>
LogicalProject(c1=[$0], c2=[$1], c3=[$2])
LogicalFilter(condition=[>($0, 1)])
BeamIOSourceRel(table=[[beam, PCOLLECTION]])
Feb 19, 2023 8:12:07 PM org.apache.beam.sdk.extensions.sql.impl.CalciteQueryPlanner convertToBeamRel
INFO: BEAMPlan>
BeamCalcRel(expr#0..2=[{inputs}], expr#3=[1], expr#4=[>($t0, $t3)], proj#0..2=[{exprs}], $condition=[$t4])
BeamIOSourceRel(table=[[beam, PCOLLECTION]])
Feb 19, 2023 8:12:07 PM org.apache.beam.sdk.extensions.sql.impl.CalciteQueryPlanner convertToBeamRel
INFO: SQL:
SELECT `CASE1_RESULT`.`c2`, SUM(`CASE1_RESULT`.`c3`)
FROM `beam`.`CASE1_RESULT` AS `CASE1_RESULT`
GROUP BY `CASE1_RESULT`.`c2`
Feb 19, 2023 8:12:07 PM org.apache.beam.sdk.extensions.sql.impl.CalciteQueryPlanner convertToBeamRel
INFO: SQLPlan>
LogicalAggregate(group=[{0}], EXPR$1=[SUM($1)])
LogicalProject(c2=[$1], c3=[$2])
BeamIOSourceRel(table=[[beam, CASE1_RESULT]])
Feb 19, 2023 8:12:07 PM org.apache.beam.sdk.extensions.sql.impl.CalciteQueryPlanner convertToBeamRel
INFO: BEAMPlan>
BeamAggregationRel(group=[{1}], EXPR$1=[SUM($2)])
BeamIOSourceRel(table=[[beam, CASE1_RESULT]])
Feb 19, 2023 8:12:08 PM org.apache.beam.sdk.Pipeline validate
WARNING: The following transforms do not have stable unique names: log_result, SqlTransform
PCOLLECTION: [3, row, 3.0]
PCOLLECTION: [2, row, 2.0]
CASE1_RESULT: [row, 5.0]
> Task :sdks:java:extensions:sql:runPojoExample
SLF4J: Class path contains multiple SLF4J bindings.
SLF4J: Found binding in [jar:file:/home/jenkins/.gradle/caches/modules-2/files-2.1/org.slf4j/slf4j-jdk14/1.7.30/d35953dd2fe54ebe39fdf18cfd82fe6eb35b25ed/slf4j-jdk14-1.7.30.jar!/org/slf4j/impl/StaticLoggerBinder.class]
SLF4J: Found binding in [jar:file:/home/jenkins/.gradle/caches/modules-2/files-2.1/org.slf4j/slf4j-reload4j/1.7.36/db708f7d959dee1857ac524636e85ecf2e1781c1/slf4j-reload4j-1.7.36.jar!/org/slf4j/impl/StaticLoggerBinder.class]
SLF4J: Found binding in [jar:file:/home/jenkins/.gradle/caches/modules-2/files-2.1/org.slf4j/slf4j-log4j12/1.7.30/c21f55139d8141d2231214fb1feaf50a1edca95e/slf4j-log4j12-1.7.30.jar!/org/slf4j/impl/StaticLoggerBinder.class]
SLF4J: See http://www.slf4j.org/codes.html#multiple_bindings for an explanation.
SLF4J: Actual binding is of type [org.slf4j.impl.JDK14LoggerFactory]
Feb 19, 2023 8:12:15 PM org.apache.beam.sdk.extensions.sql.impl.CalciteQueryPlanner convertToBeamRel
INFO: SQL:
SELECT `PCOLLECTION`.`id`, `PCOLLECTION`.`name`
FROM `beam`.`PCOLLECTION` AS `PCOLLECTION`
WHERE `PCOLLECTION`.`countryOfResidence` = 'Wonderland'
Feb 19, 2023 8:12:15 PM org.apache.beam.sdk.extensions.sql.impl.CalciteQueryPlanner convertToBeamRel
INFO: SQLPlan>
LogicalProject(id=[$1], name=[$0])
LogicalFilter(condition=[=($2, 'Wonderland')])
BeamIOSourceRel(table=[[beam, PCOLLECTION]])
Feb 19, 2023 8:12:16 PM org.apache.beam.sdk.extensions.sql.impl.CalciteQueryPlanner convertToBeamRel
INFO: BEAMPlan>
BeamCalcRel(expr#0..2=[{inputs}], expr#3=['Wonderland':VARCHAR], expr#4=[=($t2, $t3)], id=[$t1], name=[$t0], $condition=[$t4])
BeamIOSourceRel(table=[[beam, PCOLLECTION]])
Feb 19, 2023 8:12:16 PM org.apache.beam.sdk.extensions.sql.impl.CalciteQueryPlanner convertToBeamRel
INFO: SQL:
SELECT COUNT(`PCOLLECTION`.`id`)
FROM `beam`.`PCOLLECTION` AS `PCOLLECTION`
Feb 19, 2023 8:12:16 PM org.apache.beam.sdk.extensions.sql.impl.CalciteQueryPlanner convertToBeamRel
INFO: SQLPlan>
LogicalAggregate(group=[{}], EXPR$0=[COUNT()])
BeamIOSourceRel(table=[[beam, PCOLLECTION]])
Feb 19, 2023 8:12:16 PM org.apache.beam.sdk.extensions.sql.impl.CalciteQueryPlanner convertToBeamRel
INFO: BEAMPlan>
BeamAggregationRel(group=[{}], EXPR$0=[COUNT()])
BeamIOSourceRel(table=[[beam, PCOLLECTION]])
Feb 19, 2023 8:12:16 PM org.apache.beam.sdk.extensions.sql.impl.CalciteQueryPlanner convertToBeamRel
INFO: SQL:
SELECT `customers`.`name`, 'order id:' || CAST(`orders`.`id` AS VARCHAR)
FROM `beam`.`orders` AS `orders`
INNER JOIN `beam`.`customers` AS `customers` ON `orders`.`customerId` = `customers`.`id`
WHERE `customers`.`name` = 'Grault'
Feb 19, 2023 8:12:16 PM org.apache.beam.sdk.extensions.sql.impl.CalciteQueryPlanner convertToBeamRel
INFO: SQLPlan>
LogicalProject(name=[$2], EXPR$1=[||('order id:', CAST($0):VARCHAR NOT NULL)])
LogicalFilter(condition=[=($2, 'Grault')])
LogicalJoin(condition=[=($1, $3)], joinType=[inner])
BeamIOSourceRel(table=[[beam, orders]])
BeamIOSourceRel(table=[[beam, customers]])
Feb 19, 2023 8:12:17 PM org.apache.beam.sdk.extensions.sql.impl.CalciteQueryPlanner convertToBeamRel
INFO: BEAMPlan>
BeamCalcRel(expr#0..4=[{inputs}], expr#5=['order id:'], expr#6=[CAST($t0):VARCHAR NOT NULL], expr#7=[||($t5, $t6)], name=[$t2], EXPR$1=[$t7])
BeamCoGBKJoinRel(condition=[=($1, $3)], joinType=[inner])
BeamIOSourceRel(table=[[beam, orders]])
BeamCalcRel(expr#0..2=[{inputs}], expr#3=['Grault':VARCHAR], expr#4=[=($t0, $t3)], proj#0..2=[{exprs}], $condition=[$t4])
BeamIOSourceRel(table=[[beam, customers]])
Feb 19, 2023 8:12:17 PM org.apache.beam.sdk.Pipeline validate
WARNING: The following transforms do not have stable unique names: Create.Values, MapElements, SqlTransform
[4, Grault]: is from Wonderland
[3, Baz]: is from Wonderland
[1, Foo]: is from Wonderland
[3]: total customers in Wonderland
[Grault, order id:8]: ordered by 'Grault'
[Grault, order id:7]: ordered by 'Grault'
> Task :sdks:java:extensions:sql:shell:distZip
> Task :sdks:java:extensions:sql:shell:assemble
> Task :sdks:java:extensions:sql:shell:analyzeClassesDependencies FROM-CACHE
> Task :sdks:java:extensions:sql:shell:analyzeDependencies UP-TO-DATE
> Task :sdks:java:extensions:sql:shell:test NO-SOURCE
> Task :sdks:java:extensions:sql:shell:check UP-TO-DATE
> Task :sdks:java:extensions:sql:shell:build
> Task :sdks:java:extensions:sql:shell:buildDependents
> Task :runners:flink:1.12:job-server:shadowJar FROM-CACHE
> Task :runners:flink:1.13:job-server:shadowJar FROM-CACHE
> Task :runners:flink:1.14:job-server:shadowJar FROM-CACHE
> Task :runners:flink:1.15:job-server:shadowJar FROM-CACHE
> Task :runners:flink:1.13:job-server:startShadowScripts
> Task :runners:flink:1.12:job-server:startShadowScripts
> Task :runners:flink:1.13:job-server:shadowDistTar
> Task :runners:flink:1.12:job-server:shadowDistTar
> Task :runners:flink:1.14:job-server:startShadowScripts
> Task :runners:flink:1.15:job-server:startShadowScripts
> Task :runners:flink:1.14:job-server:shadowDistTar
> Task :runners:flink:1.15:job-server:shadowDistTar
> Task :runners:flink:1.13:job-server:shadowDistZip
> Task :runners:flink:1.13:job-server:assemble
> Task :runners:flink:1.13:job-server:test NO-SOURCE
> Task :runners:flink:1.13:job-server:check UP-TO-DATE
> Task :runners:flink:1.13:job-server:build
> Task :runners:flink:1.13:job-server:buildDependents
> Task :runners:flink:1.12:job-server:shadowDistZip
> Task :runners:flink:1.12:job-server:assemble
> Task :runners:flink:1.12:job-server:test NO-SOURCE
> Task :runners:flink:1.12:job-server:check UP-TO-DATE
> Task :runners:flink:1.12:job-server:build
> Task :runners:flink:1.12:job-server:buildDependents
> Task :runners:flink:1.14:job-server:shadowDistZip
> Task :runners:flink:1.14:job-server:assemble
> Task :runners:flink:1.14:job-server:test NO-SOURCE
> Task :runners:flink:1.14:job-server:check UP-TO-DATE
> Task :runners:flink:1.14:job-server:build
> Task :runners:flink:1.14:job-server:buildDependents
> Task :runners:flink:1.15:job-server:shadowDistZip
> Task :runners:flink:1.15:job-server:assemble
> Task :runners:flink:1.15:job-server:test NO-SOURCE
> Task :runners:flink:1.15:job-server:check UP-TO-DATE
> Task :runners:flink:1.15:job-server:build
> Task :runners:flink:1.15:job-server:buildDependents
> Task :sdks:java:extensions:sql:expansion-service:buildDependents
FAILURE: Build completed with 4 failures.
1: Task failed with an exception.
-----------
* What went wrong:
Execution failed for task ':sdks:java:extensions:sql:jdbc:test'.
> There were failing tests. See the report at: file://<https://ci-beam.apache.org/job/beam_PreCommit_SQL_Java17_Cron/ws/src/sdks/java/extensions/sql/jdbc/build/reports/tests/test/index.html>
* Try:
> Run with --stacktrace option to get the stack trace.
> Run with --info or --debug option to get more log output.
==============================================================================
2: Task failed with an exception.
-----------
* What went wrong:
Execution failed for task ':sdks:java:extensions:sql:zetasql:test'.
> There were failing tests. See the report at: file://<https://ci-beam.apache.org/job/beam_PreCommit_SQL_Java17_Cron/ws/src/sdks/java/extensions/sql/zetasql/build/reports/tests/test/index.html>
* Try:
> Run with --stacktrace option to get the stack trace.
> Run with --info or --debug option to get more log output.
==============================================================================
3: Task failed with an exception.
-----------
* What went wrong:
Execution failed for task ':sdks:java:testing:nexmark:test'.
> There were failing tests. See the report at: file://<https://ci-beam.apache.org/job/beam_PreCommit_SQL_Java17_Cron/ws/src/sdks/java/testing/nexmark/build/reports/tests/test/index.html>
* Try:
> Run with --stacktrace option to get the stack trace.
> Run with --info or --debug option to get more log output.
==============================================================================
4: Task failed with an exception.
-----------
* What went wrong:
Execution failed for task ':sdks:java:extensions:sql:test'.
> There were failing tests. See the report at: file://<https://ci-beam.apache.org/job/beam_PreCommit_SQL_Java17_Cron/ws/src/sdks/java/extensions/sql/build/reports/tests/test/index.html>
* Try:
> Run with --stacktrace option to get the stack trace.
> Run with --info or --debug option to get more log output.
==============================================================================
* Get more help at https://help.gradle.org
Deprecated Gradle features were used in this build, making it incompatible with Gradle 8.0.
You can use '--warning-mode all' to show the individual deprecation warnings and determine if they come from your own scripts or plugins.
See https://docs.gradle.org/7.5.1/userguide/command_line_interface.html#sec:command_line_warnings
BUILD FAILED in 2m 57s
256 actionable tasks: 139 executed, 117 from cache
Publishing build scan...
https://gradle.com/s/txskzmtzb6lkw
Build step 'Invoke Gradle script' changed build result to FAILURE
Build step 'Invoke Gradle script' marked build as failure
---------------------------------------------------------------------
To unsubscribe, e-mail: builds-unsubscribe@beam.apache.org
For additional commands, e-mail: builds-help@beam.apache.org
Build failed in Jenkins: beam_PreCommit_SQL_Java17_Cron #1512
Posted by Apache Jenkins Server <je...@builds.apache.org>.
See <https://ci-beam.apache.org/job/beam_PreCommit_SQL_Java17_Cron/1512/display/redirect>
Changes:
------------------------------------------
[...truncated 303.73 KB...]
> Task :sdks:java:extensions:sql:test FAILED
org.apache.beam.sdk.extensions.sql.meta.provider.text.TextTableProviderTest > testJson FAILED
java.lang.IllegalArgumentException at TextTableProviderTest.java:224
org.apache.beam.sdk.extensions.sql.meta.provider.text.TextTableProviderTest > testWriteCsv FAILED
java.lang.IllegalArgumentException at TextTableProviderTest.java:282
org.apache.beam.sdk.extensions.sql.meta.provider.text.TextTableProviderTest > testWriteJson FAILED
java.lang.IllegalArgumentException at TextTableProviderTest.java:301
org.apache.beam.sdk.extensions.sql.meta.provider.text.TextTableProviderTest > testExplicitCsv FAILED
java.lang.IllegalArgumentException at TextTableProviderTest.java:152
org.apache.beam.sdk.extensions.sql.meta.provider.text.TextTableProviderTest > testExplicitCsvExcel FAILED
java.lang.IllegalArgumentException at TextTableProviderTest.java:180
org.apache.beam.sdk.extensions.sql.meta.provider.text.TextTableProviderTest > testLegacyTdfCsv FAILED
java.lang.IllegalArgumentException at TextTableProviderTest.java:127
715 tests completed, 455 failed, 8 skipped
> Task :runners:flink:1.12:job-server:distZip
> Task :runners:flink:1.13:job-server:distZip
> Task :runners:flink:1.14:job-server:distZip
> Task :runners:flink:1.15:job-server:distZip
> Task :sdks:java:extensions:sql:runBasicExample
SLF4J: Class path contains multiple SLF4J bindings.
SLF4J: Found binding in [jar:file:/home/jenkins/.gradle/caches/modules-2/files-2.1/org.slf4j/slf4j-jdk14/1.7.30/d35953dd2fe54ebe39fdf18cfd82fe6eb35b25ed/slf4j-jdk14-1.7.30.jar!/org/slf4j/impl/StaticLoggerBinder.class]
SLF4J: Found binding in [jar:file:/home/jenkins/.gradle/caches/modules-2/files-2.1/org.slf4j/slf4j-reload4j/1.7.36/db708f7d959dee1857ac524636e85ecf2e1781c1/slf4j-reload4j-1.7.36.jar!/org/slf4j/impl/StaticLoggerBinder.class]
SLF4J: Found binding in [jar:file:/home/jenkins/.gradle/caches/modules-2/files-2.1/org.slf4j/slf4j-log4j12/1.7.30/c21f55139d8141d2231214fb1feaf50a1edca95e/slf4j-log4j12-1.7.30.jar!/org/slf4j/impl/StaticLoggerBinder.class]
SLF4J: See http://www.slf4j.org/codes.html#multiple_bindings for an explanation.
SLF4J: Actual binding is of type [org.slf4j.impl.JDK14LoggerFactory]
Feb 19, 2023 2:12:14 PM org.apache.beam.sdk.extensions.sql.impl.CalciteQueryPlanner convertToBeamRel
INFO: SQL:
SELECT `PCOLLECTION`.`c1`, `PCOLLECTION`.`c2`, `PCOLLECTION`.`c3`
FROM `beam`.`PCOLLECTION` AS `PCOLLECTION`
WHERE `PCOLLECTION`.`c1` > 1
Feb 19, 2023 2:12:14 PM org.apache.beam.sdk.extensions.sql.impl.CalciteQueryPlanner convertToBeamRel
INFO: SQLPlan>
LogicalProject(c1=[$0], c2=[$1], c3=[$2])
LogicalFilter(condition=[>($0, 1)])
BeamIOSourceRel(table=[[beam, PCOLLECTION]])
Feb 19, 2023 2:12:15 PM org.apache.beam.sdk.extensions.sql.impl.CalciteQueryPlanner convertToBeamRel
INFO: BEAMPlan>
BeamCalcRel(expr#0..2=[{inputs}], expr#3=[1], expr#4=[>($t0, $t3)], proj#0..2=[{exprs}], $condition=[$t4])
BeamIOSourceRel(table=[[beam, PCOLLECTION]])
Feb 19, 2023 2:12:15 PM org.apache.beam.sdk.extensions.sql.impl.CalciteQueryPlanner convertToBeamRel
INFO: SQL:
SELECT `CASE1_RESULT`.`c2`, SUM(`CASE1_RESULT`.`c3`)
FROM `beam`.`CASE1_RESULT` AS `CASE1_RESULT`
GROUP BY `CASE1_RESULT`.`c2`
Feb 19, 2023 2:12:15 PM org.apache.beam.sdk.extensions.sql.impl.CalciteQueryPlanner convertToBeamRel
INFO: SQLPlan>
LogicalAggregate(group=[{0}], EXPR$1=[SUM($1)])
LogicalProject(c2=[$1], c3=[$2])
BeamIOSourceRel(table=[[beam, CASE1_RESULT]])
Feb 19, 2023 2:12:15 PM org.apache.beam.sdk.extensions.sql.impl.CalciteQueryPlanner convertToBeamRel
INFO: BEAMPlan>
BeamAggregationRel(group=[{1}], EXPR$1=[SUM($2)])
BeamIOSourceRel(table=[[beam, CASE1_RESULT]])
Feb 19, 2023 2:12:16 PM org.apache.beam.sdk.Pipeline validate
WARNING: The following transforms do not have stable unique names: log_result, SqlTransform
PCOLLECTION: [2, row, 2.0]
PCOLLECTION: [3, row, 3.0]
CASE1_RESULT: [row, 5.0]
> Task :sdks:java:extensions:sql:runPojoExample
SLF4J: Class path contains multiple SLF4J bindings.
SLF4J: Found binding in [jar:file:/home/jenkins/.gradle/caches/modules-2/files-2.1/org.slf4j/slf4j-jdk14/1.7.30/d35953dd2fe54ebe39fdf18cfd82fe6eb35b25ed/slf4j-jdk14-1.7.30.jar!/org/slf4j/impl/StaticLoggerBinder.class]
SLF4J: Found binding in [jar:file:/home/jenkins/.gradle/caches/modules-2/files-2.1/org.slf4j/slf4j-reload4j/1.7.36/db708f7d959dee1857ac524636e85ecf2e1781c1/slf4j-reload4j-1.7.36.jar!/org/slf4j/impl/StaticLoggerBinder.class]
SLF4J: Found binding in [jar:file:/home/jenkins/.gradle/caches/modules-2/files-2.1/org.slf4j/slf4j-log4j12/1.7.30/c21f55139d8141d2231214fb1feaf50a1edca95e/slf4j-log4j12-1.7.30.jar!/org/slf4j/impl/StaticLoggerBinder.class]
SLF4J: See http://www.slf4j.org/codes.html#multiple_bindings for an explanation.
SLF4J: Actual binding is of type [org.slf4j.impl.JDK14LoggerFactory]
Feb 19, 2023 2:12:23 PM org.apache.beam.sdk.extensions.sql.impl.CalciteQueryPlanner convertToBeamRel
INFO: SQL:
SELECT `PCOLLECTION`.`id`, `PCOLLECTION`.`name`
FROM `beam`.`PCOLLECTION` AS `PCOLLECTION`
WHERE `PCOLLECTION`.`countryOfResidence` = 'Wonderland'
Feb 19, 2023 2:12:24 PM org.apache.beam.sdk.extensions.sql.impl.CalciteQueryPlanner convertToBeamRel
INFO: SQLPlan>
LogicalProject(id=[$1], name=[$0])
LogicalFilter(condition=[=($2, 'Wonderland')])
BeamIOSourceRel(table=[[beam, PCOLLECTION]])
Feb 19, 2023 2:12:24 PM org.apache.beam.sdk.extensions.sql.impl.CalciteQueryPlanner convertToBeamRel
INFO: BEAMPlan>
BeamCalcRel(expr#0..2=[{inputs}], expr#3=['Wonderland':VARCHAR], expr#4=[=($t2, $t3)], id=[$t1], name=[$t0], $condition=[$t4])
BeamIOSourceRel(table=[[beam, PCOLLECTION]])
Feb 19, 2023 2:12:24 PM org.apache.beam.sdk.extensions.sql.impl.CalciteQueryPlanner convertToBeamRel
INFO: SQL:
SELECT COUNT(`PCOLLECTION`.`id`)
FROM `beam`.`PCOLLECTION` AS `PCOLLECTION`
Feb 19, 2023 2:12:24 PM org.apache.beam.sdk.extensions.sql.impl.CalciteQueryPlanner convertToBeamRel
INFO: SQLPlan>
LogicalAggregate(group=[{}], EXPR$0=[COUNT()])
BeamIOSourceRel(table=[[beam, PCOLLECTION]])
Feb 19, 2023 2:12:24 PM org.apache.beam.sdk.extensions.sql.impl.CalciteQueryPlanner convertToBeamRel
INFO: BEAMPlan>
BeamAggregationRel(group=[{}], EXPR$0=[COUNT()])
BeamIOSourceRel(table=[[beam, PCOLLECTION]])
Feb 19, 2023 2:12:24 PM org.apache.beam.sdk.extensions.sql.impl.CalciteQueryPlanner convertToBeamRel
INFO: SQL:
SELECT `customers`.`name`, 'order id:' || CAST(`orders`.`id` AS VARCHAR)
FROM `beam`.`orders` AS `orders`
INNER JOIN `beam`.`customers` AS `customers` ON `orders`.`customerId` = `customers`.`id`
WHERE `customers`.`name` = 'Grault'
Feb 19, 2023 2:12:24 PM org.apache.beam.sdk.extensions.sql.impl.CalciteQueryPlanner convertToBeamRel
INFO: SQLPlan>
LogicalProject(name=[$2], EXPR$1=[||('order id:', CAST($0):VARCHAR NOT NULL)])
LogicalFilter(condition=[=($2, 'Grault')])
LogicalJoin(condition=[=($1, $3)], joinType=[inner])
BeamIOSourceRel(table=[[beam, orders]])
BeamIOSourceRel(table=[[beam, customers]])
Feb 19, 2023 2:12:25 PM org.apache.beam.sdk.extensions.sql.impl.CalciteQueryPlanner convertToBeamRel
INFO: BEAMPlan>
BeamCalcRel(expr#0..4=[{inputs}], expr#5=['order id:'], expr#6=[CAST($t0):VARCHAR NOT NULL], expr#7=[||($t5, $t6)], name=[$t2], EXPR$1=[$t7])
BeamCoGBKJoinRel(condition=[=($1, $3)], joinType=[inner])
BeamIOSourceRel(table=[[beam, orders]])
BeamCalcRel(expr#0..2=[{inputs}], expr#3=['Grault':VARCHAR], expr#4=[=($t0, $t3)], proj#0..2=[{exprs}], $condition=[$t4])
BeamIOSourceRel(table=[[beam, customers]])
Feb 19, 2023 2:12:25 PM org.apache.beam.sdk.Pipeline validate
WARNING: The following transforms do not have stable unique names: Create.Values, MapElements, SqlTransform
[3, Baz]: is from Wonderland
[1, Foo]: is from Wonderland
[4, Grault]: is from Wonderland
[3]: total customers in Wonderland
[Grault, order id:7]: ordered by 'Grault'
[Grault, order id:8]: ordered by 'Grault'
> Task :sdks:java:extensions:sql:shell:distZip
> Task :sdks:java:extensions:sql:shell:assemble
> Task :sdks:java:extensions:sql:shell:analyzeClassesDependencies FROM-CACHE
> Task :sdks:java:extensions:sql:shell:analyzeDependencies UP-TO-DATE
> Task :sdks:java:extensions:sql:shell:test NO-SOURCE
> Task :sdks:java:extensions:sql:shell:check UP-TO-DATE
> Task :sdks:java:extensions:sql:shell:build
> Task :sdks:java:extensions:sql:shell:buildDependents
> Task :runners:flink:1.13:job-server:shadowJar FROM-CACHE
> Task :runners:flink:1.12:job-server:shadowJar FROM-CACHE
> Task :runners:flink:1.14:job-server:shadowJar FROM-CACHE
> Task :runners:flink:1.15:job-server:shadowJar FROM-CACHE
> Task :runners:flink:1.13:job-server:startShadowScripts
> Task :runners:flink:1.12:job-server:startShadowScripts
> Task :runners:flink:1.13:job-server:shadowDistTar
> Task :runners:flink:1.12:job-server:shadowDistTar
> Task :runners:flink:1.14:job-server:startShadowScripts
> Task :runners:flink:1.15:job-server:startShadowScripts
> Task :runners:flink:1.14:job-server:shadowDistTar
> Task :runners:flink:1.15:job-server:shadowDistTar
> Task :runners:flink:1.13:job-server:shadowDistZip
> Task :runners:flink:1.13:job-server:assemble
> Task :runners:flink:1.13:job-server:test NO-SOURCE
> Task :runners:flink:1.13:job-server:check UP-TO-DATE
> Task :runners:flink:1.13:job-server:build
> Task :runners:flink:1.13:job-server:buildDependents
> Task :runners:flink:1.12:job-server:shadowDistZip
> Task :runners:flink:1.12:job-server:assemble
> Task :runners:flink:1.12:job-server:test NO-SOURCE
> Task :runners:flink:1.12:job-server:check UP-TO-DATE
> Task :runners:flink:1.12:job-server:build
> Task :runners:flink:1.12:job-server:buildDependents
> Task :runners:flink:1.14:job-server:shadowDistZip
> Task :runners:flink:1.15:job-server:shadowDistZip
> Task :runners:flink:1.15:job-server:assemble
> Task :runners:flink:1.15:job-server:test NO-SOURCE
> Task :runners:flink:1.15:job-server:check UP-TO-DATE
> Task :runners:flink:1.15:job-server:build
> Task :runners:flink:1.15:job-server:buildDependents
> Task :runners:flink:1.14:job-server:assemble
> Task :runners:flink:1.14:job-server:test NO-SOURCE
> Task :runners:flink:1.14:job-server:check UP-TO-DATE
> Task :runners:flink:1.14:job-server:build
> Task :runners:flink:1.14:job-server:buildDependents
> Task :sdks:java:extensions:sql:expansion-service:buildDependents
FAILURE: Build completed with 4 failures.
1: Task failed with an exception.
-----------
* What went wrong:
Execution failed for task ':sdks:java:extensions:sql:jdbc:test'.
> There were failing tests. See the report at: file://<https://ci-beam.apache.org/job/beam_PreCommit_SQL_Java17_Cron/ws/src/sdks/java/extensions/sql/jdbc/build/reports/tests/test/index.html>
* Try:
> Run with --stacktrace option to get the stack trace.
> Run with --info or --debug option to get more log output.
==============================================================================
2: Task failed with an exception.
-----------
* What went wrong:
Execution failed for task ':sdks:java:extensions:sql:zetasql:test'.
> There were failing tests. See the report at: file://<https://ci-beam.apache.org/job/beam_PreCommit_SQL_Java17_Cron/ws/src/sdks/java/extensions/sql/zetasql/build/reports/tests/test/index.html>
* Try:
> Run with --stacktrace option to get the stack trace.
> Run with --info or --debug option to get more log output.
==============================================================================
3: Task failed with an exception.
-----------
* What went wrong:
Execution failed for task ':sdks:java:testing:nexmark:test'.
> There were failing tests. See the report at: file://<https://ci-beam.apache.org/job/beam_PreCommit_SQL_Java17_Cron/ws/src/sdks/java/testing/nexmark/build/reports/tests/test/index.html>
* Try:
> Run with --stacktrace option to get the stack trace.
> Run with --info or --debug option to get more log output.
==============================================================================
4: Task failed with an exception.
-----------
* What went wrong:
Execution failed for task ':sdks:java:extensions:sql:test'.
> There were failing tests. See the report at: file://<https://ci-beam.apache.org/job/beam_PreCommit_SQL_Java17_Cron/ws/src/sdks/java/extensions/sql/build/reports/tests/test/index.html>
* Try:
> Run with --stacktrace option to get the stack trace.
> Run with --info or --debug option to get more log output.
==============================================================================
* Get more help at https://help.gradle.org
Deprecated Gradle features were used in this build, making it incompatible with Gradle 8.0.
You can use '--warning-mode all' to show the individual deprecation warnings and determine if they come from your own scripts or plugins.
See https://docs.gradle.org/7.5.1/userguide/command_line_interface.html#sec:command_line_warnings
BUILD FAILED in 3m 5s
256 actionable tasks: 139 executed, 117 from cache
Publishing build scan...
https://gradle.com/s/ij2ccwrerpd4g
Build step 'Invoke Gradle script' changed build result to FAILURE
Build step 'Invoke Gradle script' marked build as failure
---------------------------------------------------------------------
To unsubscribe, e-mail: builds-unsubscribe@beam.apache.org
For additional commands, e-mail: builds-help@beam.apache.org
Build failed in Jenkins: beam_PreCommit_SQL_Java17_Cron #1511
Posted by Apache Jenkins Server <je...@builds.apache.org>.
See <https://ci-beam.apache.org/job/beam_PreCommit_SQL_Java17_Cron/1511/display/redirect>
Changes:
------------------------------------------
[...truncated 303.77 KB...]
org.apache.beam.sdk.extensions.sql.meta.provider.text.TextTableProviderTest > testJson FAILED
java.lang.IllegalArgumentException at TextTableProviderTest.java:224
org.apache.beam.sdk.extensions.sql.meta.provider.text.TextTableProviderTest > testWriteCsv FAILED
java.lang.IllegalArgumentException at TextTableProviderTest.java:282
org.apache.beam.sdk.extensions.sql.meta.provider.text.TextTableProviderTest > testWriteJson FAILED
java.lang.IllegalArgumentException at TextTableProviderTest.java:301
org.apache.beam.sdk.extensions.sql.meta.provider.text.TextTableProviderTest > testExplicitCsv FAILED
java.lang.IllegalArgumentException at TextTableProviderTest.java:152
org.apache.beam.sdk.extensions.sql.meta.provider.text.TextTableProviderTest > testExplicitCsvExcel FAILED
java.lang.IllegalArgumentException at TextTableProviderTest.java:180
org.apache.beam.sdk.extensions.sql.meta.provider.text.TextTableProviderTest > testLegacyTdfCsv FAILED
java.lang.IllegalArgumentException at TextTableProviderTest.java:127
715 tests completed, 455 failed, 8 skipped
> Task :runners:flink:1.12:job-server:distZip
> Task :runners:flink:1.13:job-server:distZip
> Task :runners:flink:1.14:job-server:distZip
> Task :runners:flink:1.15:job-server:distZip
> Task :sdks:java:extensions:sql:runBasicExample
SLF4J: Class path contains multiple SLF4J bindings.
SLF4J: Found binding in [jar:file:/home/jenkins/.gradle/caches/modules-2/files-2.1/org.slf4j/slf4j-jdk14/1.7.30/d35953dd2fe54ebe39fdf18cfd82fe6eb35b25ed/slf4j-jdk14-1.7.30.jar!/org/slf4j/impl/StaticLoggerBinder.class]
SLF4J: Found binding in [jar:file:/home/jenkins/.gradle/caches/modules-2/files-2.1/org.slf4j/slf4j-reload4j/1.7.36/db708f7d959dee1857ac524636e85ecf2e1781c1/slf4j-reload4j-1.7.36.jar!/org/slf4j/impl/StaticLoggerBinder.class]
SLF4J: Found binding in [jar:file:/home/jenkins/.gradle/caches/modules-2/files-2.1/org.slf4j/slf4j-log4j12/1.7.30/c21f55139d8141d2231214fb1feaf50a1edca95e/slf4j-log4j12-1.7.30.jar!/org/slf4j/impl/StaticLoggerBinder.class]
SLF4J: See http://www.slf4j.org/codes.html#multiple_bindings for an explanation.
SLF4J: Actual binding is of type [org.slf4j.impl.JDK14LoggerFactory]
Feb 19, 2023 8:12:15 AM org.apache.beam.sdk.extensions.sql.impl.CalciteQueryPlanner convertToBeamRel
INFO: SQL:
SELECT `PCOLLECTION`.`c1`, `PCOLLECTION`.`c2`, `PCOLLECTION`.`c3`
FROM `beam`.`PCOLLECTION` AS `PCOLLECTION`
WHERE `PCOLLECTION`.`c1` > 1
Feb 19, 2023 8:12:16 AM org.apache.beam.sdk.extensions.sql.impl.CalciteQueryPlanner convertToBeamRel
INFO: SQLPlan>
LogicalProject(c1=[$0], c2=[$1], c3=[$2])
LogicalFilter(condition=[>($0, 1)])
BeamIOSourceRel(table=[[beam, PCOLLECTION]])
Feb 19, 2023 8:12:16 AM org.apache.beam.sdk.extensions.sql.impl.CalciteQueryPlanner convertToBeamRel
INFO: BEAMPlan>
BeamCalcRel(expr#0..2=[{inputs}], expr#3=[1], expr#4=[>($t0, $t3)], proj#0..2=[{exprs}], $condition=[$t4])
BeamIOSourceRel(table=[[beam, PCOLLECTION]])
Feb 19, 2023 8:12:17 AM org.apache.beam.sdk.extensions.sql.impl.CalciteQueryPlanner convertToBeamRel
INFO: SQL:
SELECT `CASE1_RESULT`.`c2`, SUM(`CASE1_RESULT`.`c3`)
FROM `beam`.`CASE1_RESULT` AS `CASE1_RESULT`
GROUP BY `CASE1_RESULT`.`c2`
Feb 19, 2023 8:12:17 AM org.apache.beam.sdk.extensions.sql.impl.CalciteQueryPlanner convertToBeamRel
INFO: SQLPlan>
LogicalAggregate(group=[{0}], EXPR$1=[SUM($1)])
LogicalProject(c2=[$1], c3=[$2])
BeamIOSourceRel(table=[[beam, CASE1_RESULT]])
Feb 19, 2023 8:12:17 AM org.apache.beam.sdk.extensions.sql.impl.CalciteQueryPlanner convertToBeamRel
INFO: BEAMPlan>
BeamAggregationRel(group=[{1}], EXPR$1=[SUM($2)])
BeamIOSourceRel(table=[[beam, CASE1_RESULT]])
Feb 19, 2023 8:12:18 AM org.apache.beam.sdk.Pipeline validate
WARNING: The following transforms do not have stable unique names: log_result, SqlTransform
PCOLLECTION: [2, row, 2.0]
PCOLLECTION: [3, row, 3.0]
CASE1_RESULT: [row, 5.0]
> Task :sdks:java:extensions:sql:runPojoExample
SLF4J: Class path contains multiple SLF4J bindings.
SLF4J: Found binding in [jar:file:/home/jenkins/.gradle/caches/modules-2/files-2.1/org.slf4j/slf4j-jdk14/1.7.30/d35953dd2fe54ebe39fdf18cfd82fe6eb35b25ed/slf4j-jdk14-1.7.30.jar!/org/slf4j/impl/StaticLoggerBinder.class]
SLF4J: Found binding in [jar:file:/home/jenkins/.gradle/caches/modules-2/files-2.1/org.slf4j/slf4j-reload4j/1.7.36/db708f7d959dee1857ac524636e85ecf2e1781c1/slf4j-reload4j-1.7.36.jar!/org/slf4j/impl/StaticLoggerBinder.class]
SLF4J: Found binding in [jar:file:/home/jenkins/.gradle/caches/modules-2/files-2.1/org.slf4j/slf4j-log4j12/1.7.30/c21f55139d8141d2231214fb1feaf50a1edca95e/slf4j-log4j12-1.7.30.jar!/org/slf4j/impl/StaticLoggerBinder.class]
SLF4J: See http://www.slf4j.org/codes.html#multiple_bindings for an explanation.
SLF4J: Actual binding is of type [org.slf4j.impl.JDK14LoggerFactory]
Feb 19, 2023 8:12:26 AM org.apache.beam.sdk.extensions.sql.impl.CalciteQueryPlanner convertToBeamRel
INFO: SQL:
SELECT `PCOLLECTION`.`id`, `PCOLLECTION`.`name`
FROM `beam`.`PCOLLECTION` AS `PCOLLECTION`
WHERE `PCOLLECTION`.`countryOfResidence` = 'Wonderland'
Feb 19, 2023 8:12:26 AM org.apache.beam.sdk.extensions.sql.impl.CalciteQueryPlanner convertToBeamRel
INFO: SQLPlan>
LogicalProject(id=[$2], name=[$1])
LogicalFilter(condition=[=($0, 'Wonderland')])
BeamIOSourceRel(table=[[beam, PCOLLECTION]])
Feb 19, 2023 8:12:26 AM org.apache.beam.sdk.extensions.sql.impl.CalciteQueryPlanner convertToBeamRel
INFO: BEAMPlan>
BeamCalcRel(expr#0..2=[{inputs}], expr#3=['Wonderland':VARCHAR], expr#4=[=($t0, $t3)], id=[$t2], name=[$t1], $condition=[$t4])
BeamIOSourceRel(table=[[beam, PCOLLECTION]])
Feb 19, 2023 8:12:27 AM org.apache.beam.sdk.extensions.sql.impl.CalciteQueryPlanner convertToBeamRel
INFO: SQL:
SELECT COUNT(`PCOLLECTION`.`id`)
FROM `beam`.`PCOLLECTION` AS `PCOLLECTION`
Feb 19, 2023 8:12:27 AM org.apache.beam.sdk.extensions.sql.impl.CalciteQueryPlanner convertToBeamRel
INFO: SQLPlan>
LogicalAggregate(group=[{}], EXPR$0=[COUNT()])
BeamIOSourceRel(table=[[beam, PCOLLECTION]])
Feb 19, 2023 8:12:27 AM org.apache.beam.sdk.extensions.sql.impl.CalciteQueryPlanner convertToBeamRel
INFO: BEAMPlan>
BeamAggregationRel(group=[{}], EXPR$0=[COUNT()])
BeamIOSourceRel(table=[[beam, PCOLLECTION]])
Feb 19, 2023 8:12:27 AM org.apache.beam.sdk.extensions.sql.impl.CalciteQueryPlanner convertToBeamRel
INFO: SQL:
SELECT `customers`.`name`, 'order id:' || CAST(`orders`.`id` AS VARCHAR)
FROM `beam`.`orders` AS `orders`
INNER JOIN `beam`.`customers` AS `customers` ON `orders`.`customerId` = `customers`.`id`
WHERE `customers`.`name` = 'Grault'
Feb 19, 2023 8:12:27 AM org.apache.beam.sdk.extensions.sql.impl.CalciteQueryPlanner convertToBeamRel
INFO: SQLPlan>
LogicalProject(name=[$3], EXPR$1=[||('order id:', CAST($1):VARCHAR NOT NULL)])
LogicalFilter(condition=[=($3, 'Grault')])
LogicalJoin(condition=[=($0, $4)], joinType=[inner])
BeamIOSourceRel(table=[[beam, orders]])
BeamIOSourceRel(table=[[beam, customers]])
Feb 19, 2023 8:12:27 AM org.apache.beam.sdk.extensions.sql.impl.CalciteQueryPlanner convertToBeamRel
INFO: BEAMPlan>
BeamCalcRel(expr#0..4=[{inputs}], expr#5=['order id:'], expr#6=[CAST($t1):VARCHAR NOT NULL], expr#7=[||($t5, $t6)], name=[$t3], EXPR$1=[$t7])
BeamCoGBKJoinRel(condition=[=($0, $4)], joinType=[inner])
BeamIOSourceRel(table=[[beam, orders]])
BeamCalcRel(expr#0..2=[{inputs}], expr#3=['Grault':VARCHAR], expr#4=[=($t1, $t3)], proj#0..2=[{exprs}], $condition=[$t4])
BeamIOSourceRel(table=[[beam, customers]])
Feb 19, 2023 8:12:28 AM org.apache.beam.sdk.Pipeline validate
WARNING: The following transforms do not have stable unique names: Create.Values, MapElements, SqlTransform
[1, Foo]: is from Wonderland
[3, Baz]: is from Wonderland
[4, Grault]: is from Wonderland
> Task :sdks:java:extensions:sql:shell:distZip
> Task :sdks:java:extensions:sql:runPojoExample
[3]: total customers in Wonderland
[Grault, order id:8]: ordered by 'Grault'
[Grault, order id:7]: ordered by 'Grault'
> Task :sdks:java:extensions:sql:shell:assemble
> Task :sdks:java:extensions:sql:shell:analyzeClassesDependencies FROM-CACHE
> Task :sdks:java:extensions:sql:shell:analyzeDependencies UP-TO-DATE
> Task :sdks:java:extensions:sql:shell:test NO-SOURCE
> Task :sdks:java:extensions:sql:shell:check UP-TO-DATE
> Task :sdks:java:extensions:sql:shell:build
> Task :sdks:java:extensions:sql:shell:buildDependents
> Task :runners:flink:1.13:job-server:shadowJar FROM-CACHE
> Task :runners:flink:1.12:job-server:shadowJar FROM-CACHE
> Task :runners:flink:1.14:job-server:shadowJar FROM-CACHE
> Task :runners:flink:1.15:job-server:shadowJar FROM-CACHE
> Task :runners:flink:1.13:job-server:startShadowScripts
> Task :runners:flink:1.12:job-server:startShadowScripts
> Task :runners:flink:1.13:job-server:shadowDistTar
> Task :runners:flink:1.12:job-server:shadowDistTar
> Task :runners:flink:1.14:job-server:startShadowScripts
> Task :runners:flink:1.15:job-server:startShadowScripts
> Task :runners:flink:1.15:job-server:shadowDistTar
> Task :runners:flink:1.14:job-server:shadowDistTar
> Task :runners:flink:1.13:job-server:shadowDistZip
> Task :runners:flink:1.13:job-server:assemble
> Task :runners:flink:1.13:job-server:test NO-SOURCE
> Task :runners:flink:1.13:job-server:check UP-TO-DATE
> Task :runners:flink:1.13:job-server:build
> Task :runners:flink:1.13:job-server:buildDependents
> Task :runners:flink:1.12:job-server:shadowDistZip
> Task :runners:flink:1.12:job-server:assemble
> Task :runners:flink:1.12:job-server:test NO-SOURCE
> Task :runners:flink:1.12:job-server:check UP-TO-DATE
> Task :runners:flink:1.12:job-server:build
> Task :runners:flink:1.12:job-server:buildDependents
> Task :runners:flink:1.15:job-server:shadowDistZip
> Task :runners:flink:1.14:job-server:shadowDistZip
> Task :runners:flink:1.15:job-server:assemble
> Task :runners:flink:1.15:job-server:test NO-SOURCE
> Task :runners:flink:1.15:job-server:check UP-TO-DATE
> Task :runners:flink:1.15:job-server:build
> Task :runners:flink:1.15:job-server:buildDependents
> Task :runners:flink:1.14:job-server:assemble
> Task :runners:flink:1.14:job-server:test NO-SOURCE
> Task :runners:flink:1.14:job-server:check UP-TO-DATE
> Task :runners:flink:1.14:job-server:build
> Task :runners:flink:1.14:job-server:buildDependents
> Task :sdks:java:extensions:sql:expansion-service:buildDependents
FAILURE: Build completed with 4 failures.
1: Task failed with an exception.
-----------
* What went wrong:
Execution failed for task ':sdks:java:extensions:sql:jdbc:test'.
> There were failing tests. See the report at: file://<https://ci-beam.apache.org/job/beam_PreCommit_SQL_Java17_Cron/ws/src/sdks/java/extensions/sql/jdbc/build/reports/tests/test/index.html>
* Try:
> Run with --stacktrace option to get the stack trace.
> Run with --info or --debug option to get more log output.
==============================================================================
2: Task failed with an exception.
-----------
* What went wrong:
Execution failed for task ':sdks:java:testing:nexmark:test'.
> There were failing tests. See the report at: file://<https://ci-beam.apache.org/job/beam_PreCommit_SQL_Java17_Cron/ws/src/sdks/java/testing/nexmark/build/reports/tests/test/index.html>
* Try:
> Run with --stacktrace option to get the stack trace.
> Run with --info or --debug option to get more log output.
==============================================================================
3: Task failed with an exception.
-----------
* What went wrong:
Execution failed for task ':sdks:java:extensions:sql:zetasql:test'.
> There were failing tests. See the report at: file://<https://ci-beam.apache.org/job/beam_PreCommit_SQL_Java17_Cron/ws/src/sdks/java/extensions/sql/zetasql/build/reports/tests/test/index.html>
* Try:
> Run with --stacktrace option to get the stack trace.
> Run with --info or --debug option to get more log output.
==============================================================================
4: Task failed with an exception.
-----------
* What went wrong:
Execution failed for task ':sdks:java:extensions:sql:test'.
> There were failing tests. See the report at: file://<https://ci-beam.apache.org/job/beam_PreCommit_SQL_Java17_Cron/ws/src/sdks/java/extensions/sql/build/reports/tests/test/index.html>
* Try:
> Run with --stacktrace option to get the stack trace.
> Run with --info or --debug option to get more log output.
==============================================================================
* Get more help at https://help.gradle.org
Deprecated Gradle features were used in this build, making it incompatible with Gradle 8.0.
You can use '--warning-mode all' to show the individual deprecation warnings and determine if they come from your own scripts or plugins.
See https://docs.gradle.org/7.5.1/userguide/command_line_interface.html#sec:command_line_warnings
BUILD FAILED in 3m 9s
256 actionable tasks: 139 executed, 117 from cache
Publishing build scan...
https://gradle.com/s/icqpcncfwhofk
Build step 'Invoke Gradle script' changed build result to FAILURE
Build step 'Invoke Gradle script' marked build as failure
---------------------------------------------------------------------
To unsubscribe, e-mail: builds-unsubscribe@beam.apache.org
For additional commands, e-mail: builds-help@beam.apache.org
Build failed in Jenkins: beam_PreCommit_SQL_Java17_Cron #1510
Posted by Apache Jenkins Server <je...@builds.apache.org>.
See <https://ci-beam.apache.org/job/beam_PreCommit_SQL_Java17_Cron/1510/display/redirect>
Changes:
------------------------------------------
[...truncated 303.30 KB...]
java.lang.IllegalArgumentException at SqlQuery2Test.java:100
org.apache.beam.sdk.nexmark.queries.sql.SqlQuery2Test > org.apache.beam.sdk.nexmark.queries.sql.SqlQuery2Test$SqlQuery2TestCalcite.testSkipsEverySecondElement FAILED
java.lang.IllegalArgumentException at SqlQuery2Test.java:92
org.apache.beam.sdk.nexmark.queries.sql.SqlQuery2Test > org.apache.beam.sdk.nexmark.queries.sql.SqlQuery2Test$SqlQuery2TestCalcite.testSkipsEveryThirdElement FAILED
java.lang.IllegalArgumentException at SqlQuery2Test.java:92
org.apache.beam.sdk.nexmark.queries.sql.SqlQuery3Test > org.apache.beam.sdk.nexmark.queries.sql.SqlQuery3Test$SqlQuery3TestZetaSql.testJoinsPeopleWithAuctions FAILED
java.lang.IllegalArgumentException at SqlQuery3Test.java:110
org.apache.beam.sdk.nexmark.queries.sql.SqlQuery3Test > org.apache.beam.sdk.nexmark.queries.sql.SqlQuery3Test$SqlQuery3TestCalcite.testJoinsPeopleWithAuctions FAILED
java.lang.IllegalArgumentException at SqlQuery3Test.java:102
org.apache.beam.sdk.nexmark.queries.sql.SqlQuery7Test > testBids FAILED
java.lang.IllegalArgumentException at SqlQuery7Test.java:61
85 tests completed, 61 failed, 12 skipped
> Task :sdks:java:testing:nexmark:test FAILED
> Task :sdks:java:extensions:sql:runBasicExample
SLF4J: Class path contains multiple SLF4J bindings.
SLF4J: Found binding in [jar:file:/home/jenkins/.gradle/caches/modules-2/files-2.1/org.slf4j/slf4j-jdk14/1.7.30/d35953dd2fe54ebe39fdf18cfd82fe6eb35b25ed/slf4j-jdk14-1.7.30.jar!/org/slf4j/impl/StaticLoggerBinder.class]
SLF4J: Found binding in [jar:file:/home/jenkins/.gradle/caches/modules-2/files-2.1/org.slf4j/slf4j-reload4j/1.7.36/db708f7d959dee1857ac524636e85ecf2e1781c1/slf4j-reload4j-1.7.36.jar!/org/slf4j/impl/StaticLoggerBinder.class]
SLF4J: Found binding in [jar:file:/home/jenkins/.gradle/caches/modules-2/files-2.1/org.slf4j/slf4j-log4j12/1.7.30/c21f55139d8141d2231214fb1feaf50a1edca95e/slf4j-log4j12-1.7.30.jar!/org/slf4j/impl/StaticLoggerBinder.class]
SLF4J: See http://www.slf4j.org/codes.html#multiple_bindings for an explanation.
SLF4J: Actual binding is of type [org.slf4j.impl.JDK14LoggerFactory]
> Task :runners:flink:1.13:job-server:distZip
> Task :runners:flink:1.12:job-server:distZip
> Task :runners:flink:1.14:job-server:distZip
> Task :runners:flink:1.15:job-server:distZip
> Task :sdks:java:extensions:sql:runBasicExample
Feb 19, 2023 2:12:14 AM org.apache.beam.sdk.extensions.sql.impl.CalciteQueryPlanner convertToBeamRel
INFO: SQL:
SELECT `PCOLLECTION`.`c1`, `PCOLLECTION`.`c2`, `PCOLLECTION`.`c3`
FROM `beam`.`PCOLLECTION` AS `PCOLLECTION`
WHERE `PCOLLECTION`.`c1` > 1
Feb 19, 2023 2:12:14 AM org.apache.beam.sdk.extensions.sql.impl.CalciteQueryPlanner convertToBeamRel
INFO: SQLPlan>
LogicalProject(c1=[$0], c2=[$1], c3=[$2])
LogicalFilter(condition=[>($0, 1)])
BeamIOSourceRel(table=[[beam, PCOLLECTION]])
Feb 19, 2023 2:12:15 AM org.apache.beam.sdk.extensions.sql.impl.CalciteQueryPlanner convertToBeamRel
INFO: BEAMPlan>
BeamCalcRel(expr#0..2=[{inputs}], expr#3=[1], expr#4=[>($t0, $t3)], proj#0..2=[{exprs}], $condition=[$t4])
BeamIOSourceRel(table=[[beam, PCOLLECTION]])
Feb 19, 2023 2:12:15 AM org.apache.beam.sdk.extensions.sql.impl.CalciteQueryPlanner convertToBeamRel
INFO: SQL:
SELECT `CASE1_RESULT`.`c2`, SUM(`CASE1_RESULT`.`c3`)
FROM `beam`.`CASE1_RESULT` AS `CASE1_RESULT`
GROUP BY `CASE1_RESULT`.`c2`
Feb 19, 2023 2:12:15 AM org.apache.beam.sdk.extensions.sql.impl.CalciteQueryPlanner convertToBeamRel
INFO: SQLPlan>
LogicalAggregate(group=[{0}], EXPR$1=[SUM($1)])
LogicalProject(c2=[$1], c3=[$2])
BeamIOSourceRel(table=[[beam, CASE1_RESULT]])
Feb 19, 2023 2:12:15 AM org.apache.beam.sdk.extensions.sql.impl.CalciteQueryPlanner convertToBeamRel
INFO: BEAMPlan>
BeamAggregationRel(group=[{1}], EXPR$1=[SUM($2)])
BeamIOSourceRel(table=[[beam, CASE1_RESULT]])
Feb 19, 2023 2:12:15 AM org.apache.beam.sdk.Pipeline validate
WARNING: The following transforms do not have stable unique names: log_result, SqlTransform
PCOLLECTION: [2, row, 2.0]
PCOLLECTION: [3, row, 3.0]
CASE1_RESULT: [row, 5.0]
> Task :sdks:java:extensions:sql:runPojoExample
SLF4J: Class path contains multiple SLF4J bindings.
SLF4J: Found binding in [jar:file:/home/jenkins/.gradle/caches/modules-2/files-2.1/org.slf4j/slf4j-jdk14/1.7.30/d35953dd2fe54ebe39fdf18cfd82fe6eb35b25ed/slf4j-jdk14-1.7.30.jar!/org/slf4j/impl/StaticLoggerBinder.class]
SLF4J: Found binding in [jar:file:/home/jenkins/.gradle/caches/modules-2/files-2.1/org.slf4j/slf4j-reload4j/1.7.36/db708f7d959dee1857ac524636e85ecf2e1781c1/slf4j-reload4j-1.7.36.jar!/org/slf4j/impl/StaticLoggerBinder.class]
SLF4J: Found binding in [jar:file:/home/jenkins/.gradle/caches/modules-2/files-2.1/org.slf4j/slf4j-log4j12/1.7.30/c21f55139d8141d2231214fb1feaf50a1edca95e/slf4j-log4j12-1.7.30.jar!/org/slf4j/impl/StaticLoggerBinder.class]
SLF4J: See http://www.slf4j.org/codes.html#multiple_bindings for an explanation.
SLF4J: Actual binding is of type [org.slf4j.impl.JDK14LoggerFactory]
Feb 19, 2023 2:12:23 AM org.apache.beam.sdk.extensions.sql.impl.CalciteQueryPlanner convertToBeamRel
INFO: SQL:
SELECT `PCOLLECTION`.`id`, `PCOLLECTION`.`name`
FROM `beam`.`PCOLLECTION` AS `PCOLLECTION`
WHERE `PCOLLECTION`.`countryOfResidence` = 'Wonderland'
Feb 19, 2023 2:12:23 AM org.apache.beam.sdk.extensions.sql.impl.CalciteQueryPlanner convertToBeamRel
INFO: SQLPlan>
LogicalProject(id=[$2], name=[$1])
LogicalFilter(condition=[=($0, 'Wonderland')])
BeamIOSourceRel(table=[[beam, PCOLLECTION]])
Feb 19, 2023 2:12:23 AM org.apache.beam.sdk.extensions.sql.impl.CalciteQueryPlanner convertToBeamRel
INFO: BEAMPlan>
BeamCalcRel(expr#0..2=[{inputs}], expr#3=['Wonderland':VARCHAR], expr#4=[=($t0, $t3)], id=[$t2], name=[$t1], $condition=[$t4])
BeamIOSourceRel(table=[[beam, PCOLLECTION]])
Feb 19, 2023 2:12:24 AM org.apache.beam.sdk.extensions.sql.impl.CalciteQueryPlanner convertToBeamRel
INFO: SQL:
SELECT COUNT(`PCOLLECTION`.`id`)
FROM `beam`.`PCOLLECTION` AS `PCOLLECTION`
Feb 19, 2023 2:12:24 AM org.apache.beam.sdk.extensions.sql.impl.CalciteQueryPlanner convertToBeamRel
INFO: SQLPlan>
LogicalAggregate(group=[{}], EXPR$0=[COUNT()])
BeamIOSourceRel(table=[[beam, PCOLLECTION]])
Feb 19, 2023 2:12:24 AM org.apache.beam.sdk.extensions.sql.impl.CalciteQueryPlanner convertToBeamRel
INFO: BEAMPlan>
BeamAggregationRel(group=[{}], EXPR$0=[COUNT()])
BeamIOSourceRel(table=[[beam, PCOLLECTION]])
Feb 19, 2023 2:12:24 AM org.apache.beam.sdk.extensions.sql.impl.CalciteQueryPlanner convertToBeamRel
INFO: SQL:
SELECT `customers`.`name`, 'order id:' || CAST(`orders`.`id` AS VARCHAR)
FROM `beam`.`orders` AS `orders`
INNER JOIN `beam`.`customers` AS `customers` ON `orders`.`customerId` = `customers`.`id`
WHERE `customers`.`name` = 'Grault'
Feb 19, 2023 2:12:24 AM org.apache.beam.sdk.extensions.sql.impl.CalciteQueryPlanner convertToBeamRel
INFO: SQLPlan>
LogicalProject(name=[$3], EXPR$1=[||('order id:', CAST($1):VARCHAR NOT NULL)])
LogicalFilter(condition=[=($3, 'Grault')])
LogicalJoin(condition=[=($0, $4)], joinType=[inner])
BeamIOSourceRel(table=[[beam, orders]])
BeamIOSourceRel(table=[[beam, customers]])
Feb 19, 2023 2:12:24 AM org.apache.beam.sdk.extensions.sql.impl.CalciteQueryPlanner convertToBeamRel
INFO: BEAMPlan>
BeamCalcRel(expr#0..4=[{inputs}], expr#5=['order id:'], expr#6=[CAST($t1):VARCHAR NOT NULL], expr#7=[||($t5, $t6)], name=[$t3], EXPR$1=[$t7])
BeamCoGBKJoinRel(condition=[=($0, $4)], joinType=[inner])
BeamIOSourceRel(table=[[beam, orders]])
BeamCalcRel(expr#0..2=[{inputs}], expr#3=['Grault':VARCHAR], expr#4=[=($t1, $t3)], proj#0..2=[{exprs}], $condition=[$t4])
BeamIOSourceRel(table=[[beam, customers]])
Feb 19, 2023 2:12:25 AM org.apache.beam.sdk.Pipeline validate
WARNING: The following transforms do not have stable unique names: Create.Values, MapElements, SqlTransform
[1, Foo]: is from Wonderland
[3, Baz]: is from Wonderland
[4, Grault]: is from Wonderland
[3]: total customers in Wonderland
[Grault, order id:7]: ordered by 'Grault'
[Grault, order id:8]: ordered by 'Grault'
> Task :sdks:java:extensions:sql:shell:distZip
> Task :sdks:java:extensions:sql:shell:assemble
> Task :sdks:java:extensions:sql:shell:analyzeClassesDependencies FROM-CACHE
> Task :sdks:java:extensions:sql:shell:analyzeDependencies UP-TO-DATE
> Task :sdks:java:extensions:sql:shell:test NO-SOURCE
> Task :sdks:java:extensions:sql:shell:check UP-TO-DATE
> Task :sdks:java:extensions:sql:shell:build
> Task :sdks:java:extensions:sql:shell:buildDependents
> Task :runners:flink:1.13:job-server:shadowJar FROM-CACHE
> Task :runners:flink:1.12:job-server:shadowJar FROM-CACHE
> Task :runners:flink:1.14:job-server:shadowJar FROM-CACHE
> Task :runners:flink:1.15:job-server:shadowJar FROM-CACHE
> Task :runners:flink:1.13:job-server:startShadowScripts
> Task :runners:flink:1.12:job-server:startShadowScripts
> Task :runners:flink:1.13:job-server:shadowDistTar
> Task :runners:flink:1.12:job-server:shadowDistTar
> Task :runners:flink:1.15:job-server:startShadowScripts
> Task :runners:flink:1.14:job-server:startShadowScripts
> Task :runners:flink:1.15:job-server:shadowDistTar
> Task :runners:flink:1.14:job-server:shadowDistTar
> Task :runners:flink:1.13:job-server:shadowDistZip
> Task :runners:flink:1.13:job-server:assemble
> Task :runners:flink:1.13:job-server:test NO-SOURCE
> Task :runners:flink:1.13:job-server:check UP-TO-DATE
> Task :runners:flink:1.13:job-server:build
> Task :runners:flink:1.13:job-server:buildDependents
> Task :runners:flink:1.12:job-server:shadowDistZip
> Task :runners:flink:1.12:job-server:assemble
> Task :runners:flink:1.12:job-server:test NO-SOURCE
> Task :runners:flink:1.12:job-server:check UP-TO-DATE
> Task :runners:flink:1.12:job-server:build
> Task :runners:flink:1.12:job-server:buildDependents
> Task :runners:flink:1.15:job-server:shadowDistZip
> Task :runners:flink:1.15:job-server:assemble
> Task :runners:flink:1.15:job-server:test NO-SOURCE
> Task :runners:flink:1.15:job-server:check UP-TO-DATE
> Task :runners:flink:1.15:job-server:build
> Task :runners:flink:1.15:job-server:buildDependents
> Task :runners:flink:1.14:job-server:shadowDistZip
> Task :runners:flink:1.14:job-server:assemble
> Task :runners:flink:1.14:job-server:test NO-SOURCE
> Task :runners:flink:1.14:job-server:check UP-TO-DATE
> Task :runners:flink:1.14:job-server:build
> Task :runners:flink:1.14:job-server:buildDependents
> Task :sdks:java:extensions:sql:expansion-service:buildDependents
FAILURE: Build completed with 4 failures.
1: Task failed with an exception.
-----------
* What went wrong:
Execution failed for task ':sdks:java:extensions:sql:jdbc:test'.
> There were failing tests. See the report at: file://<https://ci-beam.apache.org/job/beam_PreCommit_SQL_Java17_Cron/ws/src/sdks/java/extensions/sql/jdbc/build/reports/tests/test/index.html>
* Try:
> Run with --stacktrace option to get the stack trace.
> Run with --info or --debug option to get more log output.
==============================================================================
2: Task failed with an exception.
-----------
* What went wrong:
Execution failed for task ':sdks:java:extensions:sql:zetasql:test'.
> There were failing tests. See the report at: file://<https://ci-beam.apache.org/job/beam_PreCommit_SQL_Java17_Cron/ws/src/sdks/java/extensions/sql/zetasql/build/reports/tests/test/index.html>
* Try:
> Run with --stacktrace option to get the stack trace.
> Run with --info or --debug option to get more log output.
==============================================================================
3: Task failed with an exception.
-----------
* What went wrong:
Execution failed for task ':sdks:java:extensions:sql:test'.
> There were failing tests. See the report at: file://<https://ci-beam.apache.org/job/beam_PreCommit_SQL_Java17_Cron/ws/src/sdks/java/extensions/sql/build/reports/tests/test/index.html>
* Try:
> Run with --stacktrace option to get the stack trace.
> Run with --info or --debug option to get more log output.
==============================================================================
4: Task failed with an exception.
-----------
* What went wrong:
Execution failed for task ':sdks:java:testing:nexmark:test'.
> There were failing tests. See the report at: file://<https://ci-beam.apache.org/job/beam_PreCommit_SQL_Java17_Cron/ws/src/sdks/java/testing/nexmark/build/reports/tests/test/index.html>
* Try:
> Run with --stacktrace option to get the stack trace.
> Run with --info or --debug option to get more log output.
==============================================================================
* Get more help at https://help.gradle.org
Deprecated Gradle features were used in this build, making it incompatible with Gradle 8.0.
You can use '--warning-mode all' to show the individual deprecation warnings and determine if they come from your own scripts or plugins.
See https://docs.gradle.org/7.5.1/userguide/command_line_interface.html#sec:command_line_warnings
BUILD FAILED in 3m 7s
256 actionable tasks: 139 executed, 117 from cache
Publishing build scan...
https://gradle.com/s/mark2u55oc3r4
Build step 'Invoke Gradle script' changed build result to FAILURE
Build step 'Invoke Gradle script' marked build as failure
---------------------------------------------------------------------
To unsubscribe, e-mail: builds-unsubscribe@beam.apache.org
For additional commands, e-mail: builds-help@beam.apache.org