You are viewing a plain text version of this content. The canonical link for it is here.
Posted to builds@mesos.apache.org by Apache Jenkins Server <je...@builds.apache.org> on 2017/06/15 18:20:09 UTC

Build failed in Jenkins: Mesos-Buildbot » cmake,gcc,--verbose,GLOG_v=1 MESOS_VERBOSE=1,centos:7,(ubuntu)&&(!ubuntu-us1)&&(!ubuntu-eu2) #3801

See <https://builds.apache.org/job/Mesos-Buildbot/BUILDTOOL=cmake,COMPILER=gcc,CONFIGURATION=--verbose,ENVIRONMENT=GLOG_v=1%20MESOS_VERBOSE=1,OS=centos%3A7,label_exp=(ubuntu)&&(!ubuntu-us1)&&(!ubuntu-eu2)/3801/display/redirect?page=changes>

Changes:

[benjamin.hindman] Added a Variant wrapper for boost::variant.

[mpark] Removed a non-existing header from `Makefile.am`.

[vinodkone] Fixed a typo in 'ReservationTest.PreventUnreservingAlienResources'.

------------------------------------------
[...truncated 26.13 MB...]
[       OK ] Endpoint/SlaveEndpointTest.AuthorizedRequest/1 (24 ms)
[ RUN      ] Endpoint/SlaveEndpointTest.AuthorizedRequest/2
I0615 18:20:02.705628 31475 containerizer.cpp:230] Using isolation: posix/cpu,posix/mem,filesystem/posix,network/cni,environment_secret
W0615 18:20:02.706048 31475 backend.cpp:76] Failed to create 'aufs' backend: AufsBackend requires root privileges
W0615 18:20:02.706127 31475 backend.cpp:76] Failed to create 'bind' backend: BindBackend requires root privileges
I0615 18:20:02.706151 31475 provisioner.cpp:255] Using default backend 'copy'
I0615 18:20:02.709390 31497 slave.cpp:248] Mesos agent started on (757)@172.17.0.3:42332
I0615 18:20:02.709405 31497 slave.cpp:249] Flags at startup: --acls="" --appc_simple_discovery_uri_prefix="http://" --appc_store_dir="/tmp/Endpoint_SlaveEndpointTest_AuthorizedRequest_2_QwRAMd/store/appc" --authenticate_http_readonly="true" --authenticate_http_readwrite="true" --authenticatee="crammd5" --authentication_backoff_factor="1secs" --authorizer="local" --cgroups_cpu_enable_pids_and_tids_count="false" --cgroups_enable_cfs="false" --cgroups_hierarchy="/sys/fs/cgroup" --cgroups_limit_swap="false" --cgroups_root="mesos" --container_disk_watch_interval="15secs" --containerizers="mesos" --credential="/tmp/Endpoint_SlaveEndpointTest_AuthorizedRequest_2_QwRAMd/credential" --default_role="*" --disk_watch_interval="1mins" --docker="docker" --docker_kill_orphans="true" --docker_registry="https://registry-1.docker.io" --docker_remove_delay="6hrs" --docker_socket="/var/run/docker.sock" --docker_stop_timeout="0ns" --docker_store_dir="/tmp/Endpoint_SlaveEndpointTest_AuthorizedRequest_2_QwRAMd/store/docker" --docker_volume_checkpoint_dir="/var/run/mesos/isolators/docker/volume" --enforce_container_disk_quota="false" --executor_registration_timeout="1mins" --executor_reregistration_timeout="2secs" --executor_shutdown_grace_period="5secs" --fetcher_cache_dir="/tmp/Endpoint_SlaveEndpointTest_AuthorizedRequest_2_QwRAMd/fetch" --fetcher_cache_size="2GB" --frameworks_home="" --gc_delay="1weeks" --gc_disk_headroom="0.1" --hadoop_home="" --help="false" --hostname_lookup="true" --http_command_executor="false" --http_credentials="/tmp/Endpoint_SlaveEndpointTest_AuthorizedRequest_2_QwRAMd/http_credentials" --http_heartbeat_interval="30secs" --initialize_driver_logging="true" --isolation="posix/cpu,posix/mem" --launcher="posix" --launcher_dir="/mesos/build/src" --logbufsecs="0" --logging_level="INFO" --max_completed_executors_per_framework="150" --oversubscribed_resources_interval="15secs" --perf_duration="10secs" --perf_interval="1mins" --port="5051" --qos_correction_interval_min="0ns" --quiet="false" --recover="reconnect" --recovery_timeout="15mins" --registration_backoff_factor="10ms" --resources="cpus:2;gpus:0;mem:1024;disk:1024;ports:[31000-32000]" --revocable_cpu_low_priority="true" --runtime_dir="/tmp/Endpoint_SlaveEndpointTest_AuthorizedRequest_2_QwRAMd" --sandbox_directory="/mnt/mesos/sandbox" --strict="true" --switch_user="true" --systemd_enable_support="true" --systemd_runtime_directory="/run/systemd/system" --version="false" --work_dir="/tmp/Endpoint_SlaveEndpointTest_AuthorizedRequest_2_QYxHzh"
I0615 18:20:02.709722 31497 credentials.hpp:86] Loading credential for authentication from '/tmp/Endpoint_SlaveEndpointTest_AuthorizedRequest_2_QwRAMd/credential'
I0615 18:20:02.709836 31497 slave.cpp:281] Agent using credential for: test-principal
I0615 18:20:02.709849 31497 credentials.hpp:37] Loading credentials for authentication from '/tmp/Endpoint_SlaveEndpointTest_AuthorizedRequest_2_QwRAMd/http_credentials'
I0615 18:20:02.710017 31497 http.cpp:975] Creating default 'basic' HTTP authenticator for realm 'mesos-agent-readonly'
I0615 18:20:02.710135 31497 http.cpp:975] Creating default 'basic' HTTP authenticator for realm 'mesos-agent-readwrite'
I0615 18:20:02.711413 31497 slave.cpp:552] Agent resources: cpus(*):2; mem(*):1024; disk(*):1024; ports(*):[31000-32000]
I0615 18:20:02.711473 31497 slave.cpp:560] Agent attributes: [  ]
I0615 18:20:02.711483 31497 slave.cpp:565] Agent hostname: 789315bf1c1c
I0615 18:20:02.711591 31482 status_update_manager.cpp:177] Pausing sending status updates
I0615 18:20:02.712699 31491 state.cpp:62] Recovering state from '/tmp/Endpoint_SlaveEndpointTest_AuthorizedRequest_2_QYxHzh/meta'
I0615 18:20:02.712913 31494 status_update_manager.cpp:203] Recovering status update manager
I0615 18:20:02.713240 31487 containerizer.cpp:582] Recovering containerizer
I0615 18:20:02.714424 31493 provisioner.cpp:416] Provisioner recovery complete
I0615 18:20:02.714754 31499 slave.cpp:6127] Finished recovery
I0615 18:20:02.715144 31499 slave.cpp:6309] Querying resource estimator for oversubscribable resources
I0615 18:20:02.715354 31483 slave.cpp:6323] Received oversubscribable resources {} from the resource estimator
I0615 18:20:02.717061 31490 process.cpp:3778] Handling HTTP event for process 'slave(757)' with path: '/slave(757)/containers'
I0615 18:20:02.718092 31490 http.cpp:1115] HTTP GET for /slave(757)/containers from 172.17.0.3:40882
I0615 18:20:02.718142 31490 http.cpp:936] Authorizing principal 'test-principal' to GET the '/containers' endpoint
I0615 18:20:02.721279 31480 slave.cpp:817] Agent terminating
[       OK ] Endpoint/SlaveEndpointTest.AuthorizedRequest/2 (25 ms)
[ RUN      ] Endpoint/SlaveEndpointTest.UnauthorizedRequest/0
I0615 18:20:02.730670 31475 containerizer.cpp:230] Using isolation: posix/cpu,posix/mem,filesystem/posix,network/cni,environment_secret
W0615 18:20:02.731084 31475 backend.cpp:76] Failed to create 'aufs' backend: AufsBackend requires root privileges
W0615 18:20:02.731163 31475 backend.cpp:76] Failed to create 'bind' backend: BindBackend requires root privileges
I0615 18:20:02.731191 31475 provisioner.cpp:255] Using default backend 'copy'
I0615 18:20:02.734663 31486 slave.cpp:248] Mesos agent started on (758)@172.17.0.3:42332
I0615 18:20:02.734678 31486 slave.cpp:249] Flags at startup: --acls="" --appc_simple_discovery_uri_prefix="http://" --appc_store_dir="/tmp/Endpoint_SlaveEndpointTest_UnauthorizedRequest_0_B0HXOY/store/appc" --authenticate_http_readonly="true" --authenticate_http_readwrite="true" --authenticatee="crammd5" --authentication_backoff_factor="1secs" --authorizer="local" --cgroups_cpu_enable_pids_and_tids_count="false" --cgroups_enable_cfs="false" --cgroups_hierarchy="/sys/fs/cgroup" --cgroups_limit_swap="false" --cgroups_root="mesos" --container_disk_watch_interval="15secs" --containerizers="mesos" --credential="/tmp/Endpoint_SlaveEndpointTest_UnauthorizedRequest_0_B0HXOY/credential" --default_role="*" --disk_watch_interval="1mins" --docker="docker" --docker_kill_orphans="true" --docker_registry="https://registry-1.docker.io" --docker_remove_delay="6hrs" --docker_socket="/var/run/docker.sock" --docker_stop_timeout="0ns" --docker_store_dir="/tmp/Endpoint_SlaveEndpointTest_UnauthorizedRequest_0_B0HXOY/store/docker" --docker_volume_checkpoint_dir="/var/run/mesos/isolators/docker/volume" --enforce_container_disk_quota="false" --executor_registration_timeout="1mins" --executor_reregistration_timeout="2secs" --executor_shutdown_grace_period="5secs" --fetcher_cache_dir="/tmp/Endpoint_SlaveEndpointTest_UnauthorizedRequest_0_B0HXOY/fetch" --fetcher_cache_size="2GB" --frameworks_home="" --gc_delay="1weeks" --gc_disk_headroom="0.1" --hadoop_home="" --help="false" --hostname_lookup="true" --http_command_executor="false" --http_credentials="/tmp/Endpoint_SlaveEndpointTest_UnauthorizedRequest_0_B0HXOY/http_credentials" --http_heartbeat_interval="30secs" --initialize_driver_logging="true" --isolation="posix/cpu,posix/mem" --launcher="posix" --launcher_dir="/mesos/build/src" --logbufsecs="0" --logging_level="INFO" --max_completed_executors_per_framework="150" --oversubscribed_resources_interval="15secs" --perf_duration="10secs" --perf_interval="1mins" --port="5051" --qos_correction_interval_min="0ns" --quiet="false" --recover="reconnect" --recovery_timeout="15mins" --registration_backoff_factor="10ms" --resources="cpus:2;gpus:0;mem:1024;disk:1024;ports:[31000-32000]" --revocable_cpu_low_priority="true" --runtime_dir="/tmp/Endpoint_SlaveEndpointTest_UnauthorizedRequest_0_B0HXOY" --sandbox_directory="/mnt/mesos/sandbox" --strict="true" --switch_user="true" --systemd_enable_support="true" --systemd_runtime_directory="/run/systemd/system" --version="false" --work_dir="/tmp/Endpoint_SlaveEndpointTest_UnauthorizedRequest_0_64bjy2"
I0615 18:20:02.735069 31486 credentials.hpp:86] Loading credential for authentication from '/tmp/Endpoint_SlaveEndpointTest_UnauthorizedRequest_0_B0HXOY/credential'
I0615 18:20:02.735189 31486 slave.cpp:281] Agent using credential for: test-principal
I0615 18:20:02.735203 31486 credentials.hpp:37] Loading credentials for authentication from '/tmp/Endpoint_SlaveEndpointTest_UnauthorizedRequest_0_B0HXOY/http_credentials'
I0615 18:20:02.735380 31486 http.cpp:975] Creating default 'basic' HTTP authenticator for realm 'mesos-agent-readonly'
I0615 18:20:02.735496 31486 http.cpp:975] Creating default 'basic' HTTP authenticator for realm 'mesos-agent-readwrite'
I0615 18:20:02.736578 31486 slave.cpp:552] Agent resources: cpus(*):2; mem(*):1024; disk(*):1024; ports(*):[31000-32000]
I0615 18:20:02.736635 31486 slave.cpp:560] Agent attributes: [  ]
I0615 18:20:02.736644 31486 slave.cpp:565] Agent hostname: 789315bf1c1c
I0615 18:20:02.736784 31492 status_update_manager.cpp:177] Pausing sending status updates
I0615 18:20:02.738025 31479 state.cpp:62] Recovering state from '/tmp/Endpoint_SlaveEndpointTest_UnauthorizedRequest_0_64bjy2/meta'
I0615 18:20:02.738327 31498 status_update_manager.cpp:203] Recovering status update manager
I0615 18:20:02.738492 31491 containerizer.cpp:582] Recovering containerizer
I0615 18:20:02.739805 31482 provisioner.cpp:416] Provisioner recovery complete
I0615 18:20:02.740079 31493 slave.cpp:6127] Finished recovery
I0615 18:20:02.740394 31493 slave.cpp:6309] Querying resource estimator for oversubscribable resources
I0615 18:20:02.740556 31496 slave.cpp:6323] Received oversubscribable resources {} from the resource estimator
I0615 18:20:02.742193 31486 process.cpp:3778] Handling HTTP event for process 'slave(758)' with path: '/slave(758)/monitor/statistics'
I0615 18:20:02.743242 31482 http.cpp:1115] HTTP GET for /slave(758)/monitor/statistics from 172.17.0.3:40884
I0615 18:20:02.743296 31482 http.cpp:936] Authorizing principal 'test-principal' to GET the '/monitor/statistics' endpoint
I0615 18:20:02.744943 31489 slave.cpp:817] Agent terminating
[       OK ] Endpoint/SlaveEndpointTest.UnauthorizedRequest/0 (23 ms)
[ RUN      ] Endpoint/SlaveEndpointTest.UnauthorizedRequest/1
I0615 18:20:02.754341 31475 containerizer.cpp:230] Using isolation: posix/cpu,posix/mem,filesystem/posix,network/cni,environment_secret
W0615 18:20:02.754770 31475 backend.cpp:76] Failed to create 'aufs' backend: AufsBackend requires root privileges
W0615 18:20:02.754850 31475 backend.cpp:76] Failed to create 'bind' backend: BindBackend requires root privileges
I0615 18:20:02.754878 31475 provisioner.cpp:255] Using default backend 'copy'
I0615 18:20:02.758213 31492 slave.cpp:248] Mesos agent started on (759)@172.17.0.3:42332
I0615 18:20:02.758226 31492 slave.cpp:249] Flags at startup: --acls="" --appc_simple_discovery_uri_prefix="http://" --appc_store_dir="/tmp/Endpoint_SlaveEndpointTest_UnauthorizedRequest_1_6GAD5J/store/appc" --authenticate_http_readonly="true" --authenticate_http_readwrite="true" --authenticatee="crammd5" --authentication_backoff_factor="1secs" --authorizer="local" --cgroups_cpu_enable_pids_and_tids_count="false" --cgroups_enable_cfs="false" --cgroups_hierarchy="/sys/fs/cgroup" --cgroups_limit_swap="false" --cgroups_root="mesos" --container_disk_watch_interval="15secs" --containerizers="mesos" --credential="/tmp/Endpoint_SlaveEndpointTest_UnauthorizedRequest_1_6GAD5J/credential" --default_role="*" --disk_watch_interval="1mins" --docker="docker" --docker_kill_orphans="true" --docker_registry="https://registry-1.docker.io" --docker_remove_delay="6hrs" --docker_socket="/var/run/docker.sock" --docker_stop_timeout="0ns" --docker_store_dir="/tmp/Endpoint_SlaveEndpointTest_UnauthorizedRequest_1_6GAD5J/store/docker" --docker_volume_checkpoint_dir="/var/run/mesos/isolators/docker/volume" --enforce_container_disk_quota="false" --executor_registration_timeout="1mins" --executor_reregistration_timeout="2secs" --executor_shutdown_grace_period="5secs" --fetcher_cache_dir="/tmp/Endpoint_SlaveEndpointTest_UnauthorizedRequest_1_6GAD5J/fetch" --fetcher_cache_size="2GB" --frameworks_home="" --gc_delay="1weeks" --gc_disk_headroom="0.1" --hadoop_home="" --help="false" --hostname_lookup="true" --http_command_executor="false" --http_credentials="/tmp/Endpoint_SlaveEndpointTest_UnauthorizedRequest_1_6GAD5J/http_credentials" --http_heartbeat_interval="30secs" --initialize_driver_logging="true" --isolation="posix/cpu,posix/mem" --launcher="posix" --launcher_dir="/mesos/build/src" --logbufsecs="0" --logging_level="INFO" --max_completed_executors_per_framework="150" --oversubscribed_resources_interval="15secs" --perf_duration="10secs" --perf_interval="1mins" --port="5051" --qos_correction_interval_min="0ns" --quiet="false" --recover="reconnect" --recovery_timeout="15mins" --registration_backoff_factor="10ms" --resources="cpus:2;gpus:0;mem:1024;disk:1024;ports:[31000-32000]" --revocable_cpu_low_priority="true" --runtime_dir="/tmp/Endpoint_SlaveEndpointTest_UnauthorizedRequest_1_6GAD5J" --sandbox_directory="/mnt/mesos/sandbox" --strict="true" --switch_user="true" --systemd_enable_support="true" --systemd_runtime_directory="/run/systemd/system" --version="false" --work_dir="/tmp/Endpoint_SlaveEndpointTest_UnauthorizedRequest_1_xGKsLN"
I0615 18:20:02.758554 31492 credentials.hpp:86] Loading credential for authentication from '/tmp/Endpoint_SlaveEndpointTest_UnauthorizedRequest_1_6GAD5J/credential'
I0615 18:20:02.758668 31492 slave.cpp:281] Agent using credential for: test-principal
I0615 18:20:02.758682 31492 credentials.hpp:37] Loading credentials for authentication from '/tmp/Endpoint_SlaveEndpointTest_UnauthorizedRequest_1_6GAD5J/http_credentials'
I0615 18:20:02.758848 31492 http.cpp:975] Creating default 'basic' HTTP authenticator for realm 'mesos-agent-readonly'
I0615 18:20:02.758955 31492 http.cpp:975] Creating default 'basic' HTTP authenticator for realm 'mesos-agent-readwrite'
I0615 18:20:02.759961 31492 slave.cpp:552] Agent resources: cpus(*):2; mem(*):1024; disk(*):1024; ports(*):[31000-32000]
I0615 18:20:02.760017 31492 slave.cpp:560] Agent attributes: [  ]
I0615 18:20:02.760026 31492 slave.cpp:565] Agent hostname: 789315bf1c1c
I0615 18:20:02.760154 31476 status_update_manager.cpp:177] Pausing sending status updates
I0615 18:20:02.761482 31477 state.cpp:62] Recovering state from '/tmp/Endpoint_SlaveEndpointTest_UnauthorizedRequest_1_xGKsLN/meta'
I0615 18:20:02.761761 31490 status_update_manager.cpp:203] Recovering status update manager
I0615 18:20:02.761931 31485 containerizer.cpp:582] Recovering containerizer
I0615 18:20:02.763447 31485 provisioner.cpp:416] Provisioner recovery complete
I0615 18:20:02.763973 31497 slave.cpp:6127] Finished recovery
I0615 18:20:02.764334 31497 slave.cpp:6309] Querying resource estimator for oversubscribable resources
I0615 18:20:02.764660 31492 slave.cpp:6323] Received oversubscribable resources {} from the resource estimator
I0615 18:20:02.766640 31492 process.cpp:3778] Handling HTTP event for process 'slave(759)' with path: '/slave(759)/monitor/statistics.json'
I0615 18:20:02.767640 31494 http.cpp:1115] HTTP GET for /slave(759)/monitor/statistics.json from 172.17.0.3:40888
I0615 18:20:02.767690 31494 http.cpp:936] Authorizing principal 'test-principal' to GET the '/monitor/statistics.json' endpoint
I0615 18:20:02.769829 31477 slave.cpp:817] Agent terminating
[       OK ] Endpoint/SlaveEndpointTest.UnauthorizedRequest/1 (24 ms)
[ RUN      ] Endpoint/SlaveEndpointTest.UnauthorizedRequest/2
I0615 18:20:02.778828 31475 containerizer.cpp:230] Using isolation: posix/cpu,posix/mem,filesystem/posix,network/cni,environment_secret
W0615 18:20:02.779250 31475 backend.cpp:76] Failed to create 'aufs' backend: AufsBackend requires root privileges
W0615 18:20:02.779330 31475 backend.cpp:76] Failed to create 'bind' backend: BindBackend requires root privileges
I0615 18:20:02.779357 31475 provisioner.cpp:255] Using default backend 'copy'
I0615 18:20:02.782027 31495 slave.cpp:248] Mesos agent started on (760)@172.17.0.3:42332
I0615 18:20:02.782040 31495 slave.cpp:249] Flags at startup: --acls="" --appc_simple_discovery_uri_prefix="http://" --appc_store_dir="/tmp/Endpoint_SlaveEndpointTest_UnauthorizedRequest_2_r5CQAv/store/appc" --authenticate_http_readonly="true" --authenticate_http_readwrite="true" --authenticatee="crammd5" --authentication_backoff_factor="1secs" --authorizer="local" --cgroups_cpu_enable_pids_and_tids_count="false" --cgroups_enable_cfs="false" --cgroups_hierarchy="/sys/fs/cgroup" --cgroups_limit_swap="false" --cgroups_root="mesos" --container_disk_watch_interval="15secs" --containerizers="mesos" --credential="/tmp/Endpoint_SlaveEndpointTest_UnauthorizedRequest_2_r5CQAv/credential" --default_role="*" --disk_watch_interval="1mins" --docker="docker" --docker_kill_orphans="true" --docker_registry="https://registry-1.docker.io" --docker_remove_delay="6hrs" --docker_socket="/var/run/docker.sock" --docker_stop_timeout="0ns" --docker_store_dir="/tmp/Endpoint_SlaveEndpointTest_UnauthorizedRequest_2_r5CQAv/store/docker" --docker_volume_checkpoint_dir="/var/run/mesos/isolators/docker/volume" --enforce_container_disk_quota="false" --executor_registration_timeout="1mins" --executor_reregistration_timeout="2secs" --executor_shutdown_grace_period="5secs" --fetcher_cache_dir="/tmp/Endpoint_SlaveEndpointTest_UnauthorizedRequest_2_r5CQAv/fetch" --fetcher_cache_size="2GB" --frameworks_home="" --gc_delay="1weeks" --gc_disk_headroom="0.1" --hadoop_home="" --help="false" --hostname_lookup="true" --http_command_executor="false" --http_credentials="/tmp/Endpoint_SlaveEndpointTest_UnauthorizedRequest_2_r5CQAv/http_credentials" --http_heartbeat_interval="30secs" --initialize_driver_logging="true" --isolation="posix/cpu,posix/mem" --launcher="posix" --launcher_dir="/mesos/build/src" --logbufsecs="0" --logging_level="INFO" --max_completed_executors_per_framework="150" --oversubscribed_resources_interval="15secs" --perf_duration="10secs" --perf_interval="1mins" --port="5051" --qos_correction_interval_min="0ns" --quiet="false" --recover="reconnect" --recovery_timeout="15mins" --registration_backoff_factor="10ms" --resources="cpus:2;gpus:0;mem:1024;disk:1024;ports:[31000-32000]" --revocable_cpu_low_priority="true" --runtime_dir="/tmp/Endpoint_SlaveEndpointTest_UnauthorizedRequest_2_r5CQAv" --sandbox_directory="/mnt/mesos/sandbox" --strict="true" --switch_user="true" --systemd_enable_support="true" --systemd_runtime_directory="/run/systemd/system" --version="false" --work_dir="/tmp/Endpoint_SlaveEndpointTest_UnauthorizedRequest_2_1Tp1cz"
I0615 18:20:02.782353 31495 credentials.hpp:86] Loading credential for authentication from '/tmp/Endpoint_SlaveEndpointTest_UnauthorizedRequest_2_r5CQAv/credential'
I0615 18:20:02.782476 31495 slave.cpp:281] Agent using credential for: test-principal
I0615 18:20:02.782495 31495 credentials.hpp:37] Loading credentials for authentication from '/tmp/Endpoint_SlaveEndpointTest_UnauthorizedRequest_2_r5CQAv/http_credentials'
I0615 18:20:02.782690 31495 http.cpp:975] Creating default 'basic' HTTP authenticator for realm 'mesos-agent-readonly'
I0615 18:20:02.782929 31495 http.cpp:975] Creating default 'basic' HTTP authenticator for realm 'mesos-agent-readwrite'
I0615 18:20:02.784191 31495 slave.cpp:552] Agent resources: cpus(*):2; mem(*):1024; disk(*):1024; ports(*):[31000-32000]
I0615 18:20:02.784250 31495 slave.cpp:560] Agent attributes: [  ]
I0615 18:20:02.784260 31495 slave.cpp:565] Agent hostname: 789315bf1c1c
I0615 18:20:02.784381 31478 status_update_manager.cpp:177] Pausing sending status updates
I0615 18:20:02.785470 31494 state.cpp:62] Recovering state from '/tmp/Endpoint_SlaveEndpointTest_UnauthorizedRequest_2_1Tp1cz/meta'
I0615 18:20:02.785910 31490 status_update_manager.cpp:203] Recovering status update manager
I0615 18:20:02.786118 31491 containerizer.cpp:582] Recovering containerizer
I0615 18:20:02.787293 31483 provisioner.cpp:416] Provisioner recovery complete
I0615 18:20:02.787588 31498 slave.cpp:6127] Finished recovery
I0615 18:20:02.787958 31498 slave.cpp:6309] Querying resource estimator for oversubscribable resources
I0615 18:20:02.788173 31488 slave.cpp:6323] Received oversubscribable resources {} from the resource estimator
I0615 18:20:02.789882 31496 process.cpp:3778] Handling HTTP event for process 'slave(760)' with path: '/slave(760)/containers'
I0615 18:20:02.790745 31476 http.cpp:1115] HTTP GET for /slave(760)/containers from 172.17.0.3:40890
I0615 18:20:02.790794 31476 http.cpp:936] Authorizing principal 'test-principal' to GET the '/containers' endpoint
I0615 18:20:02.792881 31478 slave.cpp:817] Agent terminating
[       OK ] Endpoint/SlaveEndpointTest.UnauthorizedRequest/2 (23 ms)
[ RUN      ] Endpoint/SlaveEndpointTest.NoAuthorizer/0
I0615 18:20:02.802029 31475 containerizer.cpp:230] Using isolation: posix/cpu,posix/mem,filesystem/posix,network/cni,environment_secret
W0615 18:20:02.802476 31475 backend.cpp:76] Failed to create 'aufs' backend: AufsBackend requires root privileges
W0615 18:20:02.802577 31475 backend.cpp:76] Failed to create 'bind' backend: BindBackend requires root privileges
I0615 18:20:02.802609 31475 provisioner.cpp:255] Using default backend 'copy'
I0615 18:20:02.804761 31475 cluster.cpp:448] Creating default 'local' authorizer
I0615 18:20:02.806309 31490 slave.cpp:248] Mesos agent started on (761)@172.17.0.3:42332
I0615 18:20:02.806324 31490 slave.cpp:249] Flags at startup: --acls="" --appc_simple_discovery_uri_prefix="http://" --appc_store_dir="/tmp/Endpoint_SlaveEndpointTest_NoAuthorizer_0_9FyQjh/store/appc" --authenticate_http_readonly="true" --authenticate_http_readwrite="true" --authenticatee="crammd5" --authentication_backoff_factor="1secs" --authorizer="local" --cgroups_cpu_enable_pids_and_tids_count="false" --cgroups_enable_cfs="false" --cgroups_hierarchy="/sys/fs/cgroup" --cgroups_limit_swap="false" --cgroups_root="mesos" --container_disk_watch_interval="15secs" --containerizers="mesos" --credential="/tmp/Endpoint_SlaveEndpointTest_NoAuthorizer_0_9FyQjh/credential" --default_role="*" --disk_watch_interval="1mins" --docker="docker" --docker_kill_orphans="true" --docker_registry="https://registry-1.docker.io" --docker_remove_delay="6hrs" --docker_socket="/var/run/docker.sock" --docker_stop_timeout="0ns" --docker_store_dir="/tmp/Endpoint_SlaveEndpointTest_NoAuthorizer_0_9FyQjh/store/docker" --docker_volume_checkpoint_dir="/var/run/mesos/isolators/docker/volume" --enforce_container_disk_quota="false" --executor_registration_timeout="1mins" --executor_reregistration_timeout="2secs" --executor_shutdown_grace_period="5secs" --fetcher_cache_dir="/tmp/Endpoint_SlaveEndpointTest_NoAuthorizer_0_9FyQjh/fetch" --fetcher_cache_size="2GB" --frameworks_home="" --gc_delay="1weeks" --gc_disk_headroom="0.1" --hadoop_home="" --help="false" --hostname_lookup="true" --http_command_executor="false" --http_credentials="/tmp/Endpoint_SlaveEndpointTest_NoAuthorizer_0_9FyQjh/http_credentials" --http_heartbeat_interval="30secs" --initialize_driver_logging="true" --isolation="posix/cpu,posix/mem" --launcher="posix" --launcher_dir="/mesos/build/src" --logbufsecs="0" --logging_level="INFO" --max_completed_executors_per_framework="150" --oversubscribed_resources_interval="15secs" --perf_duration="10secs" --perf_interval="1mins" --port="5051" --qos_correction_interval_min="0ns" --quiet="false" --recover="reconnect" --recovery_timeout="15mins" --registration_backoff_factor="10ms" --resources="cpus:2;gpus:0;mem:1024;disk:1024;ports:[31000-32000]" --revocable_cpu_low_priority="true" --runtime_dir="/tmp/Endpoint_SlaveEndpointTest_NoAuthorizer_0_9FyQjh" --sandbox_directory="/mnt/mesos/sandbox" --strict="true" --switch_user="true" --systemd_enable_support="true" --systemd_runtime_directory="/run/systemd/system" --version="false" --work_dir="/tmp/Endpoint_SlaveEndpointTest_NoAuthorizer_0_bb6ASk"
I0615 18:20:02.806689 31490 credentials.hpp:86] Loading credential for authentication from '/tmp/Endpoint_SlaveEndpointTest_NoAuthorizer_0_9FyQjh/credential'
I0615 18:20:02.806804 31490 slave.cpp:281] Agent using credential for: test-principal
I0615 18:20:02.806819 31490 credentials.hpp:37] Loading credentials for authentication from '/tmp/Endpoint_SlaveEndpointTest_NoAuthorizer_0_9FyQjh/http_credentials'
I0615 18:20:02.807003 31490 http.cpp:975] Creating default 'basic' HTTP authenticator for realm 'mesos-agent-readonly'
I0615 18:20:02.807114 31490 http.cpp:975] Creating default 'basic' HTTP authenticator for realm 'mesos-agent-readwrite'
I0615 18:20:02.808359 31490 slave.cpp:552] Agent resources: cpus(*):2; mem(*):1024; disk(*):1024; ports(*):[31000-32000]
I0615 18:20:02.808420 31490 slave.cpp:560] Agent attributes: [  ]
I0615 18:20:02.808428 31490 slave.cpp:565] Agent hostname: 789315bf1c1c
I0615 18:20:02.808553 31479 status_update_manager.cpp:177] Pausing sending status updates
I0615 18:20:02.809728 31494 state.cpp:62] Recovering state from '/tmp/Endpoint_SlaveEndpointTest_NoAuthorizer_0_bb6ASk/meta'
I0615 18:20:02.809978 31496 status_update_manager.cpp:203] Recovering status update manager
I0615 18:20:02.810134 31479 containerizer.cpp:582] Recovering containerizer
I0615 18:20:02.811501 31492 provisioner.cpp:416] Provisioner recovery complete
I0615 18:20:02.811864 31488 slave.cpp:6127] Finished recovery
I0615 18:20:02.812304 31488 slave.cpp:6309] Querying resource estimator for oversubscribable resources
I0615 18:20:02.812503 31481 slave.cpp:6323] Received oversubscribable resources {} from the resource estimator
I0615 18:20:02.814610 31492 process.cpp:3778] Handling HTTP event for process 'slave(761)' with path: '/slave(761)/monitor/statistics'
I0615 18:20:02.815771 31484 http.cpp:1115] HTTP GET for /slave(761)/monitor/statistics from 172.17.0.3:40892
I0615 18:20:02.815834 31484 http.cpp:936] Authorizing principal 'test-principal' to GET the '/monitor/statistics' endpoint
I0615 18:20:02.818799 31498 slave.cpp:817] Agent terminating
[       OK ] Endpoint/SlaveEndpointTest.NoAuthorizer/0 (26 ms)
[ RUN      ] Endpoint/SlaveEndpointTest.NoAuthorizer/1
I0615 18:20:02.828398 31475 containerizer.cpp:230] Using isolation: posix/cpu,posix/mem,filesystem/posix,network/cni,environment_secret
W0615 18:20:02.829192 31475 backend.cpp:76] Failed to create 'aufs' backend: AufsBackend requires root privileges
W0615 18:20:02.829330 31475 backend.cpp:76] Failed to create 'bind' backend: BindBackend requires root privileges
I0615 18:20:02.829360 31475 provisioner.cpp:255] Using default backend 'copy'
I0615 18:20:02.831389 31475 cluster.cpp:448] Creating default 'local' authorizer
I0615 18:20:02.832794 31493 slave.cpp:248] Mesos agent started on (762)@172.17.0.3:42332
I0615 18:20:02.832806 31493 slave.cpp:249] Flags at startup: --acls="" --appc_simple_discovery_uri_prefix="http://" --appc_store_dir="/tmp/Endpoint_SlaveEndpointTest_NoAuthorizer_1_tuY5h3/store/appc" --authenticate_http_readonly="true" --authenticate_http_readwrite="true" --authenticatee="crammd5" --authentication_backoff_factor="1secs" --authorizer="local" --cgroups_cpu_enable_pids_and_tids_count="false" --cgroups_enable_cfs="false" --cgroups_hierarchy="/sys/fs/cgroup" --cgroups_limit_swap="false" --cgroups_root="mesos" --container_disk_watch_interval="15secs" --containerizers="mesos" --credential="/tmp/Endpoint_SlaveEndpointTest_NoAuthorizer_1_tuY5h3/credential" --default_role="*" --disk_watch_interval="1mins" --docker="docker" --docker_kill_orphans="true" --docker_registry="https://registry-1.docker.io" --docker_remove_delay="6hrs" --docker_socket="/var/run/docker.sock" --docker_stop_timeout="0ns" --docker_store_dir="/tmp/Endpoint_SlaveEndpointTest_NoAuthorizer_1_tuY5h3/store/docker" --docker_volume_checkpoint_dir="/var/run/mesos/isolators/docker/volume" --enforce_container_disk_quota="false" --executor_registration_timeout="1mins" --executor_reregistration_timeout="2secs" --executor_shutdown_grace_period="5secs" --fetcher_cache_dir="/tmp/Endpoint_SlaveEndpointTest_NoAuthorizer_1_tuY5h3/fetch" --fetcher_cache_size="2GB" --frameworks_home="" --gc_delay="1weeks" --gc_disk_headroom="0.1" --hadoop_home="" --help="false" --hostname_lookup="true" --http_command_executor="false" --http_credentials="/tmp/Endpoint_SlaveEndpointTest_NoAuthorizer_1_tuY5h3/http_credentials" --http_heartbeat_interval="30secs" --initialize_driver_logging="true" --isolation="posix/cpu,posix/mem" --launcher="posix" --launcher_dir="/mesos/build/src" --logbufsecs="0" --logging_level="INFO" --max_completed_executors_per_framework="150" --oversubscribed_resources_interval="15secs" --perf_duration="10secs" --perf_interval="1mins" --port="5051" --qos_correction_interval_min="0ns" --quiet="false" --recover="reconnect" --recovery_timeout="15mins" --registration_backoff_factor="10ms" --resources="cpus:2;gpus:0;mem:1024;disk:1024;ports:[31000-32000]" --revocable_cpu_low_priority="true" --runtime_dir="/tmp/Endpoint_SlaveEndpointTest_NoAuthorizer_1_tuY5h3" --sandbox_directory="/mnt/mesos/sandbox" --strict="true" --switch_user="true" --systemd_enable_support="true" --systemd_runtime_directory="/run/systemd/system" --version="false" --work_dir="/tmp/Endpoint_SlaveEndpointTest_NoAuthorizer_1_Qy1XM6"
I0615 18:20:02.833151 31493 credentials.hpp:86] Loading credential for authentication from '/tmp/Endpoint_SlaveEndpointTest_NoAuthorizer_1_tuY5h3/credential'
I0615 18:20:02.833273 31493 slave.cpp:281] Agent using credential for: test-principal
I0615 18:20:02.833287 31493 credentials.hpp:37] Loading credentials for authentication from '/tmp/Endpoint_SlaveEndpointTest_NoAuthorizer_1_tuY5h3/http_credentials'
I0615 18:20:02.833454 31493 http.cpp:975] Creating default 'basic' HTTP authenticator for realm 'mesos-agent-readonly'
I0615 18:20:02.833591 31493 http.cpp:975] Creating default 'basic' HTTP authenticator for realm 'mesos-agent-readwrite'
I0615 18:20:02.834599 31493 slave.cpp:552] Agent resources: cpus(*):2; mem(*):1024; disk(*):1024; ports(*):[31000-32000]
I0615 18:20:02.834658 31493 slave.cpp:560] Agent attributes: [  ]
I0615 18:20:02.834667 31493 slave.cpp:565] Agent hostname: 789315bf1c1c
I0615 18:20:02.834774 31486 status_update_manager.cpp:177] Pausing sending status updates
I0615 18:20:02.836055 31486 state.cpp:62] Recovering state from '/tmp/Endpoint_SlaveEndpointTest_NoAuthorizer_1_Qy1XM6/meta'
I0615 18:20:02.836441 31480 status_update_manager.cpp:203] Recovering status update manager
I0615 18:20:02.836688 31489 containerizer.cpp:582] Recovering containerizer
I0615 18:20:02.841939 31480 provisioner.cpp:416] Provisioner recovery complete
I0615 18:20:02.842420 31487 slave.cpp:6127] Finished recovery
I0615 18:20:02.842866 31487 slave.cpp:6309] Querying resource estimator for oversubscribable resources
I0615 18:20:02.843191 31492 slave.cpp:6323] Received oversubscribable resources {} from the resource estimator
I0615 18:20:02.845518 31484 process.cpp:3778] Handling HTTP event for process 'slave(762)' with path: '/slave(762)/monitor/statistics.json'
I0615 18:20:02.846869 31484 http.cpp:1115] HTTP GET for /slave(762)/monitor/statistics.json from 172.17.0.3:40894
I0615 18:20:02.846951 31484 http.cpp:936] Authorizing principal 'test-principal' to GET the '/monitor/statistics.json' endpoint
I0615 18:20:02.851423 31494 slave.cpp:817] Agent terminating
[       OK ] Endpoint/SlaveEndpointTest.NoAuthorizer/1 (34 ms)
[ RUN      ] Endpoint/SlaveEndpointTest.NoAuthorizer/2
I0615 18:20:02.863415 31475 containerizer.cpp:230] Using isolation: posix/cpu,posix/mem,filesystem/posix,network/cni,environment_secret
W0615 18:20:02.863960 31475 backend.cpp:76] Failed to create 'aufs' backend: AufsBackend requires root privileges
W0615 18:20:02.864068 31475 backend.cpp:76] Failed to create 'bind' backend: BindBackend requires root privileges
I0615 18:20:02.864109 31475 provisioner.cpp:255] Using default backend 'copy'
I0615 18:20:02.866112 31475 cluster.cpp:448] Creating default 'local' authorizer
I0615 18:20:02.867717 31482 slave.cpp:248] Mesos agent started on (763)@172.17.0.3:42332
I0615 18:20:02.867735 31482 slave.cpp:249] Flags at startup: --acls="" --appc_simple_discovery_uri_prefix="http://" --appc_store_dir="/tmp/Endpoint_SlaveEndpointTest_NoAuthorizer_2_frJgAP/store/appc" --authenticate_http_readonly="true" --authenticate_http_readwrite="true" --authenticatee="crammd5" --authentication_backoff_factor="1secs" --authorizer="local" --cgroups_cpu_enable_pids_and_tids_count="false" --cgroups_enable_cfs="false" --cgroups_hierarchy="/sys/fs/cgroup" --cgroups_limit_swap="false" --cgroups_root="mesos" --container_disk_watch_interval="15secs" --containerizers="mesos" --credential="/tmp/Endpoint_SlaveEndpointTest_NoAuthorizer_2_frJgAP/credential" --default_role="*" --disk_watch_interval="1mins" --docker="docker" --docker_kill_orphans="true" --docker_registry="https://registry-1.docker.io" --docker_remove_delay="6hrs" --docker_socket="/var/run/docker.sock" --docker_stop_timeout="0ns" --docker_store_dir="/tmp/Endpoint_SlaveEndpointTest_NoAuthorizer_2_frJgAP/store/docker" --docker_volume_checkpoint_dir="/var/run/mesos/isolators/docker/volume" --enforce_container_disk_quota="false" --executor_registration_timeout="1mins" --executor_reregistration_timeout="2secs" --executor_shutdown_grace_period="5secs" --fetcher_cache_dir="/tmp/Endpoint_SlaveEndpointTest_NoAuthorizer_2_frJgAP/fetch" --fetcher_cache_size="2GB" --frameworks_home="" --gc_delay="1weeks" --gc_disk_headroom="0.1" --hadoop_home="" --help="false" --hostname_lookup="true" --http_command_executor="false" --http_credentials="/tmp/Endpoint_SlaveEndpointTest_NoAuthorizer_2_frJgAP/http_credentials" --http_heartbeat_interval="30secs" --initialize_driver_logging="true" --isolation="posix/cpu,posix/mem" --launcher="posix" --launcher_dir="/mesos/build/src" --logbufsecs="0" --logging_level="INFO" --max_completed_executors_per_framework="150" --oversubscribed_resources_interval="15secs" --perf_duration="10secs" --perf_interval="1mins" --port="5051" --qos_correction_interval_min="0ns" --quiet="false" --recover="reconnect" --recovery_timeout="15mins" --registration_backoff_factor="10ms" --resources="cpus:2;gpus:0;mem:1024;disk:1024;ports:[31000-32000]" --revocable_cpu_low_priority="true" --runtime_dir="/tmp/Endpoint_SlaveEndpointTest_NoAuthorizer_2_frJgAP" --sandbox_directory="/mnt/mesos/sandbox" --strict="true" --switch_user="true" --systemd_enable_support="true" --systemd_runtime_directory="/run/systemd/system" --version="false" --work_dir="/tmp/Endpoint_SlaveEndpointTest_NoAuthorizer_2_VMOYZS"
I0615 18:20:02.868388 31482 credentials.hpp:86] Loading credential for authentication from '/tmp/Endpoint_SlaveEndpointTest_NoAuthorizer_2_frJgAP/credential'
I0615 18:20:02.868618 31482 slave.cpp:281] Agent using credential for: test-principal
I0615 18:20:02.868640 31482 credentials.hpp:37] Loading credentials for authentication from '/tmp/Endpoint_SlaveEndpointTest_NoAuthorizer_2_frJgAP/http_credentials'
I0615 18:20:02.868916 31482 http.cpp:975] Creating default 'basic' HTTP authenticator for realm 'mesos-agent-readonly'
I0615 18:20:02.869082 31482 http.cpp:975] Creating default 'basic' HTTP authenticator for realm 'mesos-agent-readwrite'
I0615 18:20:02.870672 31482 slave.cpp:552] Agent resources: cpus(*):2; mem(*):1024; disk(*):1024; ports(*):[31000-32000]
I0615 18:20:02.870761 31482 slave.cpp:560] Agent attributes: [  ]
I0615 18:20:02.870775 31482 slave.cpp:565] Agent hostname: 789315bf1c1c
I0615 18:20:02.870913 31486 status_update_manager.cpp:177] Pausing sending status updates
I0615 18:20:02.872845 31482 state.cpp:62] Recovering state from '/tmp/Endpoint_SlaveEndpointTest_NoAuthorizer_2_VMOYZS/meta'
I0615 18:20:02.873142 31481 status_update_manager.cpp:203] Recovering status update manager
I0615 18:20:02.873354 31494 containerizer.cpp:582] Recovering containerizer
I0615 18:20:02.874997 31489 provisioner.cpp:416] Provisioner recovery complete
I0615 18:20:02.875394 31483 slave.cpp:6127] Finished recovery
I0615 18:20:02.875911 31483 slave.cpp:6309] Querying resource estimator for oversubscribable resources
I0615 18:20:02.876185 31488 slave.cpp:6323] Received oversubscribable resources {} from the resource estimator
I0615 18:20:02.878662 31488 process.cpp:3778] Handling HTTP event for process 'slave(763)' with path: '/slave(763)/containers'
I0615 18:20:02.879801 31484 http.cpp:1115] HTTP GET for /slave(763)/containers from 172.17.0.3:40898
I0615 18:20:02.879869 31484 http.cpp:936] Authorizing principal 'test-principal' to GET the '/containers' endpoint
I0615 18:20:02.882892 31477 slave.cpp:817] Agent terminating
[       OK ] Endpoint/SlaveEndpointTest.NoAuthorizer/2 (31 ms)
[----------] 9 tests from Endpoint/SlaveEndpointTest (240 ms total)

[----------] Global test environment tear-down
[==========] 1546 tests from 169 test cases ran. (282888 ms total)
[  PASSED  ] 1545 tests.
[  FAILED  ] 1 test, listed below:
[  FAILED  ] PersistentVolumeEndpointsTest.ReserveAndSlaveRemoval

 1 FAILED TEST
  YOU HAVE 19 DISABLED TESTS

E0615 18:20:02.939867 31500 process.cpp:968] Failed to accept socket: future discarded
make[3]: Leaving directory `/mesos/build'
make[3]: *** [CMakeFiles/check] Error 1
make[2]: *** [CMakeFiles/check.dir/all] Error 2
make[2]: Leaving directory `/mesos/build'
make[1]: *** [CMakeFiles/check.dir/rule] Error 2
make[1]: Leaving directory `/mesos/build'
make: *** [check] Error 2
+ docker rmi mesos-1497548367-26328
Untagged: mesos-1497548367-26328:latest
Deleted: sha256:ce0e24b184b2773b79266572f15cf6b779c37f331eba357619e5aa785050a336
Deleted: sha256:d093ef5abfaa88f74f7b6a93d7015256d062e33ec3e21cfccb10290091a406f1
Deleted: sha256:99fd4e16671532553d5d959b3d514ec2bd040d42e220ca43074fe3119c7cc4b6
Deleted: sha256:0dcb7bc3e94b26bda8357d2064f3d12aa75bfb30d9159dbb36d8a13663ce1650
Deleted: sha256:0990adbb80f1b4f2b63fb2fb0c9d1e55d3490ca2b8aadbb058428a664063c5d8
Deleted: sha256:b806f8969b2b49f95be1adab77bb32951dc39a187c57bfd30225ff7b90fc4bc0
Deleted: sha256:d1081e7e833ac47afa676864ca761c4f46e95ba8c06cafda78c07888c941c99e
Deleted: sha256:9900e4280f3539db23ab5b52668f1899d010f9073dc8a35f201b1f404b139ac5
Deleted: sha256:fc65a5d7568c5fc4684346beeb5004b38102bf2a95b6e01b1f37e6007a4c1e7e
Deleted: sha256:61ac20a2418555d2f7b191e5c62239d484600330a69a9545b2d0bdbd23d663b6
Deleted: sha256:c7274ab024977e58c0ad2dbf4054e480929e4cf65a753b53b8138e3d99e20868
Deleted: sha256:1e56365734c93e231d69153788e097bc36f304790199cca03f24df74ce0c7097
Deleted: sha256:f52b147359f19576614789112e66ac698f142cff47dfe561637d179677981b82
Deleted: sha256:bdc76905c07195cc151df0faf951d0b0c545dff0ec99ac3dea810ddfc4b46891
Deleted: sha256:789c033e59893bdfef1df0662702a5e544238d7814a696532043640d64a3c266
Deleted: sha256:d49136809f7fa13089ce7dccaf400cfd8052c379d711db22fe57423e567a8f45
Deleted: sha256:ba1896b8be37c2f6774eac856bdd28b093ab1891fd1411bd602ed04f795fa6dc
Deleted: sha256:1dd24a38bd46f1286e407e558351c1fddfaced7e1dca81378b2d5918be7c4e38
Deleted: sha256:40c0472896f812b73e71c7edad0179b4a66df70b203cd4b0bc5ecc9064cef13f
Deleted: sha256:f5a846c63d177e479e09da8497997025b23dabc9d354ecf35174ef5d296335a2
Deleted: sha256:818f58371e7b5d87a6fe2952e205bafb44b3a84c1ad99c3fc82847857494fc44
Deleted: sha256:baee87a9bac7d0436e098d9278d3a99d4e6f168fef6c432285e10e3b67001d08
Deleted: sha256:e57d9e231a294ffc385190a9135cd9bb0959c0d9f9ab8c062c413057aa7d2c8d
Deleted: sha256:43584539da5ee3a2979eb987982dcc3fca9376128b5feed779ad464e834f76dc
Deleted: sha256:98536758efd3d4620d598618b37936857dc4e0c2b1509b312febd954dc1938e4
Build step 'Execute shell' marked build as failure
Not sending mail to unregistered user benjamin.hindman@gmail.com
Not sending mail to unregistered user yujie.jay@gmail.com

Jenkins build is back to normal : Mesos-Buildbot » cmake,gcc,--verbose,GLOG_v=1 MESOS_VERBOSE=1,centos:7,(ubuntu)&&(!ubuntu-us1)&&(!ubuntu-eu2) #3803

Posted by Apache Jenkins Server <je...@builds.apache.org>.
See <https://builds.apache.org/job/Mesos-Buildbot/BUILDTOOL=cmake,COMPILER=gcc,CONFIGURATION=--verbose,ENVIRONMENT=GLOG_v=1%20MESOS_VERBOSE=1,OS=centos%3A7,label_exp=(ubuntu)&&(!ubuntu-us1)&&(!ubuntu-eu2)/3803/display/redirect?page=changes>


Build failed in Jenkins: Mesos-Buildbot » cmake,gcc,--verbose,GLOG_v=1 MESOS_VERBOSE=1,centos:7,(ubuntu)&&(!ubuntu-us1)&&(!ubuntu-eu2) #3802

Posted by Apache Jenkins Server <je...@builds.apache.org>.
See <https://builds.apache.org/job/Mesos-Buildbot/BUILDTOOL=cmake,COMPILER=gcc,CONFIGURATION=--verbose,ENVIRONMENT=GLOG_v=1%20MESOS_VERBOSE=1,OS=centos%3A7,label_exp=(ubuntu)&&(!ubuntu-us1)&&(!ubuntu-eu2)/3802/display/redirect?page=changes>

Changes:

[vinodkone] Added a test with multiple tasks and checks for the default executor.

[vinodkone] Update for the docs/api-client-libraries.md file.

------------------------------------------
[...truncated 26.23 MB...]
[       OK ] Endpoint/SlaveEndpointTest.AuthorizedRequest/1 (28 ms)
[ RUN      ] Endpoint/SlaveEndpointTest.AuthorizedRequest/2
I0615 20:51:40.396126 31472 containerizer.cpp:230] Using isolation: posix/cpu,posix/mem,filesystem/posix,network/cni,environment_secret
W0615 20:51:40.396634 31472 backend.cpp:76] Failed to create 'aufs' backend: AufsBackend requires root privileges
W0615 20:51:40.396737 31472 backend.cpp:76] Failed to create 'bind' backend: BindBackend requires root privileges
I0615 20:51:40.396782 31472 provisioner.cpp:255] Using default backend 'copy'
I0615 20:51:40.400248 31486 slave.cpp:248] Mesos agent started on (758)@172.17.0.10:40328
I0615 20:51:40.400264 31486 slave.cpp:249] Flags at startup: --acls="" --appc_simple_discovery_uri_prefix="http://" --appc_store_dir="/tmp/Endpoint_SlaveEndpointTest_AuthorizedRequest_2_gDr9n1/store/appc" --authenticate_http_readonly="true" --authenticate_http_readwrite="true" --authenticatee="crammd5" --authentication_backoff_factor="1secs" --authorizer="local" --cgroups_cpu_enable_pids_and_tids_count="false" --cgroups_enable_cfs="false" --cgroups_hierarchy="/sys/fs/cgroup" --cgroups_limit_swap="false" --cgroups_root="mesos" --container_disk_watch_interval="15secs" --containerizers="mesos" --credential="/tmp/Endpoint_SlaveEndpointTest_AuthorizedRequest_2_gDr9n1/credential" --default_role="*" --disk_watch_interval="1mins" --docker="docker" --docker_kill_orphans="true" --docker_registry="https://registry-1.docker.io" --docker_remove_delay="6hrs" --docker_socket="/var/run/docker.sock" --docker_stop_timeout="0ns" --docker_store_dir="/tmp/Endpoint_SlaveEndpointTest_AuthorizedRequest_2_gDr9n1/store/docker" --docker_volume_checkpoint_dir="/var/run/mesos/isolators/docker/volume" --enforce_container_disk_quota="false" --executor_registration_timeout="1mins" --executor_reregistration_timeout="2secs" --executor_shutdown_grace_period="5secs" --fetcher_cache_dir="/tmp/Endpoint_SlaveEndpointTest_AuthorizedRequest_2_gDr9n1/fetch" --fetcher_cache_size="2GB" --frameworks_home="" --gc_delay="1weeks" --gc_disk_headroom="0.1" --hadoop_home="" --help="false" --hostname_lookup="true" --http_command_executor="false" --http_credentials="/tmp/Endpoint_SlaveEndpointTest_AuthorizedRequest_2_gDr9n1/http_credentials" --http_heartbeat_interval="30secs" --initialize_driver_logging="true" --isolation="posix/cpu,posix/mem" --launcher="posix" --launcher_dir="/mesos/build/src" --logbufsecs="0" --logging_level="INFO" --max_completed_executors_per_framework="150" --oversubscribed_resources_interval="15secs" --perf_duration="10secs" --perf_interval="1mins" --port="5051" --qos_correction_interval_min="0ns" --quiet="false" --recover="reconnect" --recovery_timeout="15mins" --registration_backoff_factor="10ms" --resources="cpus:2;gpus:0;mem:1024;disk:1024;ports:[31000-32000]" --revocable_cpu_low_priority="true" --runtime_dir="/tmp/Endpoint_SlaveEndpointTest_AuthorizedRequest_2_gDr9n1" --sandbox_directory="/mnt/mesos/sandbox" --strict="true" --switch_user="true" --systemd_enable_support="true" --systemd_runtime_directory="/run/systemd/system" --version="false" --work_dir="/tmp/Endpoint_SlaveEndpointTest_AuthorizedRequest_2_4Ww9Np"
I0615 20:51:40.400671 31486 credentials.hpp:86] Loading credential for authentication from '/tmp/Endpoint_SlaveEndpointTest_AuthorizedRequest_2_gDr9n1/credential'
I0615 20:51:40.400832 31486 slave.cpp:281] Agent using credential for: test-principal
I0615 20:51:40.400847 31486 credentials.hpp:37] Loading credentials for authentication from '/tmp/Endpoint_SlaveEndpointTest_AuthorizedRequest_2_gDr9n1/http_credentials'
I0615 20:51:40.401038 31486 http.cpp:975] Creating default 'basic' HTTP authenticator for realm 'mesos-agent-readonly'
I0615 20:51:40.401161 31486 http.cpp:975] Creating default 'basic' HTTP authenticator for realm 'mesos-agent-readwrite'
I0615 20:51:40.402271 31486 slave.cpp:552] Agent resources: cpus(*):2; mem(*):1024; disk(*):1024; ports(*):[31000-32000]
I0615 20:51:40.402341 31486 slave.cpp:560] Agent attributes: [  ]
I0615 20:51:40.402356 31486 slave.cpp:565] Agent hostname: 15fc8e366a9c
I0615 20:51:40.402495 31495 status_update_manager.cpp:177] Pausing sending status updates
I0615 20:51:40.403802 31495 state.cpp:62] Recovering state from '/tmp/Endpoint_SlaveEndpointTest_AuthorizedRequest_2_4Ww9Np/meta'
I0615 20:51:40.404234 31473 status_update_manager.cpp:203] Recovering status update manager
I0615 20:51:40.404414 31495 containerizer.cpp:582] Recovering containerizer
I0615 20:51:40.405787 31489 provisioner.cpp:416] Provisioner recovery complete
I0615 20:51:40.406388 31487 slave.cpp:6127] Finished recovery
I0615 20:51:40.406929 31487 slave.cpp:6309] Querying resource estimator for oversubscribable resources
I0615 20:51:40.407215 31490 slave.cpp:6323] Received oversubscribable resources {} from the resource estimator
I0615 20:51:40.409261 31490 process.cpp:3778] Handling HTTP event for process 'slave(758)' with path: '/slave(758)/containers'
I0615 20:51:40.410343 31475 http.cpp:1115] HTTP GET for /slave(758)/containers from 172.17.0.10:43816
I0615 20:51:40.410411 31475 http.cpp:936] Authorizing principal 'test-principal' to GET the '/containers' endpoint
I0615 20:51:40.413707 31486 slave.cpp:817] Agent terminating
[       OK ] Endpoint/SlaveEndpointTest.AuthorizedRequest/2 (27 ms)
[ RUN      ] Endpoint/SlaveEndpointTest.UnauthorizedRequest/0
I0615 20:51:40.422919 31472 containerizer.cpp:230] Using isolation: posix/cpu,posix/mem,filesystem/posix,network/cni,environment_secret
W0615 20:51:40.423351 31472 backend.cpp:76] Failed to create 'aufs' backend: AufsBackend requires root privileges
W0615 20:51:40.423440 31472 backend.cpp:76] Failed to create 'bind' backend: BindBackend requires root privileges
I0615 20:51:40.423473 31472 provisioner.cpp:255] Using default backend 'copy'
I0615 20:51:40.426901 31478 slave.cpp:248] Mesos agent started on (759)@172.17.0.10:40328
I0615 20:51:40.426923 31478 slave.cpp:249] Flags at startup: --acls="" --appc_simple_discovery_uri_prefix="http://" --appc_store_dir="/tmp/Endpoint_SlaveEndpointTest_UnauthorizedRequest_0_MpGTVr/store/appc" --authenticate_http_readonly="true" --authenticate_http_readwrite="true" --authenticatee="crammd5" --authentication_backoff_factor="1secs" --authorizer="local" --cgroups_cpu_enable_pids_and_tids_count="false" --cgroups_enable_cfs="false" --cgroups_hierarchy="/sys/fs/cgroup" --cgroups_limit_swap="false" --cgroups_root="mesos" --container_disk_watch_interval="15secs" --containerizers="mesos" --credential="/tmp/Endpoint_SlaveEndpointTest_UnauthorizedRequest_0_MpGTVr/credential" --default_role="*" --disk_watch_interval="1mins" --docker="docker" --docker_kill_orphans="true" --docker_registry="https://registry-1.docker.io" --docker_remove_delay="6hrs" --docker_socket="/var/run/docker.sock" --docker_stop_timeout="0ns" --docker_store_dir="/tmp/Endpoint_SlaveEndpointTest_UnauthorizedRequest_0_MpGTVr/store/docker" --docker_volume_checkpoint_dir="/var/run/mesos/isolators/docker/volume" --enforce_container_disk_quota="false" --executor_registration_timeout="1mins" --executor_reregistration_timeout="2secs" --executor_shutdown_grace_period="5secs" --fetcher_cache_dir="/tmp/Endpoint_SlaveEndpointTest_UnauthorizedRequest_0_MpGTVr/fetch" --fetcher_cache_size="2GB" --frameworks_home="" --gc_delay="1weeks" --gc_disk_headroom="0.1" --hadoop_home="" --help="false" --hostname_lookup="true" --http_command_executor="false" --http_credentials="/tmp/Endpoint_SlaveEndpointTest_UnauthorizedRequest_0_MpGTVr/http_credentials" --http_heartbeat_interval="30secs" --initialize_driver_logging="true" --isolation="posix/cpu,posix/mem" --launcher="posix" --launcher_dir="/mesos/build/src" --logbufsecs="0" --logging_level="INFO" --max_completed_executors_per_framework="150" --oversubscribed_resources_interval="15secs" --perf_duration="10secs" --perf_interval="1mins" --port="5051" --qos_correction_interval_min="0ns" --quiet="false" --recover="reconnect" --recovery_timeout="15mins" --registration_backoff_factor="10ms" --resources="cpus:2;gpus:0;mem:1024;disk:1024;ports:[31000-32000]" --revocable_cpu_low_priority="true" --runtime_dir="/tmp/Endpoint_SlaveEndpointTest_UnauthorizedRequest_0_MpGTVr" --sandbox_directory="/mnt/mesos/sandbox" --strict="true" --switch_user="true" --systemd_enable_support="true" --systemd_runtime_directory="/run/systemd/system" --version="false" --work_dir="/tmp/Endpoint_SlaveEndpointTest_UnauthorizedRequest_0_zUuShQ"
I0615 20:51:40.427295 31478 credentials.hpp:86] Loading credential for authentication from '/tmp/Endpoint_SlaveEndpointTest_UnauthorizedRequest_0_MpGTVr/credential'
I0615 20:51:40.427456 31478 slave.cpp:281] Agent using credential for: test-principal
I0615 20:51:40.427471 31478 credentials.hpp:37] Loading credentials for authentication from '/tmp/Endpoint_SlaveEndpointTest_UnauthorizedRequest_0_MpGTVr/http_credentials'
I0615 20:51:40.427661 31478 http.cpp:975] Creating default 'basic' HTTP authenticator for realm 'mesos-agent-readonly'
I0615 20:51:40.427809 31478 http.cpp:975] Creating default 'basic' HTTP authenticator for realm 'mesos-agent-readwrite'
I0615 20:51:40.428995 31478 slave.cpp:552] Agent resources: cpus(*):2; mem(*):1024; disk(*):1024; ports(*):[31000-32000]
I0615 20:51:40.429057 31478 slave.cpp:560] Agent attributes: [  ]
I0615 20:51:40.429067 31478 slave.cpp:565] Agent hostname: 15fc8e366a9c
I0615 20:51:40.429188 31481 status_update_manager.cpp:177] Pausing sending status updates
I0615 20:51:40.430493 31484 state.cpp:62] Recovering state from '/tmp/Endpoint_SlaveEndpointTest_UnauthorizedRequest_0_zUuShQ/meta'
I0615 20:51:40.430811 31490 status_update_manager.cpp:203] Recovering status update manager
I0615 20:51:40.431025 31489 containerizer.cpp:582] Recovering containerizer
I0615 20:51:40.432498 31487 provisioner.cpp:416] Provisioner recovery complete
I0615 20:51:40.432963 31492 slave.cpp:6127] Finished recovery
I0615 20:51:40.433465 31492 slave.cpp:6309] Querying resource estimator for oversubscribable resources
I0615 20:51:40.433712 31473 slave.cpp:6323] Received oversubscribable resources {} from the resource estimator
I0615 20:51:40.436672 31493 process.cpp:3778] Handling HTTP event for process 'slave(759)' with path: '/slave(759)/monitor/statistics'
I0615 20:51:40.437741 31476 http.cpp:1115] HTTP GET for /slave(759)/monitor/statistics from 172.17.0.10:43826
I0615 20:51:40.437803 31476 http.cpp:936] Authorizing principal 'test-principal' to GET the '/monitor/statistics' endpoint
I0615 20:51:40.440119 31484 slave.cpp:817] Agent terminating
[       OK ] Endpoint/SlaveEndpointTest.UnauthorizedRequest/0 (26 ms)
[ RUN      ] Endpoint/SlaveEndpointTest.UnauthorizedRequest/1
I0615 20:51:40.450033 31472 containerizer.cpp:230] Using isolation: posix/cpu,posix/mem,filesystem/posix,network/cni,environment_secret
W0615 20:51:40.450479 31472 backend.cpp:76] Failed to create 'aufs' backend: AufsBackend requires root privileges
W0615 20:51:40.450572 31472 backend.cpp:76] Failed to create 'bind' backend: BindBackend requires root privileges
I0615 20:51:40.450598 31472 provisioner.cpp:255] Using default backend 'copy'
I0615 20:51:40.453409 31485 slave.cpp:248] Mesos agent started on (760)@172.17.0.10:40328
I0615 20:51:40.453424 31485 slave.cpp:249] Flags at startup: --acls="" --appc_simple_discovery_uri_prefix="http://" --appc_store_dir="/tmp/Endpoint_SlaveEndpointTest_UnauthorizedRequest_1_AoezJS/store/appc" --authenticate_http_readonly="true" --authenticate_http_readwrite="true" --authenticatee="crammd5" --authentication_backoff_factor="1secs" --authorizer="local" --cgroups_cpu_enable_pids_and_tids_count="false" --cgroups_enable_cfs="false" --cgroups_hierarchy="/sys/fs/cgroup" --cgroups_limit_swap="false" --cgroups_root="mesos" --container_disk_watch_interval="15secs" --containerizers="mesos" --credential="/tmp/Endpoint_SlaveEndpointTest_UnauthorizedRequest_1_AoezJS/credential" --default_role="*" --disk_watch_interval="1mins" --docker="docker" --docker_kill_orphans="true" --docker_registry="https://registry-1.docker.io" --docker_remove_delay="6hrs" --docker_socket="/var/run/docker.sock" --docker_stop_timeout="0ns" --docker_store_dir="/tmp/Endpoint_SlaveEndpointTest_UnauthorizedRequest_1_AoezJS/store/docker" --docker_volume_checkpoint_dir="/var/run/mesos/isolators/docker/volume" --enforce_container_disk_quota="false" --executor_registration_timeout="1mins" --executor_reregistration_timeout="2secs" --executor_shutdown_grace_period="5secs" --fetcher_cache_dir="/tmp/Endpoint_SlaveEndpointTest_UnauthorizedRequest_1_AoezJS/fetch" --fetcher_cache_size="2GB" --frameworks_home="" --gc_delay="1weeks" --gc_disk_headroom="0.1" --hadoop_home="" --help="false" --hostname_lookup="true" --http_command_executor="false" --http_credentials="/tmp/Endpoint_SlaveEndpointTest_UnauthorizedRequest_1_AoezJS/http_credentials" --http_heartbeat_interval="30secs" --initialize_driver_logging="true" --isolation="posix/cpu,posix/mem" --launcher="posix" --launcher_dir="/mesos/build/src" --logbufsecs="0" --logging_level="INFO" --max_completed_executors_per_framework="150" --oversubscribed_resources_interval="15secs" --perf_duration="10secs" --perf_interval="1mins" --port="5051" --qos_correction_interval_min="0ns" --quiet="false" --recover="reconnect" --recovery_timeout="15mins" --registration_backoff_factor="10ms" --resources="cpus:2;gpus:0;mem:1024;disk:1024;ports:[31000-32000]" --revocable_cpu_low_priority="true" --runtime_dir="/tmp/Endpoint_SlaveEndpointTest_UnauthorizedRequest_1_AoezJS" --sandbox_directory="/mnt/mesos/sandbox" --strict="true" --switch_user="true" --systemd_enable_support="true" --systemd_runtime_directory="/run/systemd/system" --version="false" --work_dir="/tmp/Endpoint_SlaveEndpointTest_UnauthorizedRequest_1_vlnx1g"
I0615 20:51:40.453747 31485 credentials.hpp:86] Loading credential for authentication from '/tmp/Endpoint_SlaveEndpointTest_UnauthorizedRequest_1_AoezJS/credential'
I0615 20:51:40.453876 31485 slave.cpp:281] Agent using credential for: test-principal
I0615 20:51:40.453891 31485 credentials.hpp:37] Loading credentials for authentication from '/tmp/Endpoint_SlaveEndpointTest_UnauthorizedRequest_1_AoezJS/http_credentials'
I0615 20:51:40.454094 31485 http.cpp:975] Creating default 'basic' HTTP authenticator for realm 'mesos-agent-readonly'
I0615 20:51:40.454448 31485 http.cpp:975] Creating default 'basic' HTTP authenticator for realm 'mesos-agent-readwrite'
I0615 20:51:40.455827 31485 slave.cpp:552] Agent resources: cpus(*):2; mem(*):1024; disk(*):1024; ports(*):[31000-32000]
I0615 20:51:40.455896 31485 slave.cpp:560] Agent attributes: [  ]
I0615 20:51:40.455906 31485 slave.cpp:565] Agent hostname: 15fc8e366a9c
I0615 20:51:40.456042 31490 status_update_manager.cpp:177] Pausing sending status updates
I0615 20:51:40.457469 31480 state.cpp:62] Recovering state from '/tmp/Endpoint_SlaveEndpointTest_UnauthorizedRequest_1_vlnx1g/meta'
I0615 20:51:40.457885 31486 status_update_manager.cpp:203] Recovering status update manager
I0615 20:51:40.458091 31493 containerizer.cpp:582] Recovering containerizer
I0615 20:51:40.460062 31483 provisioner.cpp:416] Provisioner recovery complete
I0615 20:51:40.460403 31481 slave.cpp:6127] Finished recovery
I0615 20:51:40.460913 31481 slave.cpp:6309] Querying resource estimator for oversubscribable resources
I0615 20:51:40.461253 31475 slave.cpp:6323] Received oversubscribable resources {} from the resource estimator
I0615 20:51:40.463639 31483 process.cpp:3778] Handling HTTP event for process 'slave(760)' with path: '/slave(760)/monitor/statistics.json'
I0615 20:51:40.464825 31494 http.cpp:1115] HTTP GET for /slave(760)/monitor/statistics.json from 172.17.0.10:43830
I0615 20:51:40.464905 31494 http.cpp:936] Authorizing principal 'test-principal' to GET the '/monitor/statistics.json' endpoint
I0615 20:51:40.466936 31496 slave.cpp:817] Agent terminating
[       OK ] Endpoint/SlaveEndpointTest.UnauthorizedRequest/1 (26 ms)
[ RUN      ] Endpoint/SlaveEndpointTest.UnauthorizedRequest/2
I0615 20:51:40.477699 31472 containerizer.cpp:230] Using isolation: posix/cpu,posix/mem,filesystem/posix,network/cni,environment_secret
W0615 20:51:40.478273 31472 backend.cpp:76] Failed to create 'aufs' backend: AufsBackend requires root privileges
W0615 20:51:40.478380 31472 backend.cpp:76] Failed to create 'bind' backend: BindBackend requires root privileges
I0615 20:51:40.478408 31472 provisioner.cpp:255] Using default backend 'copy'
I0615 20:51:40.481664 31491 slave.cpp:248] Mesos agent started on (761)@172.17.0.10:40328
I0615 20:51:40.481686 31491 slave.cpp:249] Flags at startup: --acls="" --appc_simple_discovery_uri_prefix="http://" --appc_store_dir="/tmp/Endpoint_SlaveEndpointTest_UnauthorizedRequest_2_IsZuNj/store/appc" --authenticate_http_readonly="true" --authenticate_http_readwrite="true" --authenticatee="crammd5" --authentication_backoff_factor="1secs" --authorizer="local" --cgroups_cpu_enable_pids_and_tids_count="false" --cgroups_enable_cfs="false" --cgroups_hierarchy="/sys/fs/cgroup" --cgroups_limit_swap="false" --cgroups_root="mesos" --container_disk_watch_interval="15secs" --containerizers="mesos" --credential="/tmp/Endpoint_SlaveEndpointTest_UnauthorizedRequest_2_IsZuNj/credential" --default_role="*" --disk_watch_interval="1mins" --docker="docker" --docker_kill_orphans="true" --docker_registry="https://registry-1.docker.io" --docker_remove_delay="6hrs" --docker_socket="/var/run/docker.sock" --docker_stop_timeout="0ns" --docker_store_dir="/tmp/Endpoint_SlaveEndpointTest_UnauthorizedRequest_2_IsZuNj/store/docker" --docker_volume_checkpoint_dir="/var/run/mesos/isolators/docker/volume" --enforce_container_disk_quota="false" --executor_registration_timeout="1mins" --executor_reregistration_timeout="2secs" --executor_shutdown_grace_period="5secs" --fetcher_cache_dir="/tmp/Endpoint_SlaveEndpointTest_UnauthorizedRequest_2_IsZuNj/fetch" --fetcher_cache_size="2GB" --frameworks_home="" --gc_delay="1weeks" --gc_disk_headroom="0.1" --hadoop_home="" --help="false" --hostname_lookup="true" --http_command_executor="false" --http_credentials="/tmp/Endpoint_SlaveEndpointTest_UnauthorizedRequest_2_IsZuNj/http_credentials" --http_heartbeat_interval="30secs" --initialize_driver_logging="true" --isolation="posix/cpu,posix/mem" --launcher="posix" --launcher_dir="/mesos/build/src" --logbufsecs="0" --logging_level="INFO" --max_completed_executors_per_framework="150" --oversubscribed_resources_interval="15secs" --perf_duration="10secs" --perf_interval="1mins" --port="5051" --qos_correction_interval_min="0ns" --quiet="false" --recover="reconnect" --recovery_timeout="15mins" --registration_backoff_factor="10ms" --resources="cpus:2;gpus:0;mem:1024;disk:1024;ports:[31000-32000]" --revocable_cpu_low_priority="true" --runtime_dir="/tmp/Endpoint_SlaveEndpointTest_UnauthorizedRequest_2_IsZuNj" --sandbox_directory="/mnt/mesos/sandbox" --strict="true" --switch_user="true" --systemd_enable_support="true" --systemd_runtime_directory="/run/systemd/system" --version="false" --work_dir="/tmp/Endpoint_SlaveEndpointTest_UnauthorizedRequest_2_aa5o1H"
I0615 20:51:40.482054 31491 credentials.hpp:86] Loading credential for authentication from '/tmp/Endpoint_SlaveEndpointTest_UnauthorizedRequest_2_IsZuNj/credential'
I0615 20:51:40.482194 31491 slave.cpp:281] Agent using credential for: test-principal
I0615 20:51:40.482208 31491 credentials.hpp:37] Loading credentials for authentication from '/tmp/Endpoint_SlaveEndpointTest_UnauthorizedRequest_2_IsZuNj/http_credentials'
I0615 20:51:40.482393 31491 http.cpp:975] Creating default 'basic' HTTP authenticator for realm 'mesos-agent-readonly'
I0615 20:51:40.482535 31491 http.cpp:975] Creating default 'basic' HTTP authenticator for realm 'mesos-agent-readwrite'
I0615 20:51:40.483901 31491 slave.cpp:552] Agent resources: cpus(*):2; mem(*):1024; disk(*):1024; ports(*):[31000-32000]
I0615 20:51:40.483966 31491 slave.cpp:560] Agent attributes: [  ]
I0615 20:51:40.483975 31491 slave.cpp:565] Agent hostname: 15fc8e366a9c
I0615 20:51:40.484117 31489 status_update_manager.cpp:177] Pausing sending status updates
I0615 20:51:40.485532 31494 state.cpp:62] Recovering state from '/tmp/Endpoint_SlaveEndpointTest_UnauthorizedRequest_2_aa5o1H/meta'
I0615 20:51:40.485931 31474 status_update_manager.cpp:203] Recovering status update manager
I0615 20:51:40.486148 31489 containerizer.cpp:582] Recovering containerizer
I0615 20:51:40.487653 31496 provisioner.cpp:416] Provisioner recovery complete
I0615 20:51:40.488090 31474 slave.cpp:6127] Finished recovery
I0615 20:51:40.488570 31474 slave.cpp:6309] Querying resource estimator for oversubscribable resources
I0615 20:51:40.488829 31483 slave.cpp:6323] Received oversubscribable resources {} from the resource estimator
I0615 20:51:40.491281 31483 process.cpp:3778] Handling HTTP event for process 'slave(761)' with path: '/slave(761)/containers'
I0615 20:51:40.492390 31489 http.cpp:1115] HTTP GET for /slave(761)/containers from 172.17.0.10:43856
I0615 20:51:40.492465 31489 http.cpp:936] Authorizing principal 'test-principal' to GET the '/containers' endpoint
I0615 20:51:40.494825 31495 slave.cpp:817] Agent terminating
[       OK ] Endpoint/SlaveEndpointTest.UnauthorizedRequest/2 (27 ms)
[ RUN      ] Endpoint/SlaveEndpointTest.NoAuthorizer/0
I0615 20:51:40.504942 31472 containerizer.cpp:230] Using isolation: posix/cpu,posix/mem,filesystem/posix,network/cni,environment_secret
W0615 20:51:40.505365 31472 backend.cpp:76] Failed to create 'aufs' backend: AufsBackend requires root privileges
W0615 20:51:40.505455 31472 backend.cpp:76] Failed to create 'bind' backend: BindBackend requires root privileges
I0615 20:51:40.505480 31472 provisioner.cpp:255] Using default backend 'copy'
I0615 20:51:40.507498 31472 cluster.cpp:448] Creating default 'local' authorizer
I0615 20:51:40.509008 31484 slave.cpp:248] Mesos agent started on (762)@172.17.0.10:40328
I0615 20:51:40.509021 31484 slave.cpp:249] Flags at startup: --acls="" --appc_simple_discovery_uri_prefix="http://" --appc_store_dir="/tmp/Endpoint_SlaveEndpointTest_NoAuthorizer_0_pEaN7K/store/appc" --authenticate_http_readonly="true" --authenticate_http_readwrite="true" --authenticatee="crammd5" --authentication_backoff_factor="1secs" --authorizer="local" --cgroups_cpu_enable_pids_and_tids_count="false" --cgroups_enable_cfs="false" --cgroups_hierarchy="/sys/fs/cgroup" --cgroups_limit_swap="false" --cgroups_root="mesos" --container_disk_watch_interval="15secs" --containerizers="mesos" --credential="/tmp/Endpoint_SlaveEndpointTest_NoAuthorizer_0_pEaN7K/credential" --default_role="*" --disk_watch_interval="1mins" --docker="docker" --docker_kill_orphans="true" --docker_registry="https://registry-1.docker.io" --docker_remove_delay="6hrs" --docker_socket="/var/run/docker.sock" --docker_stop_timeout="0ns" --docker_store_dir="/tmp/Endpoint_SlaveEndpointTest_NoAuthorizer_0_pEaN7K/store/docker" --docker_volume_checkpoint_dir="/var/run/mesos/isolators/docker/volume" --enforce_container_disk_quota="false" --executor_registration_timeout="1mins" --executor_reregistration_timeout="2secs" --executor_shutdown_grace_period="5secs" --fetcher_cache_dir="/tmp/Endpoint_SlaveEndpointTest_NoAuthorizer_0_pEaN7K/fetch" --fetcher_cache_size="2GB" --frameworks_home="" --gc_delay="1weeks" --gc_disk_headroom="0.1" --hadoop_home="" --help="false" --hostname_lookup="true" --http_command_executor="false" --http_credentials="/tmp/Endpoint_SlaveEndpointTest_NoAuthorizer_0_pEaN7K/http_credentials" --http_heartbeat_interval="30secs" --initialize_driver_logging="true" --isolation="posix/cpu,posix/mem" --launcher="posix" --launcher_dir="/mesos/build/src" --logbufsecs="0" --logging_level="INFO" --max_completed_executors_per_framework="150" --oversubscribed_resources_interval="15secs" --perf_duration="10secs" --perf_interval="1mins" --port="5051" --qos_correction_interval_min="0ns" --quiet="false" --recover="reconnect" --recovery_timeout="15mins" --registration_backoff_factor="10ms" --resources="cpus:2;gpus:0;mem:1024;disk:1024;ports:[31000-32000]" --revocable_cpu_low_priority="true" --runtime_dir="/tmp/Endpoint_SlaveEndpointTest_NoAuthorizer_0_pEaN7K" --sandbox_directory="/mnt/mesos/sandbox" --strict="true" --switch_user="true" --systemd_enable_support="true" --systemd_runtime_directory="/run/systemd/system" --version="false" --work_dir="/tmp/Endpoint_SlaveEndpointTest_NoAuthorizer_0_r1PCh9"
I0615 20:51:40.509335 31484 credentials.hpp:86] Loading credential for authentication from '/tmp/Endpoint_SlaveEndpointTest_NoAuthorizer_0_pEaN7K/credential'
I0615 20:51:40.509474 31484 slave.cpp:281] Agent using credential for: test-principal
I0615 20:51:40.509495 31484 credentials.hpp:37] Loading credentials for authentication from '/tmp/Endpoint_SlaveEndpointTest_NoAuthorizer_0_pEaN7K/http_credentials'
I0615 20:51:40.509683 31484 http.cpp:975] Creating default 'basic' HTTP authenticator for realm 'mesos-agent-readonly'
I0615 20:51:40.509819 31484 http.cpp:975] Creating default 'basic' HTTP authenticator for realm 'mesos-agent-readwrite'
I0615 20:51:40.511080 31484 slave.cpp:552] Agent resources: cpus(*):2; mem(*):1024; disk(*):1024; ports(*):[31000-32000]
I0615 20:51:40.511145 31484 slave.cpp:560] Agent attributes: [  ]
I0615 20:51:40.511154 31484 slave.cpp:565] Agent hostname: 15fc8e366a9c
I0615 20:51:40.511281 31480 status_update_manager.cpp:177] Pausing sending status updates
I0615 20:51:40.512378 31492 state.cpp:62] Recovering state from '/tmp/Endpoint_SlaveEndpointTest_NoAuthorizer_0_r1PCh9/meta'
I0615 20:51:40.512691 31482 status_update_manager.cpp:203] Recovering status update manager
I0615 20:51:40.512959 31484 containerizer.cpp:582] Recovering containerizer
I0615 20:51:40.514268 31491 provisioner.cpp:416] Provisioner recovery complete
I0615 20:51:40.514655 31485 slave.cpp:6127] Finished recovery
I0615 20:51:40.515064 31485 slave.cpp:6309] Querying resource estimator for oversubscribable resources
I0615 20:51:40.515285 31492 slave.cpp:6323] Received oversubscribable resources {} from the resource estimator
I0615 20:51:40.517098 31487 process.cpp:3778] Handling HTTP event for process 'slave(762)' with path: '/slave(762)/monitor/statistics'
I0615 20:51:40.518504 31482 http.cpp:1115] HTTP GET for /slave(762)/monitor/statistics from 172.17.0.10:43866
I0615 20:51:40.518561 31482 http.cpp:936] Authorizing principal 'test-principal' to GET the '/monitor/statistics' endpoint
I0615 20:51:40.521419 31488 slave.cpp:817] Agent terminating
[       OK ] Endpoint/SlaveEndpointTest.NoAuthorizer/0 (25 ms)
[ RUN      ] Endpoint/SlaveEndpointTest.NoAuthorizer/1
I0615 20:51:40.530813 31472 containerizer.cpp:230] Using isolation: posix/cpu,posix/mem,filesystem/posix,network/cni,environment_secret
W0615 20:51:40.531255 31472 backend.cpp:76] Failed to create 'aufs' backend: AufsBackend requires root privileges
W0615 20:51:40.531355 31472 backend.cpp:76] Failed to create 'bind' backend: BindBackend requires root privileges
I0615 20:51:40.531386 31472 provisioner.cpp:255] Using default backend 'copy'
I0615 20:51:40.533359 31472 cluster.cpp:448] Creating default 'local' authorizer
I0615 20:51:40.534798 31485 slave.cpp:248] Mesos agent started on (763)@172.17.0.10:40328
I0615 20:51:40.534813 31485 slave.cpp:249] Flags at startup: --acls="" --appc_simple_discovery_uri_prefix="http://" --appc_store_dir="/tmp/Endpoint_SlaveEndpointTest_NoAuthorizer_1_QTjIHc/store/appc" --authenticate_http_readonly="true" --authenticate_http_readwrite="true" --authenticatee="crammd5" --authentication_backoff_factor="1secs" --authorizer="local" --cgroups_cpu_enable_pids_and_tids_count="false" --cgroups_enable_cfs="false" --cgroups_hierarchy="/sys/fs/cgroup" --cgroups_limit_swap="false" --cgroups_root="mesos" --container_disk_watch_interval="15secs" --containerizers="mesos" --credential="/tmp/Endpoint_SlaveEndpointTest_NoAuthorizer_1_QTjIHc/credential" --default_role="*" --disk_watch_interval="1mins" --docker="docker" --docker_kill_orphans="true" --docker_registry="https://registry-1.docker.io" --docker_remove_delay="6hrs" --docker_socket="/var/run/docker.sock" --docker_stop_timeout="0ns" --docker_store_dir="/tmp/Endpoint_SlaveEndpointTest_NoAuthorizer_1_QTjIHc/store/docker" --docker_volume_checkpoint_dir="/var/run/mesos/isolators/docker/volume" --enforce_container_disk_quota="false" --executor_registration_timeout="1mins" --executor_reregistration_timeout="2secs" --executor_shutdown_grace_period="5secs" --fetcher_cache_dir="/tmp/Endpoint_SlaveEndpointTest_NoAuthorizer_1_QTjIHc/fetch" --fetcher_cache_size="2GB" --frameworks_home="" --gc_delay="1weeks" --gc_disk_headroom="0.1" --hadoop_home="" --help="false" --hostname_lookup="true" --http_command_executor="false" --http_credentials="/tmp/Endpoint_SlaveEndpointTest_NoAuthorizer_1_QTjIHc/http_credentials" --http_heartbeat_interval="30secs" --initialize_driver_logging="true" --isolation="posix/cpu,posix/mem" --launcher="posix" --launcher_dir="/mesos/build/src" --logbufsecs="0" --logging_level="INFO" --max_completed_executors_per_framework="150" --oversubscribed_resources_interval="15secs" --perf_duration="10secs" --perf_interval="1mins" --port="5051" --qos_correction_interval_min="0ns" --quiet="false" --recover="reconnect" --recovery_timeout="15mins" --registration_backoff_factor="10ms" --resources="cpus:2;gpus:0;mem:1024;disk:1024;ports:[31000-32000]" --revocable_cpu_low_priority="true" --runtime_dir="/tmp/Endpoint_SlaveEndpointTest_NoAuthorizer_1_QTjIHc" --sandbox_directory="/mnt/mesos/sandbox" --strict="true" --switch_user="true" --systemd_enable_support="true" --systemd_runtime_directory="/run/systemd/system" --version="false" --work_dir="/tmp/Endpoint_SlaveEndpointTest_NoAuthorizer_1_qRGFNA"
I0615 20:51:40.535199 31485 credentials.hpp:86] Loading credential for authentication from '/tmp/Endpoint_SlaveEndpointTest_NoAuthorizer_1_QTjIHc/credential'
I0615 20:51:40.535351 31485 slave.cpp:281] Agent using credential for: test-principal
I0615 20:51:40.535365 31485 credentials.hpp:37] Loading credentials for authentication from '/tmp/Endpoint_SlaveEndpointTest_NoAuthorizer_1_QTjIHc/http_credentials'
I0615 20:51:40.535549 31485 http.cpp:975] Creating default 'basic' HTTP authenticator for realm 'mesos-agent-readonly'
I0615 20:51:40.535670 31485 http.cpp:975] Creating default 'basic' HTTP authenticator for realm 'mesos-agent-readwrite'
I0615 20:51:40.536931 31485 slave.cpp:552] Agent resources: cpus(*):2; mem(*):1024; disk(*):1024; ports(*):[31000-32000]
I0615 20:51:40.536994 31485 slave.cpp:560] Agent attributes: [  ]
I0615 20:51:40.537003 31485 slave.cpp:565] Agent hostname: 15fc8e366a9c
I0615 20:51:40.537128 31488 status_update_manager.cpp:177] Pausing sending status updates
I0615 20:51:40.538597 31489 state.cpp:62] Recovering state from '/tmp/Endpoint_SlaveEndpointTest_NoAuthorizer_1_qRGFNA/meta'
I0615 20:51:40.538831 31485 status_update_manager.cpp:203] Recovering status update manager
I0615 20:51:40.539232 31496 containerizer.cpp:582] Recovering containerizer
I0615 20:51:40.540659 31487 provisioner.cpp:416] Provisioner recovery complete
I0615 20:51:40.541016 31481 slave.cpp:6127] Finished recovery
I0615 20:51:40.541483 31481 slave.cpp:6309] Querying resource estimator for oversubscribable resources
I0615 20:51:40.541795 31495 slave.cpp:6323] Received oversubscribable resources {} from the resource estimator
I0615 20:51:40.544095 31488 process.cpp:3778] Handling HTTP event for process 'slave(763)' with path: '/slave(763)/monitor/statistics.json'
I0615 20:51:40.545485 31486 http.cpp:1115] HTTP GET for /slave(763)/monitor/statistics.json from 172.17.0.10:43874
I0615 20:51:40.545554 31486 http.cpp:936] Authorizing principal 'test-principal' to GET the '/monitor/statistics.json' endpoint
I0615 20:51:40.548588 31491 slave.cpp:817] Agent terminating
[       OK ] Endpoint/SlaveEndpointTest.NoAuthorizer/1 (28 ms)
[ RUN      ] Endpoint/SlaveEndpointTest.NoAuthorizer/2
I0615 20:51:40.559388 31472 containerizer.cpp:230] Using isolation: posix/cpu,posix/mem,filesystem/posix,network/cni,environment_secret
W0615 20:51:40.559857 31472 backend.cpp:76] Failed to create 'aufs' backend: AufsBackend requires root privileges
W0615 20:51:40.559944 31472 backend.cpp:76] Failed to create 'bind' backend: BindBackend requires root privileges
I0615 20:51:40.559969 31472 provisioner.cpp:255] Using default backend 'copy'
I0615 20:51:40.561821 31472 cluster.cpp:448] Creating default 'local' authorizer
I0615 20:51:40.563396 31496 slave.cpp:248] Mesos agent started on (764)@172.17.0.10:40328
I0615 20:51:40.563410 31496 slave.cpp:249] Flags at startup: --acls="" --appc_simple_discovery_uri_prefix="http://" --appc_store_dir="/tmp/Endpoint_SlaveEndpointTest_NoAuthorizer_2_MeCeyE/store/appc" --authenticate_http_readonly="true" --authenticate_http_readwrite="true" --authenticatee="crammd5" --authentication_backoff_factor="1secs" --authorizer="local" --cgroups_cpu_enable_pids_and_tids_count="false" --cgroups_enable_cfs="false" --cgroups_hierarchy="/sys/fs/cgroup" --cgroups_limit_swap="false" --cgroups_root="mesos" --container_disk_watch_interval="15secs" --containerizers="mesos" --credential="/tmp/Endpoint_SlaveEndpointTest_NoAuthorizer_2_MeCeyE/credential" --default_role="*" --disk_watch_interval="1mins" --docker="docker" --docker_kill_orphans="true" --docker_registry="https://registry-1.docker.io" --docker_remove_delay="6hrs" --docker_socket="/var/run/docker.sock" --docker_stop_timeout="0ns" --docker_store_dir="/tmp/Endpoint_SlaveEndpointTest_NoAuthorizer_2_MeCeyE/store/docker" --docker_volume_checkpoint_dir="/var/run/mesos/isolators/docker/volume" --enforce_container_disk_quota="false" --executor_registration_timeout="1mins" --executor_reregistration_timeout="2secs" --executor_shutdown_grace_period="5secs" --fetcher_cache_dir="/tmp/Endpoint_SlaveEndpointTest_NoAuthorizer_2_MeCeyE/fetch" --fetcher_cache_size="2GB" --frameworks_home="" --gc_delay="1weeks" --gc_disk_headroom="0.1" --hadoop_home="" --help="false" --hostname_lookup="true" --http_command_executor="false" --http_credentials="/tmp/Endpoint_SlaveEndpointTest_NoAuthorizer_2_MeCeyE/http_credentials" --http_heartbeat_interval="30secs" --initialize_driver_logging="true" --isolation="posix/cpu,posix/mem" --launcher="posix" --launcher_dir="/mesos/build/src" --logbufsecs="0" --logging_level="INFO" --max_completed_executors_per_framework="150" --oversubscribed_resources_interval="15secs" --perf_duration="10secs" --perf_interval="1mins" --port="5051" --qos_correction_interval_min="0ns" --quiet="false" --recover="reconnect" --recovery_timeout="15mins" --registration_backoff_factor="10ms" --resources="cpus:2;gpus:0;mem:1024;disk:1024;ports:[31000-32000]" --revocable_cpu_low_priority="true" --runtime_dir="/tmp/Endpoint_SlaveEndpointTest_NoAuthorizer_2_MeCeyE" --sandbox_directory="/mnt/mesos/sandbox" --strict="true" --switch_user="true" --systemd_enable_support="true" --systemd_runtime_directory="/run/systemd/system" --version="false" --work_dir="/tmp/Endpoint_SlaveEndpointTest_NoAuthorizer_2_coqXz2"
I0615 20:51:40.563765 31496 credentials.hpp:86] Loading credential for authentication from '/tmp/Endpoint_SlaveEndpointTest_NoAuthorizer_2_MeCeyE/credential'
I0615 20:51:40.563941 31496 slave.cpp:281] Agent using credential for: test-principal
I0615 20:51:40.563959 31496 credentials.hpp:37] Loading credentials for authentication from '/tmp/Endpoint_SlaveEndpointTest_NoAuthorizer_2_MeCeyE/http_credentials'
I0615 20:51:40.564159 31496 http.cpp:975] Creating default 'basic' HTTP authenticator for realm 'mesos-agent-readonly'
I0615 20:51:40.564292 31496 http.cpp:975] Creating default 'basic' HTTP authenticator for realm 'mesos-agent-readwrite'
I0615 20:51:40.565385 31496 slave.cpp:552] Agent resources: cpus(*):2; mem(*):1024; disk(*):1024; ports(*):[31000-32000]
I0615 20:51:40.565448 31496 slave.cpp:560] Agent attributes: [  ]
I0615 20:51:40.565455 31496 slave.cpp:565] Agent hostname: 15fc8e366a9c
I0615 20:51:40.565557 31492 status_update_manager.cpp:177] Pausing sending status updates
I0615 20:51:40.566642 31489 state.cpp:62] Recovering state from '/tmp/Endpoint_SlaveEndpointTest_NoAuthorizer_2_coqXz2/meta'
I0615 20:51:40.567065 31483 status_update_manager.cpp:203] Recovering status update manager
I0615 20:51:40.567229 31477 containerizer.cpp:582] Recovering containerizer
I0615 20:51:40.568621 31484 provisioner.cpp:416] Provisioner recovery complete
I0615 20:51:40.568951 31485 slave.cpp:6127] Finished recovery
I0615 20:51:40.569368 31485 slave.cpp:6309] Querying resource estimator for oversubscribable resources
I0615 20:51:40.569628 31490 slave.cpp:6323] Received oversubscribable resources {} from the resource estimator
I0615 20:51:40.571705 31475 process.cpp:3778] Handling HTTP event for process 'slave(764)' with path: '/slave(764)/containers'
I0615 20:51:40.572726 31490 http.cpp:1115] HTTP GET for /slave(764)/containers from 172.17.0.10:43880
I0615 20:51:40.572787 31490 http.cpp:936] Authorizing principal 'test-principal' to GET the '/containers' endpoint
I0615 20:51:40.576457 31491 slave.cpp:817] Agent terminating
[       OK ] Endpoint/SlaveEndpointTest.NoAuthorizer/2 (28 ms)
[----------] 9 tests from Endpoint/SlaveEndpointTest (250 ms total)

[----------] Global test environment tear-down
[==========] 1547 tests from 169 test cases ran. (287119 ms total)
[  PASSED  ] 1546 tests.
[  FAILED  ] 1 test, listed below:
[  FAILED  ] OversubscriptionTest.RescindRevocableOfferWithIncreasedRevocable

 1 FAILED TEST
  YOU HAVE 19 DISABLED TESTS

E0615 20:51:40.638725 31497 process.cpp:968] Failed to accept socket: future discarded
make[3]: Leaving directory `/mesos/build'
make[3]: *** [CMakeFiles/check] Error 1
make[2]: *** [CMakeFiles/check.dir/all] Error 2
make[2]: Leaving directory `/mesos/build'
make[1]: *** [CMakeFiles/check.dir/rule] Error 2
make[1]: Leaving directory `/mesos/build'
make: *** [check] Error 2
+ docker rmi mesos-1497557419-21495
Untagged: mesos-1497557419-21495:latest
Deleted: sha256:b1e4a9bc2a8ba24ec28a4a4361c82d21f7ea4afc6f69219e773cd72bd4671eb0
Deleted: sha256:ad1b9a6d836a472effee2c24e99d10a01bf1e4cc28415432bea083f5bb11feb5
Deleted: sha256:42e8b14af6401622ee63b5bd3a0c154955e9233f65c67061a700a126251bd1fa
Deleted: sha256:00e6501954e2af7d28571721cf036883eb6799ef20c20af88d43414e30b8471a
Deleted: sha256:6bebec26e11c8aa72531c3c0243de2276a3d9b87db1ce48bd04ec4d14231b5d9
Deleted: sha256:7d76cba3b2b3a6b136df0151e4da82040d1ba5fe8037b12e53c5aec86ba1e953
Deleted: sha256:136de7bd87d11954482f59b4e2b204a75c87006682d5104f0bd9c5fe91be070f
Deleted: sha256:b14b9a7bebeb86eaeb5d444d19fea7f4059fb48e4325bec52d15aeda0dc57ffd
Deleted: sha256:75ffb6405cbfb923df75db3a658f56cff0a7c3b84f9fad37d195c82176377600
Deleted: sha256:a7926645340401c070d31c955453bcc48cdf5264dadb9fefe5de5806a64411a2
Deleted: sha256:eed174f5068a241f8bc212037bf2f7980cb660ecfbced16d2847b08d6abd62b5
Deleted: sha256:43e9cd918611423f9996875e22a5c425eaf35302189c8fb723c22cb8f9110b39
Deleted: sha256:d2e36733cb2a5a43b76d7f8e4e37aa4ff71a5c52c421fd11aa527d185cbaf806
Deleted: sha256:61bf5564960edc1afeac8bc29719aeb3a96e271dd22b97707320b610e3e7b480
Deleted: sha256:4a1b834ebab105d1e609f7fd3b7ff3a0ce4ca7ad0a27562e31dfac6f6843637d
Deleted: sha256:f4c65c21d1029cdc9f42f6f5e27f5c8b88bae8ce42ebb9b187a1bf13b364fd2b
Deleted: sha256:681288f6502b81b6ac02f190306f0571ad06767a1250763e375245c946e669ee
Deleted: sha256:1872429f69771ba417e60f57eef201e2b98fd7974e5cd1e88fdd4ca0d472dc1b
Deleted: sha256:516ac1e8a936f3f919951701c43ab37907c744698cb6664ef1866cd11e35b76d
Deleted: sha256:b307f98d826d8dd14c8b5f979a716e9ad916786c8ba5d7210393ff4a336dc61a
Deleted: sha256:d632f38d4c284f6b990d63f1d141618c180c7972f3e781e60cc10a66caa21947
Deleted: sha256:b985f6a1e54ebb8f98dcc428b19510e01a191b529d435a0cc43a68b8a2db0e52
Deleted: sha256:8568cc0b31f403c1c07f201d3ac1322361443d7456ea4fc8e5e9e685ad72668e
Deleted: sha256:694794003fedc60c8a90bb0860a0ebe1842f9c5e6df49fe1fbcc5e9298926b57
Deleted: sha256:157be5b288b00afebdc1a19f6a8b7b946a29975ddcef120ac06b040809eea66f
Build step 'Execute shell' marked build as failure
Not sending mail to unregistered user benjamin.hindman@gmail.com
Not sending mail to unregistered user yujie.jay@gmail.com