You are viewing a plain text version of this content. The canonical link for it is here.
Posted to dev@juneau.apache.org by Apache Jenkins Server <je...@builds.apache.org> on 2026/09/13 00:05:24 UTC
Build failed in Jenkins: Juneau » Juneau-Java-17 #2697
See <https://ci-builds.apache.org/job/Juneau/job/Juneau-Java-17/2697/display/redirect?page=changes>
Changes:
[James Bognar] Harden RowAction.form GET URLs (WORK-J0527): substitute per-row {property} tokens before the confirmation GET, and refuse blank, residual, or .. paths the same way endpoints refuse malformed writes.
------------------------------------------
Started by an SCM change
Running as SYSTEM
[EnvInject] - Loading node environment variables.
Building remotely on builds58 (ubuntu ubuntu-avx) in workspace <https://ci-builds.apache.org/job/Juneau/job/Juneau-Java-17/ws/>
The recommended git tool is: NONE
No credentials specified
> git rev-parse --resolve-git-dir <https://ci-builds.apache.org/job/Juneau/job/Juneau-Java-17/ws/.git> # timeout=10
Fetching changes from the remote Git repository
> git config remote.origin.url https://github.com/apache/juneau.git # timeout=10
Fetching upstream changes from https://github.com/apache/juneau.git
> git --version # timeout=10
> git --version # 'git version 2.34.1'
> git fetch --tags --force --progress -- https://github.com/apache/juneau.git +refs/heads/*:refs/remotes/origin/* # timeout=10
> git rev-parse refs/remotes/origin/master^{commit} # timeout=10
Checking out Revision cb56843d180a7e11d9bc8dd89f3ca19dc5befc18 (refs/remotes/origin/master)
> git config core.sparsecheckout # timeout=10
> git checkout -f cb56843d180a7e11d9bc8dd89f3ca19dc5befc18 # timeout=10
Commit message: "Harden RowAction.form GET URLs (WORK-J0527): substitute per-row {property} tokens before the confirmation GET, and refuse blank, residual, or .. paths the same way endpoints refuse malformed writes."
> git rev-list --no-walk e28041033e5f5b91cccdeb5e22806399d87b5a23 # timeout=10
[Juneau-Java-17] $ mvn clean install deploy javadoc:aggregate
FATAL: command execution failed
java.io.IOException: error=2, No such file or directory
at java.base/java.lang.ProcessImpl.forkAndExec(Native Method)
at java.base/java.lang.ProcessImpl.<init>(ProcessImpl.java:314)
at java.base/java.lang.ProcessImpl.start(ProcessImpl.java:244)
at java.base/java.lang.ProcessBuilder.start(ProcessBuilder.java:1110)
Also: hudson.remoting.Channel$CallSiteStackTrace: Remote call to builds58
at hudson.remoting.Channel.attachCallSiteStackTrace(Channel.java:1923)
at hudson.remoting.UserRequest$ExceptionResponse.retrieve(UserRequest.java:384)
at hudson.remoting.Channel.call(Channel.java:1112)
at hudson.Launcher$RemoteLauncher.launch(Launcher.java:1121)
at hudson.Launcher$ProcStarter.start(Launcher.java:506)
at hudson.Launcher$ProcStarter.join(Launcher.java:517)
at hudson.tasks.Maven.perform(Maven.java:368)
at hudson.tasks.BuildStepMonitor$1.perform(BuildStepMonitor.java:20)
at hudson.model.AbstractBuild$AbstractBuildExecution.perform(AbstractBuild.java:818)
at hudson.model.Build$BuildExecution.build(Build.java:199)
at hudson.model.Build$BuildExecution.doRun(Build.java:164)
at hudson.model.AbstractBuild$AbstractBuildExecution.run(AbstractBuild.java:527)
at hudson.model.Run.execute(Run.java:1833)
at hudson.model.FreeStyleBuild.run(FreeStyleBuild.java:44)
at hudson.model.ResourceController.execute(ResourceController.java:101)
at hudson.model.Executor.run(Executor.java:446)
Caused: java.io.IOException: Cannot run program "mvn" (in directory "<https://ci-builds.apache.org/job/Juneau/job/Juneau-Java-17/ws/")>: error=2, No such file or directory
at java.base/java.lang.ProcessBuilder.start(ProcessBuilder.java:1143)
at java.base/java.lang.ProcessBuilder.start(ProcessBuilder.java:1073)
at hudson.Proc$LocalProc.<init>(Proc.java:252)
at hudson.Proc$LocalProc.<init>(Proc.java:221)
at hudson.Launcher$LocalLauncher.launch(Launcher.java:994)
at hudson.Launcher$ProcStarter.start(Launcher.java:506)
at hudson.Launcher$RemoteLaunchCallable.call(Launcher.java:1395)
at hudson.Launcher$RemoteLaunchCallable.call(Launcher.java:1337)
at hudson.remoting.UserRequest.perform(UserRequest.java:225)
at hudson.remoting.UserRequest.perform(UserRequest.java:50)
at hudson.remoting.Request$2.run(Request.java:391)
at hudson.remoting.InterceptingExecutorService.lambda$wrap$0(InterceptingExecutorService.java:81)
at java.base/java.util.concurrent.FutureTask.run(FutureTask.java:264)
at java.base/java.util.concurrent.ThreadPoolExecutor.runWorker(ThreadPoolExecutor.java:1136)
at java.base/java.util.concurrent.ThreadPoolExecutor$Worker.run(ThreadPoolExecutor.java:635)
at java.base/java.lang.Thread.run(Thread.java:840)
Build step 'Invoke top-level Maven targets' marked build as failure
Recording test results
[Checks API] No suitable checks publisher found.
Jenkins build is back to normal : Juneau » Juneau-Java-17 #2702
Posted by Apache Jenkins Server <je...@builds.apache.org>.
See <https://ci-builds.apache.org/job/Juneau/job/Juneau-Java-17/2702/display/redirect>
Build failed in Jenkins: Juneau » Juneau-Java-17 #2701
Posted by Apache Jenkins Server <je...@builds.apache.org>.
See <https://ci-builds.apache.org/job/Juneau/job/Juneau-Java-17/2701/display/redirect?page=changes>
Changes:
[James Bognar] WORK-J0533: coordinated OpenRewrite bump to plugin 6.46.1 and rewrite-java 8.90.4, and disable keep-alive on the MCP elicitation IT client to avoid the stale-socket CI flake.
------------------------------------------
Started by an SCM change
Running as SYSTEM
[EnvInject] - Loading node environment variables.
Building remotely on builds33 (ubuntu) in workspace <https://ci-builds.apache.org/job/Juneau/job/Juneau-Java-17/ws/>
The recommended git tool is: NONE
No credentials specified
> git rev-parse --resolve-git-dir <https://ci-builds.apache.org/job/Juneau/job/Juneau-Java-17/ws/.git> # timeout=10
Fetching changes from the remote Git repository
> git config remote.origin.url https://github.com/apache/juneau.git # timeout=10
Fetching upstream changes from https://github.com/apache/juneau.git
> git --version # timeout=10
> git --version # 'git version 2.34.1'
> git fetch --tags --force --progress -- https://github.com/apache/juneau.git +refs/heads/*:refs/remotes/origin/* # timeout=10
> git rev-parse refs/remotes/origin/master^{commit} # timeout=10
Checking out Revision 7bb3a545dbb01c8e2635053247fe45116b8ecb05 (refs/remotes/origin/master)
> git config core.sparsecheckout # timeout=10
> git checkout -f 7bb3a545dbb01c8e2635053247fe45116b8ecb05 # timeout=10
Commit message: "WORK-J0533: coordinated OpenRewrite bump to plugin 6.46.1 and rewrite-java 8.90.4, and disable keep-alive on the MCP elicitation IT client to avoid the stale-socket CI flake."
> git rev-list --no-walk cccf7f1bc401078a864a4978851e6cbc02e13feb # timeout=10
[Juneau-Java-17] $ mvn clean install deploy javadoc:aggregate
FATAL: command execution failed
java.io.IOException: error=2, No such file or directory
at java.base/java.lang.ProcessImpl.forkAndExec(Native Method)
at java.base/java.lang.ProcessImpl.<init>(ProcessImpl.java:314)
at java.base/java.lang.ProcessImpl.start(ProcessImpl.java:244)
at java.base/java.lang.ProcessBuilder.start(ProcessBuilder.java:1110)
Also: hudson.remoting.Channel$CallSiteStackTrace: Remote call to builds33
at hudson.remoting.Channel.attachCallSiteStackTrace(Channel.java:1923)
at hudson.remoting.UserRequest$ExceptionResponse.retrieve(UserRequest.java:384)
at hudson.remoting.Channel.call(Channel.java:1112)
at hudson.Launcher$RemoteLauncher.launch(Launcher.java:1121)
at hudson.Launcher$ProcStarter.start(Launcher.java:506)
at hudson.Launcher$ProcStarter.join(Launcher.java:517)
at hudson.tasks.Maven.perform(Maven.java:368)
at hudson.tasks.BuildStepMonitor$1.perform(BuildStepMonitor.java:20)
at hudson.model.AbstractBuild$AbstractBuildExecution.perform(AbstractBuild.java:818)
at hudson.model.Build$BuildExecution.build(Build.java:199)
at hudson.model.Build$BuildExecution.doRun(Build.java:164)
at hudson.model.AbstractBuild$AbstractBuildExecution.run(AbstractBuild.java:527)
at hudson.model.Run.execute(Run.java:1833)
at hudson.model.FreeStyleBuild.run(FreeStyleBuild.java:44)
at hudson.model.ResourceController.execute(ResourceController.java:101)
at hudson.model.Executor.run(Executor.java:446)
Caused: java.io.IOException: Cannot run program "mvn" (in directory "<https://ci-builds.apache.org/job/Juneau/job/Juneau-Java-17/ws/")>: error=2, No such file or directory
at java.base/java.lang.ProcessBuilder.start(ProcessBuilder.java:1143)
at java.base/java.lang.ProcessBuilder.start(ProcessBuilder.java:1073)
at hudson.Proc$LocalProc.<init>(Proc.java:252)
at hudson.Proc$LocalProc.<init>(Proc.java:221)
at hudson.Launcher$LocalLauncher.launch(Launcher.java:994)
at hudson.Launcher$ProcStarter.start(Launcher.java:506)
at hudson.Launcher$RemoteLaunchCallable.call(Launcher.java:1395)
at hudson.Launcher$RemoteLaunchCallable.call(Launcher.java:1337)
at hudson.remoting.UserRequest.perform(UserRequest.java:225)
at hudson.remoting.UserRequest.perform(UserRequest.java:50)
at hudson.remoting.Request$2.run(Request.java:391)
at hudson.remoting.InterceptingExecutorService.lambda$wrap$0(InterceptingExecutorService.java:81)
at java.base/java.util.concurrent.FutureTask.run(FutureTask.java:264)
at java.base/java.util.concurrent.ThreadPoolExecutor.runWorker(ThreadPoolExecutor.java:1136)
at java.base/java.util.concurrent.ThreadPoolExecutor$Worker.run(ThreadPoolExecutor.java:635)
at java.base/java.lang.Thread.run(Thread.java:840)
Build step 'Invoke top-level Maven targets' marked build as failure
Recording test results
ERROR: Step ‘Publish JUnit test result report’ failed: No test report files were found. Configuration error?
Build failed in Jenkins: Juneau » Juneau-Java-17 #2700
Posted by Apache Jenkins Server <je...@builds.apache.org>.
See <https://ci-builds.apache.org/job/Juneau/job/Juneau-Java-17/2700/display/redirect?page=changes>
Changes:
[github] build(deps): bump com.squareup.okhttp3:okhttp-jvm from 5.3.2 to 5.5.0
[github] build(deps): bump org.apache.tomcat.embed:tomcat-embed-core
[github] build(deps-dev): bump com.nimbusds:oauth2-oidc-sdk
[github] build(deps): bump opentelemetry.version from 1.63.0 to 1.65.0
[github] build(deps): bump actions/setup-java from 5.7.0 to 6.0.0
[github] build(deps): bump github/codeql-action/init from 4.37.6 to 4.37.9
[github] build(deps): bump github/codeql-action/analyze from 4.37.6 to 4.37.9
------------------------------------------
Started by an SCM change
Running as SYSTEM
[EnvInject] - Loading node environment variables.
Building remotely on builds58 (ubuntu ubuntu-avx) in workspace <https://ci-builds.apache.org/job/Juneau/job/Juneau-Java-17/ws/>
The recommended git tool is: NONE
No credentials specified
> git rev-parse --resolve-git-dir <https://ci-builds.apache.org/job/Juneau/job/Juneau-Java-17/ws/.git> # timeout=10
Fetching changes from the remote Git repository
> git config remote.origin.url https://github.com/apache/juneau.git # timeout=10
Fetching upstream changes from https://github.com/apache/juneau.git
> git --version # timeout=10
> git --version # 'git version 2.34.1'
> git fetch --tags --force --progress -- https://github.com/apache/juneau.git +refs/heads/*:refs/remotes/origin/* # timeout=10
> git rev-parse refs/remotes/origin/master^{commit} # timeout=10
Checking out Revision cccf7f1bc401078a864a4978851e6cbc02e13feb (refs/remotes/origin/master)
> git config core.sparsecheckout # timeout=10
> git checkout -f cccf7f1bc401078a864a4978851e6cbc02e13feb # timeout=10
Commit message: "Merge pull request #395 from dependabot/github_actions/github/codeql-action/analyze-4.37.9"
> git rev-list --no-walk 669c2e678dbbcd75cb3d8437664d29028c7334fe # timeout=10
[Juneau-Java-17] $ mvn clean install deploy javadoc:aggregate
FATAL: command execution failed
java.io.IOException: error=2, No such file or directory
at java.base/java.lang.ProcessImpl.forkAndExec(Native Method)
at java.base/java.lang.ProcessImpl.<init>(ProcessImpl.java:314)
at java.base/java.lang.ProcessImpl.start(ProcessImpl.java:244)
at java.base/java.lang.ProcessBuilder.start(ProcessBuilder.java:1110)
Also: hudson.remoting.Channel$CallSiteStackTrace: Remote call to builds58
at hudson.remoting.Channel.attachCallSiteStackTrace(Channel.java:1923)
at hudson.remoting.UserRequest$ExceptionResponse.retrieve(UserRequest.java:384)
at hudson.remoting.Channel.call(Channel.java:1112)
at hudson.Launcher$RemoteLauncher.launch(Launcher.java:1121)
at hudson.Launcher$ProcStarter.start(Launcher.java:506)
at hudson.Launcher$ProcStarter.join(Launcher.java:517)
at hudson.tasks.Maven.perform(Maven.java:368)
at hudson.tasks.BuildStepMonitor$1.perform(BuildStepMonitor.java:20)
at hudson.model.AbstractBuild$AbstractBuildExecution.perform(AbstractBuild.java:818)
at hudson.model.Build$BuildExecution.build(Build.java:199)
at hudson.model.Build$BuildExecution.doRun(Build.java:164)
at hudson.model.AbstractBuild$AbstractBuildExecution.run(AbstractBuild.java:527)
at hudson.model.Run.execute(Run.java:1833)
at hudson.model.FreeStyleBuild.run(FreeStyleBuild.java:44)
at hudson.model.ResourceController.execute(ResourceController.java:101)
at hudson.model.Executor.run(Executor.java:446)
Caused: java.io.IOException: Cannot run program "mvn" (in directory "<https://ci-builds.apache.org/job/Juneau/job/Juneau-Java-17/ws/")>: error=2, No such file or directory
at java.base/java.lang.ProcessBuilder.start(ProcessBuilder.java:1143)
at java.base/java.lang.ProcessBuilder.start(ProcessBuilder.java:1073)
at hudson.Proc$LocalProc.<init>(Proc.java:252)
at hudson.Proc$LocalProc.<init>(Proc.java:221)
at hudson.Launcher$LocalLauncher.launch(Launcher.java:994)
at hudson.Launcher$ProcStarter.start(Launcher.java:506)
at hudson.Launcher$RemoteLaunchCallable.call(Launcher.java:1395)
at hudson.Launcher$RemoteLaunchCallable.call(Launcher.java:1337)
at hudson.remoting.UserRequest.perform(UserRequest.java:225)
at hudson.remoting.UserRequest.perform(UserRequest.java:50)
at hudson.remoting.Request$2.run(Request.java:391)
at hudson.remoting.InterceptingExecutorService.lambda$wrap$0(InterceptingExecutorService.java:81)
at java.base/java.util.concurrent.FutureTask.run(FutureTask.java:264)
at java.base/java.util.concurrent.ThreadPoolExecutor.runWorker(ThreadPoolExecutor.java:1136)
at java.base/java.util.concurrent.ThreadPoolExecutor$Worker.run(ThreadPoolExecutor.java:635)
at java.base/java.lang.Thread.run(Thread.java:840)
Build step 'Invoke top-level Maven targets' marked build as failure
Recording test results
[Checks API] No suitable checks publisher found.
Re: Build failed in Jenkins: Juneau » Juneau-Java-17 #2699
Posted by James Bognar <ja...@apache.org>.
FYI...this looks like maven is missing from the environment. I've opened
an infra ticket for it.
On Sun, Sep 13, 2026 at 9:10 AM Apache Jenkins Server <
jenkins@builds.apache.org> wrote:
> See <
> https://ci-builds.apache.org/job/Juneau/job/Juneau-Java-17/2699/display/redirect?page=changes
> >
>
> Changes:
>
> [James Bognar] Register a stub SlotDetailChevron populator so the JS
> harness CI does not fail on an unregistered 'p' name, and restore SAML
> reject-at-parse after the Commons Secure XML merge dropped
> disallow-doctype-decl.
>
>
> ------------------------------------------
> Started by an SCM change
> Running as SYSTEM
> [EnvInject] - Loading node environment variables.
> Building remotely on builds58 (ubuntu ubuntu-avx) in workspace <
> https://ci-builds.apache.org/job/Juneau/job/Juneau-Java-17/ws/>
> The recommended git tool is: NONE
> No credentials specified
> > git rev-parse --resolve-git-dir <
> https://ci-builds.apache.org/job/Juneau/job/Juneau-Java-17/ws/.git> #
> timeout=10
> Fetching changes from the remote Git repository
> > git config remote.origin.url https://github.com/apache/juneau.git #
> timeout=10
> Fetching upstream changes from https://github.com/apache/juneau.git
> > git --version # timeout=10
> > git --version # 'git version 2.34.1'
> > git fetch --tags --force --progress --
> https://github.com/apache/juneau.git +refs/heads/*:refs/remotes/origin/*
> # timeout=10
> > git rev-parse refs/remotes/origin/master^{commit} # timeout=10
> Checking out Revision 669c2e678dbbcd75cb3d8437664d29028c7334fe
> (refs/remotes/origin/master)
> > git config core.sparsecheckout # timeout=10
> > git checkout -f 669c2e678dbbcd75cb3d8437664d29028c7334fe # timeout=10
> Commit message: "Register a stub SlotDetailChevron populator so the JS
> harness CI does not fail on an unregistered 'p' name, and restore SAML
> reject-at-parse after the Commons Secure XML merge dropped
> disallow-doctype-decl."
> > git rev-list --no-walk 6a556c55819f082646c9fe930cc984d86ec11edf #
> timeout=10
> [Juneau-Java-17] $ mvn clean install deploy javadoc:aggregate
> FATAL: command execution failed
> java.io.IOException: error=2, No such file or directory
> at java.base/java.lang.ProcessImpl.forkAndExec(Native Method)
> at java.base/java.lang.ProcessImpl.<init>(ProcessImpl.java:314)
> at java.base/java.lang.ProcessImpl.start(ProcessImpl.java:244)
> at
> java.base/java.lang.ProcessBuilder.start(ProcessBuilder.java:1110)
> Also: hudson.remoting.Channel$CallSiteStackTrace: Remote call to builds58
> at
> hudson.remoting.Channel.attachCallSiteStackTrace(Channel.java:1923)
> at
> hudson.remoting.UserRequest$ExceptionResponse.retrieve(UserRequest.java:384)
> at hudson.remoting.Channel.call(Channel.java:1112)
> at
> hudson.Launcher$RemoteLauncher.launch(Launcher.java:1121)
> at hudson.Launcher$ProcStarter.start(Launcher.java:506)
> at hudson.Launcher$ProcStarter.join(Launcher.java:517)
> at hudson.tasks.Maven.perform(Maven.java:368)
> at
> hudson.tasks.BuildStepMonitor$1.perform(BuildStepMonitor.java:20)
> at
> hudson.model.AbstractBuild$AbstractBuildExecution.perform(AbstractBuild.java:818)
> at hudson.model.Build$BuildExecution.build(Build.java:199)
> at hudson.model.Build$BuildExecution.doRun(Build.java:164)
> at
> hudson.model.AbstractBuild$AbstractBuildExecution.run(AbstractBuild.java:527)
> at hudson.model.Run.execute(Run.java:1833)
> at hudson.model.FreeStyleBuild.run(FreeStyleBuild.java:44)
> at
> hudson.model.ResourceController.execute(ResourceController.java:101)
> at hudson.model.Executor.run(Executor.java:446)
> Caused: java.io.IOException: Cannot run program "mvn" (in directory "<
> https://ci-builds.apache.org/job/Juneau/job/Juneau-Java-17/ws/")>:
> error=2, No such file or directory
> at
> java.base/java.lang.ProcessBuilder.start(ProcessBuilder.java:1143)
> at
> java.base/java.lang.ProcessBuilder.start(ProcessBuilder.java:1073)
> at hudson.Proc$LocalProc.<init>(Proc.java:252)
> at hudson.Proc$LocalProc.<init>(Proc.java:221)
> at hudson.Launcher$LocalLauncher.launch(Launcher.java:994)
> at hudson.Launcher$ProcStarter.start(Launcher.java:506)
> at hudson.Launcher$RemoteLaunchCallable.call(Launcher.java:1395)
> at hudson.Launcher$RemoteLaunchCallable.call(Launcher.java:1337)
> at hudson.remoting.UserRequest.perform(UserRequest.java:225)
> at hudson.remoting.UserRequest.perform(UserRequest.java:50)
> at hudson.remoting.Request$2.run(Request.java:391)
> at
> hudson.remoting.InterceptingExecutorService.lambda$wrap$0(InterceptingExecutorService.java:81)
> at
> java.base/java.util.concurrent.FutureTask.run(FutureTask.java:264)
> at
> java.base/java.util.concurrent.ThreadPoolExecutor.runWorker(ThreadPoolExecutor.java:1136)
> at
> java.base/java.util.concurrent.ThreadPoolExecutor$Worker.run(ThreadPoolExecutor.java:635)
> at java.base/java.lang.Thread.run(Thread.java:840)
> Build step 'Invoke top-level Maven targets' marked build as failure
> Recording test results
> [Checks API] No suitable checks publisher found.
>
Build failed in Jenkins: Juneau » Juneau-Java-17 #2699
Posted by Apache Jenkins Server <je...@builds.apache.org>.
See <https://ci-builds.apache.org/job/Juneau/job/Juneau-Java-17/2699/display/redirect?page=changes>
Changes:
[James Bognar] Register a stub SlotDetailChevron populator so the JS harness CI does not fail on an unregistered 'p' name, and restore SAML reject-at-parse after the Commons Secure XML merge dropped disallow-doctype-decl.
------------------------------------------
Started by an SCM change
Running as SYSTEM
[EnvInject] - Loading node environment variables.
Building remotely on builds58 (ubuntu ubuntu-avx) in workspace <https://ci-builds.apache.org/job/Juneau/job/Juneau-Java-17/ws/>
The recommended git tool is: NONE
No credentials specified
> git rev-parse --resolve-git-dir <https://ci-builds.apache.org/job/Juneau/job/Juneau-Java-17/ws/.git> # timeout=10
Fetching changes from the remote Git repository
> git config remote.origin.url https://github.com/apache/juneau.git # timeout=10
Fetching upstream changes from https://github.com/apache/juneau.git
> git --version # timeout=10
> git --version # 'git version 2.34.1'
> git fetch --tags --force --progress -- https://github.com/apache/juneau.git +refs/heads/*:refs/remotes/origin/* # timeout=10
> git rev-parse refs/remotes/origin/master^{commit} # timeout=10
Checking out Revision 669c2e678dbbcd75cb3d8437664d29028c7334fe (refs/remotes/origin/master)
> git config core.sparsecheckout # timeout=10
> git checkout -f 669c2e678dbbcd75cb3d8437664d29028c7334fe # timeout=10
Commit message: "Register a stub SlotDetailChevron populator so the JS harness CI does not fail on an unregistered 'p' name, and restore SAML reject-at-parse after the Commons Secure XML merge dropped disallow-doctype-decl."
> git rev-list --no-walk 6a556c55819f082646c9fe930cc984d86ec11edf # timeout=10
[Juneau-Java-17] $ mvn clean install deploy javadoc:aggregate
FATAL: command execution failed
java.io.IOException: error=2, No such file or directory
at java.base/java.lang.ProcessImpl.forkAndExec(Native Method)
at java.base/java.lang.ProcessImpl.<init>(ProcessImpl.java:314)
at java.base/java.lang.ProcessImpl.start(ProcessImpl.java:244)
at java.base/java.lang.ProcessBuilder.start(ProcessBuilder.java:1110)
Also: hudson.remoting.Channel$CallSiteStackTrace: Remote call to builds58
at hudson.remoting.Channel.attachCallSiteStackTrace(Channel.java:1923)
at hudson.remoting.UserRequest$ExceptionResponse.retrieve(UserRequest.java:384)
at hudson.remoting.Channel.call(Channel.java:1112)
at hudson.Launcher$RemoteLauncher.launch(Launcher.java:1121)
at hudson.Launcher$ProcStarter.start(Launcher.java:506)
at hudson.Launcher$ProcStarter.join(Launcher.java:517)
at hudson.tasks.Maven.perform(Maven.java:368)
at hudson.tasks.BuildStepMonitor$1.perform(BuildStepMonitor.java:20)
at hudson.model.AbstractBuild$AbstractBuildExecution.perform(AbstractBuild.java:818)
at hudson.model.Build$BuildExecution.build(Build.java:199)
at hudson.model.Build$BuildExecution.doRun(Build.java:164)
at hudson.model.AbstractBuild$AbstractBuildExecution.run(AbstractBuild.java:527)
at hudson.model.Run.execute(Run.java:1833)
at hudson.model.FreeStyleBuild.run(FreeStyleBuild.java:44)
at hudson.model.ResourceController.execute(ResourceController.java:101)
at hudson.model.Executor.run(Executor.java:446)
Caused: java.io.IOException: Cannot run program "mvn" (in directory "<https://ci-builds.apache.org/job/Juneau/job/Juneau-Java-17/ws/")>: error=2, No such file or directory
at java.base/java.lang.ProcessBuilder.start(ProcessBuilder.java:1143)
at java.base/java.lang.ProcessBuilder.start(ProcessBuilder.java:1073)
at hudson.Proc$LocalProc.<init>(Proc.java:252)
at hudson.Proc$LocalProc.<init>(Proc.java:221)
at hudson.Launcher$LocalLauncher.launch(Launcher.java:994)
at hudson.Launcher$ProcStarter.start(Launcher.java:506)
at hudson.Launcher$RemoteLaunchCallable.call(Launcher.java:1395)
at hudson.Launcher$RemoteLaunchCallable.call(Launcher.java:1337)
at hudson.remoting.UserRequest.perform(UserRequest.java:225)
at hudson.remoting.UserRequest.perform(UserRequest.java:50)
at hudson.remoting.Request$2.run(Request.java:391)
at hudson.remoting.InterceptingExecutorService.lambda$wrap$0(InterceptingExecutorService.java:81)
at java.base/java.util.concurrent.FutureTask.run(FutureTask.java:264)
at java.base/java.util.concurrent.ThreadPoolExecutor.runWorker(ThreadPoolExecutor.java:1136)
at java.base/java.util.concurrent.ThreadPoolExecutor$Worker.run(ThreadPoolExecutor.java:635)
at java.base/java.lang.Thread.run(Thread.java:840)
Build step 'Invoke top-level Maven targets' marked build as failure
Recording test results
[Checks API] No suitable checks publisher found.
Build failed in Jenkins: Juneau » Juneau-Java-17 #2698
Posted by Apache Jenkins Server <je...@builds.apache.org>.
See <https://ci-builds.apache.org/job/Juneau/job/Juneau-Java-17/2698/display/redirect?page=changes>
Changes:
[garydgregory] Use Apache Commons Secure XML.
------------------------------------------
Started by an SCM change
Running as SYSTEM
[EnvInject] - Loading node environment variables.
Building remotely on builds33 (ubuntu) in workspace <https://ci-builds.apache.org/job/Juneau/job/Juneau-Java-17/ws/>
The recommended git tool is: NONE
No credentials specified
> git rev-parse --resolve-git-dir <https://ci-builds.apache.org/job/Juneau/job/Juneau-Java-17/ws/.git> # timeout=10
Fetching changes from the remote Git repository
> git config remote.origin.url https://github.com/apache/juneau.git # timeout=10
Fetching upstream changes from https://github.com/apache/juneau.git
> git --version # timeout=10
> git --version # 'git version 2.34.1'
> git fetch --tags --force --progress -- https://github.com/apache/juneau.git +refs/heads/*:refs/remotes/origin/* # timeout=10
> git rev-parse refs/remotes/origin/master^{commit} # timeout=10
Checking out Revision 6a556c55819f082646c9fe930cc984d86ec11edf (refs/remotes/origin/master)
> git config core.sparsecheckout # timeout=10
> git checkout -f 6a556c55819f082646c9fe930cc984d86ec11edf # timeout=10
Commit message: "Merge pull request #397 from garydgregory/feature/use_commons_secure_xml"
> git rev-list --no-walk cb56843d180a7e11d9bc8dd89f3ca19dc5befc18 # timeout=10
[Juneau-Java-17] $ mvn clean install deploy javadoc:aggregate
FATAL: command execution failed
java.io.IOException: error=2, No such file or directory
at java.base/java.lang.ProcessImpl.forkAndExec(Native Method)
at java.base/java.lang.ProcessImpl.<init>(ProcessImpl.java:314)
at java.base/java.lang.ProcessImpl.start(ProcessImpl.java:244)
at java.base/java.lang.ProcessBuilder.start(ProcessBuilder.java:1110)
Also: hudson.remoting.Channel$CallSiteStackTrace: Remote call to builds33
at hudson.remoting.Channel.attachCallSiteStackTrace(Channel.java:1923)
at hudson.remoting.UserRequest$ExceptionResponse.retrieve(UserRequest.java:384)
at hudson.remoting.Channel.call(Channel.java:1112)
at hudson.Launcher$RemoteLauncher.launch(Launcher.java:1121)
at hudson.Launcher$ProcStarter.start(Launcher.java:506)
at hudson.Launcher$ProcStarter.join(Launcher.java:517)
at hudson.tasks.Maven.perform(Maven.java:368)
at hudson.tasks.BuildStepMonitor$1.perform(BuildStepMonitor.java:20)
at hudson.model.AbstractBuild$AbstractBuildExecution.perform(AbstractBuild.java:818)
at hudson.model.Build$BuildExecution.build(Build.java:199)
at hudson.model.Build$BuildExecution.doRun(Build.java:164)
at hudson.model.AbstractBuild$AbstractBuildExecution.run(AbstractBuild.java:527)
at hudson.model.Run.execute(Run.java:1833)
at hudson.model.FreeStyleBuild.run(FreeStyleBuild.java:44)
at hudson.model.ResourceController.execute(ResourceController.java:101)
at hudson.model.Executor.run(Executor.java:446)
Caused: java.io.IOException: Cannot run program "mvn" (in directory "<https://ci-builds.apache.org/job/Juneau/job/Juneau-Java-17/ws/")>: error=2, No such file or directory
at java.base/java.lang.ProcessBuilder.start(ProcessBuilder.java:1143)
at java.base/java.lang.ProcessBuilder.start(ProcessBuilder.java:1073)
at hudson.Proc$LocalProc.<init>(Proc.java:252)
at hudson.Proc$LocalProc.<init>(Proc.java:221)
at hudson.Launcher$LocalLauncher.launch(Launcher.java:994)
at hudson.Launcher$ProcStarter.start(Launcher.java:506)
at hudson.Launcher$RemoteLaunchCallable.call(Launcher.java:1395)
at hudson.Launcher$RemoteLaunchCallable.call(Launcher.java:1337)
at hudson.remoting.UserRequest.perform(UserRequest.java:225)
at hudson.remoting.UserRequest.perform(UserRequest.java:50)
at hudson.remoting.Request$2.run(Request.java:391)
at hudson.remoting.InterceptingExecutorService.lambda$wrap$0(InterceptingExecutorService.java:81)
at java.base/java.util.concurrent.FutureTask.run(FutureTask.java:264)
at java.base/java.util.concurrent.ThreadPoolExecutor.runWorker(ThreadPoolExecutor.java:1136)
at java.base/java.util.concurrent.ThreadPoolExecutor$Worker.run(ThreadPoolExecutor.java:635)
at java.base/java.lang.Thread.run(Thread.java:840)
Build step 'Invoke top-level Maven targets' marked build as failure
Recording test results
ERROR: Step ‘Publish JUnit test result report’ failed: No test report files were found. Configuration error?