You are viewing a plain text version of this content. The canonical link for it is here.
Posted to dev@geronimo.apache.org by ga...@apache.org on 2008/11/15 05:10:44 UTC
[BUILD] trunk: Failed for Revision: 714213
Geronimo Revision: 714213 built with tests included
See the full build-2100.log file at http://people.apache.org/builds/geronimo/server/binaries/trunk/20081114/build-2100.log
Download the binaries from http://people.apache.org/builds/geronimo/server/binaries/trunk/20081114
[INFO] BUILD SUCCESSFUL
[INFO] ------------------------------------------------------------------------
[INFO] Total time: 38 minutes 42 seconds
[INFO] Finished at: Fri Nov 14 21:43:17 EST 2008
[INFO] Final Memory: 388M/1013M
[INFO] ------------------------------------------------------------------------
TESTSUITE RESULTS (Failures only)
=================================
See detailed results at http://people.apache.org/builds/geronimo/server/testsuite/ResultsSummary.html
Assembly: tomcat
=================================
See the full test.log file at http://people.apache.org/builds/geronimo/server/binaries/trunk/20081114/logs-2100-tomcat/test.log
[INFO] [geronimo:start-server {execution: start}]
[INFO] Using assembly configuration: tomcat
[INFO] snapshot org.apache.geronimo.assemblies:geronimo-tomcat6-javaee5:2.2-SNAPSHOT: checking for updates from apache-snapshots
[INFO] snapshot org.apache.geronimo.assemblies:geronimo-tomcat6-javaee5:2.2-SNAPSHOT: checking for updates from codehaus-snapshots
[INFO] snapshot org.apache.geronimo.assemblies:geronimo-tomcat6-javaee5:2.2-SNAPSHOT: checking for updates from apache.snapshots
[INFO] Using assembly artifact: org.apache.geronimo.assemblies:geronimo-tomcat6-javaee5:zip:bin:2.2-SNAPSHOT:provided
[INFO] Using geronimoHome: /home/geronimo/geronimo/trunk/testsuite/target/geronimo-tomcat6-javaee5-2.2-SNAPSHOT
[INFO] Installing assembly...
[INFO] Expanding: /home/geronimo/.m2/repository/org/apache/geronimo/assemblies/geronimo-tomcat6-javaee5/2.2-SNAPSHOT/geronimo-tomcat6-javaee5-2.2-SNAPSHOT-bin.zip into /home/geronimo/geronimo/trunk/testsuite/target
[INFO] Starting Geronimo server...
[INFO] Selected option set: default
[INFO] Redirecting output to: /home/geronimo/geronimo/trunk/testsuite/target/geronimo-logs/org.apache.geronimo.mavenplugins.geronimo.server.StartServerMojo.log
[INFO] Waiting for Geronimo server...
[INFO] Geronimo server started in 0:00:44.579
[INFO] [shitty:install {execution: default}]
[INFO] Installing /home/geronimo/geronimo/trunk/testsuite/pom.xml to /home/geronimo/.m2/repository/org/apache/geronimo/testsuite/testsuite/2.2-SNAPSHOT/testsuite-2.2-SNAPSHOT.pom
[INFO] [shitty:test {execution: default}]
[INFO] Starting 33 test build(s)
[INFO]
[INFO] -------------------------------------------------------------------------------
[INFO]
[INFO] commands-testsuite/deploy RUNNING
[INFO] commands-testsuite/deploy SUCCESS (0:01:16.683)
[INFO] commands-testsuite/gshell RUNNING
[INFO] commands-testsuite/gshell SUCCESS (0:00:29.235)
[INFO] commands-testsuite/jaxws RUNNING
[INFO] commands-testsuite/jaxws SUCCESS (0:00:19.594)
[INFO] commands-testsuite/shutdown RUNNING
[INFO] commands-testsuite/shutdown SUCCESS (0:00:16.184)
[INFO] concurrent-testsuite/concurrent-basic RUNNING
[INFO] concurrent-testsuite/concurrent-basic SUCCESS (0:06:18.367)
[INFO] console-testsuite/advanced RUNNING
[INFO] console-testsuite/advanced SUCCESS (0:01:36.726)
[INFO] console-testsuite/basic RUNNING
[INFO] console-testsuite/basic SUCCESS (0:01:44.476)
[INFO] corba-testsuite/corba-helloworld RUNNING
[INFO] corba-testsuite/corba-helloworld SUCCESS (0:00:44.905)
[INFO] corba-testsuite/corba-marshal RUNNING
[INFO] corba-testsuite/corba-marshal SUCCESS (0:00:55.264)
[INFO] corba-testsuite/corba-mytime RUNNING
[INFO] corba-testsuite/corba-mytime SUCCESS (0:00:45.853)
[INFO] deployment-testsuite/deployment-tests RUNNING
[INFO] deployment-testsuite/deployment-tests SUCCESS (0:00:30.787)
[INFO] deployment-testsuite/jca-cms-tests RUNNING
[INFO] deployment-testsuite/jca-cms-tests SUCCESS (0:00:27.111)
[INFO] deployment-testsuite/manifestcp-tests RUNNING
[INFO] deployment-testsuite/manifestcp-tests SUCCESS (0:00:29.025)
[INFO] enterprise-testsuite/ejb-tests RUNNING
[INFO] enterprise-testsuite/ejb-tests SUCCESS (0:00:47.517)
[INFO] enterprise-testsuite/jms-tests RUNNING
[INFO] enterprise-testsuite/jms-tests SUCCESS (0:00:47.860)
[INFO] enterprise-testsuite/jpa-tests RUNNING
[INFO] enterprise-testsuite/jpa-tests SUCCESS (0:00:51.995)
[INFO] enterprise-testsuite/sec-client RUNNING
[INFO] enterprise-testsuite/sec-client SUCCESS (0:00:26.336)
[INFO] enterprise-testsuite/sec-tests RUNNING
[INFO] enterprise-testsuite/sec-tests SUCCESS (0:00:50.844)
[INFO] security-testsuite/test-security RUNNING
[INFO] security-testsuite/test-security SUCCESS (0:00:38.982)
[INFO] web-testsuite/test-2.1-jsps RUNNING
[INFO] web-testsuite/test-2.1-jsps FAILURE (0:00:25.733) Java returned: 1
[INFO] web-testsuite/test-2.5-servlets RUNNING
[INFO] web-testsuite/test-2.5-servlets SUCCESS (0:00:25.809)
[INFO] web-testsuite/test-myfaces RUNNING
[INFO] web-testsuite/test-myfaces FAILURE (0:00:23.817) Java returned: 1
[INFO] web-testsuite/test-tomcat RUNNING
[INFO] web-testsuite/test-tomcat SUCCESS (0:00:18.809)
[INFO] web-testsuite/test-web-forward RUNNING
[INFO] web-testsuite/test-web-forward SUCCESS (0:00:31.251)
[INFO] web-testsuite/test-web-references RUNNING
[INFO] web-testsuite/test-web-references SUCCESS (0:00:38.829)
[INFO] webservices-testsuite/jaxb-tests RUNNING
[INFO] webservices-testsuite/jaxb-tests SUCCESS (0:00:50.925)
[INFO] webservices-testsuite/jaxr-tests RUNNING
[INFO] webservices-testsuite/jaxr-tests SUCCESS (0:00:50.214)
[INFO] webservices-testsuite/jaxrpc-jaxws-tests RUNNING
[INFO] webservices-testsuite/jaxrpc-jaxws-tests SUCCESS (0:00:31.427)
[INFO] webservices-testsuite/jaxrpc-tests RUNNING
[INFO] webservices-testsuite/jaxrpc-tests SUCCESS (0:00:37.668)
[INFO] webservices-testsuite/jaxws-tests RUNNING
[INFO] webservices-testsuite/jaxws-tests SUCCESS (0:01:35.876)
[INFO] webservices-testsuite/jaxws-wsa-tests RUNNING
[INFO] webservices-testsuite/jaxws-wsa-tests FAILURE (0:00:34.226) Java returned: 1
[INFO] webservices-testsuite/saaj-tests RUNNING
[INFO] webservices-testsuite/saaj-tests SUCCESS (0:00:37.449)
[INFO] webservices-testsuite/stax-tests RUNNING
[INFO] webservices-testsuite/stax-tests SUCCESS (0:00:51.155)
[INFO]
[INFO] -------------------------------------------------------------------------------
[INFO] Test Summary (0:29:31.125)
[INFO] Passed: 30
[INFO] Failed: 3
[INFO] -------------------------------------------------------------------------------
[INFO]
[INFO] The following tests failed:
[INFO] * web-testsuite/test-2.1-jsps - /home/geronimo/geronimo/trunk/testsuite/web-testsuite/test-2.1-jsps/build.log
[INFO] * web-testsuite/test-myfaces - /home/geronimo/geronimo/trunk/testsuite/web-testsuite/test-myfaces/build.log
[INFO] * webservices-testsuite/jaxws-wsa-tests - /home/geronimo/geronimo/trunk/testsuite/webservices-testsuite/jaxws-wsa-tests/build.log
[INFO]
[INFO] ------------------------------------------------------------------------
[ERROR] BUILD ERROR
Assembly: jetty
=================================
See the full test.log file at http://people.apache.org/builds/geronimo/server/binaries/trunk/20081114/logs-2100-jetty/test.log
[INFO] [geronimo:start-server {execution: start}]
[INFO] Using assembly configuration: jetty
[INFO] snapshot org.apache.geronimo.assemblies:geronimo-jetty6-javaee5:2.2-SNAPSHOT: checking for updates from apache-snapshots
[INFO] snapshot org.apache.geronimo.assemblies:geronimo-jetty6-javaee5:2.2-SNAPSHOT: checking for updates from codehaus-snapshots
[INFO] snapshot org.apache.geronimo.assemblies:geronimo-jetty6-javaee5:2.2-SNAPSHOT: checking for updates from apache.snapshots
[INFO] Using assembly artifact: org.apache.geronimo.assemblies:geronimo-jetty6-javaee5:zip:bin:2.2-SNAPSHOT:provided
[INFO] Using geronimoHome: /home/geronimo/geronimo/trunk/testsuite/target/geronimo-jetty6-javaee5-2.2-SNAPSHOT
[INFO] Installing assembly...
[INFO] Expanding: /home/geronimo/.m2/repository/org/apache/geronimo/assemblies/geronimo-jetty6-javaee5/2.2-SNAPSHOT/geronimo-jetty6-javaee5-2.2-SNAPSHOT-bin.zip into /home/geronimo/geronimo/trunk/testsuite/target
[INFO] Starting Geronimo server...
[INFO] Selected option set: default
[INFO] Redirecting output to: /home/geronimo/geronimo/trunk/testsuite/target/geronimo-logs/org.apache.geronimo.mavenplugins.geronimo.server.StartServerMojo.log
[INFO] Waiting for Geronimo server...
[INFO] Geronimo server started in 0:00:44.129
[INFO] [shitty:install {execution: default}]
[INFO] Installing /home/geronimo/geronimo/trunk/testsuite/pom.xml to /home/geronimo/.m2/repository/org/apache/geronimo/testsuite/testsuite/2.2-SNAPSHOT/testsuite-2.2-SNAPSHOT.pom
[INFO] [shitty:test {execution: default}]
[INFO] Starting 33 test build(s)
[INFO]
[INFO] -------------------------------------------------------------------------------
[INFO]
[INFO] commands-testsuite/deploy RUNNING
[INFO] commands-testsuite/deploy SUCCESS (0:01:08.034)
[INFO] commands-testsuite/gshell RUNNING
[INFO] commands-testsuite/gshell SUCCESS (0:00:29.384)
[INFO] commands-testsuite/jaxws RUNNING
[INFO] commands-testsuite/jaxws SUCCESS (0:00:19.686)
[INFO] commands-testsuite/shutdown RUNNING
[INFO] commands-testsuite/shutdown SUCCESS (0:00:15.751)
[INFO] concurrent-testsuite/concurrent-basic RUNNING
[INFO] concurrent-testsuite/concurrent-basic SUCCESS (0:06:10.221)
[INFO] console-testsuite/advanced RUNNING
[INFO] console-testsuite/advanced SUCCESS (0:01:39.705)
[INFO] console-testsuite/basic RUNNING
[INFO] console-testsuite/basic SUCCESS (0:01:50.355)
[INFO] corba-testsuite/corba-helloworld RUNNING
[INFO] corba-testsuite/corba-helloworld SUCCESS (0:00:47.451)
[INFO] corba-testsuite/corba-marshal RUNNING
[INFO] corba-testsuite/corba-marshal SUCCESS (0:00:52.418)
[INFO] corba-testsuite/corba-mytime RUNNING
[INFO] corba-testsuite/corba-mytime SUCCESS (0:00:47.125)
[INFO] deployment-testsuite/deployment-tests RUNNING
[INFO] deployment-testsuite/deployment-tests SUCCESS (0:00:30.830)
[INFO] deployment-testsuite/jca-cms-tests RUNNING
[INFO] deployment-testsuite/jca-cms-tests SUCCESS (0:00:27.942)
[INFO] deployment-testsuite/manifestcp-tests RUNNING
[INFO] deployment-testsuite/manifestcp-tests SUCCESS (0:00:30.026)
[INFO] enterprise-testsuite/ejb-tests RUNNING
[INFO] enterprise-testsuite/ejb-tests SUCCESS (0:00:35.129)
[INFO] enterprise-testsuite/jms-tests RUNNING
[INFO] enterprise-testsuite/jms-tests SUCCESS (0:00:49.586)
[INFO] enterprise-testsuite/jpa-tests RUNNING
[INFO] enterprise-testsuite/jpa-tests SUCCESS (0:00:39.583)
[INFO] enterprise-testsuite/sec-client RUNNING
[INFO] enterprise-testsuite/sec-client SUCCESS (0:00:27.594)
[INFO] enterprise-testsuite/sec-tests RUNNING
[INFO] enterprise-testsuite/sec-tests SUCCESS (0:00:50.684)
[INFO] security-testsuite/test-security RUNNING
[INFO] security-testsuite/test-security SUCCESS (0:00:39.537)
[INFO] web-testsuite/test-2.1-jsps RUNNING
[INFO] web-testsuite/test-2.1-jsps FAILURE (0:00:25.528) Java returned: 1
[INFO] web-testsuite/test-2.5-servlets RUNNING
[INFO] web-testsuite/test-2.5-servlets SUCCESS (0:00:26.037)
[INFO] web-testsuite/test-jetty RUNNING
[INFO] web-testsuite/test-jetty SUCCESS (0:00:20.131)
[INFO] web-testsuite/test-myfaces RUNNING
[INFO] web-testsuite/test-myfaces FAILURE (0:00:23.402) Java returned: 1
[INFO] web-testsuite/test-web-forward RUNNING
[INFO] web-testsuite/test-web-forward SUCCESS (0:00:32.059)
[INFO] web-testsuite/test-web-references RUNNING
[INFO] web-testsuite/test-web-references SUCCESS (0:00:38.476)
[INFO] webservices-testsuite/jaxb-tests RUNNING
[INFO] webservices-testsuite/jaxb-tests SUCCESS (0:00:54.708)
[INFO] webservices-testsuite/jaxr-tests RUNNING
[INFO] webservices-testsuite/jaxr-tests SUCCESS (0:00:50.804)
[INFO] webservices-testsuite/jaxrpc-jaxws-tests RUNNING
[INFO] webservices-testsuite/jaxrpc-jaxws-tests SUCCESS (0:00:27.448)
[INFO] webservices-testsuite/jaxrpc-tests RUNNING
[INFO] webservices-testsuite/jaxrpc-tests SUCCESS (0:00:39.604)
[INFO] webservices-testsuite/jaxws-tests RUNNING
[INFO] webservices-testsuite/jaxws-tests SUCCESS (0:01:23.447)
[INFO] webservices-testsuite/jaxws-wsa-tests RUNNING
[INFO] webservices-testsuite/jaxws-wsa-tests FAILURE (0:00:26.821) Java returned: 1
[INFO] webservices-testsuite/saaj-tests RUNNING
[INFO] webservices-testsuite/saaj-tests SUCCESS (0:00:37.999)
[INFO] webservices-testsuite/stax-tests RUNNING
[INFO] webservices-testsuite/stax-tests SUCCESS (0:00:52.424)
[INFO]
[INFO] -------------------------------------------------------------------------------
[INFO] Test Summary (0:28:50.135)
[INFO] Passed: 30
[INFO] Failed: 3
[INFO] -------------------------------------------------------------------------------
[INFO]
[INFO] The following tests failed:
[INFO] * web-testsuite/test-2.1-jsps - /home/geronimo/geronimo/trunk/testsuite/web-testsuite/test-2.1-jsps/build.log
[INFO] * web-testsuite/test-myfaces - /home/geronimo/geronimo/trunk/testsuite/web-testsuite/test-myfaces/build.log
[INFO] * webservices-testsuite/jaxws-wsa-tests - /home/geronimo/geronimo/trunk/testsuite/webservices-testsuite/jaxws-wsa-tests/build.log
[INFO]
[INFO] ------------------------------------------------------------------------
[ERROR] BUILD ERROR
Samples: trunk
=================================
Log: http://people.apache.org/builds/geronimo/server/binaries/trunk/20081114/samples-2100.log
Build status: OK