You are viewing a plain text version of this content. The canonical link for it is here.
Posted to dev@oozie.apache.org by Apache Jenkins Server <je...@builds.apache.org> on 2016/03/03 17:55:38 UTC
Build failed in Jenkins: oozie-trunk-precommit-build #2777
See <https://builds.apache.org/job/oozie-trunk-precommit-build/2777/>
------------------------------------------
[...truncated 8406 lines...]
[INFO]
[INFO] --- maven-compiler-plugin:2.3.2:testCompile (default-testCompile) @ oozie-tools ---
[INFO] Nothing to compile - all classes are up to date
[INFO]
[INFO] --- maven-surefire-plugin:2.12.2:test (default-test) @ oozie-tools ---
[INFO] Tests are skipped.
[INFO]
[INFO] --- maven-jar-plugin:2.3.1:jar (default-jar) @ oozie-tools ---
[INFO] Building jar: <https://builds.apache.org/job/oozie-trunk-precommit-build/ws/tools/target/oozie-tools-4.3.0-SNAPSHOT.jar>
[INFO]
[INFO] --- maven-site-plugin:2.0-beta-6:attach-descriptor (attach-descriptor) @ oozie-tools ---
[INFO]
[INFO] --- maven-assembly-plugin:2.2.1:single (default-cli) @ oozie-tools ---
[INFO] Reading assembly descriptor: ../src/main/assemblies/tools.xml
[WARNING] The following patterns were never triggered in this artifact exclusion filter:
o '*:*:pom:*'
[INFO] Copying files to <https://builds.apache.org/job/oozie-trunk-precommit-build/ws/tools/target/oozie-tools-4.3.0-SNAPSHOT-tools>
[WARNING] Assembly file: <https://builds.apache.org/job/oozie-trunk-precommit-build/ws/tools/target/oozie-tools-4.3.0-SNAPSHOT-tools> is not a regular file (it may be a directory). It cannot be attached to the project build for installation or deployment.
[INFO]
[INFO] ------------------------------------------------------------------------
[INFO] Building Apache Oozie MiniOozie 4.3.0-SNAPSHOT
[INFO] ------------------------------------------------------------------------
[INFO]
[INFO] --- maven-remote-resources-plugin:1.5:process (default) @ oozie-mini ---
[INFO]
[INFO] --- maven-resources-plugin:2.5:resources (default-resources) @ oozie-mini ---
[debug] execute contextualize
[INFO] Using 'UTF-8' encoding to copy filtered resources.
[INFO] skip non existing resourceDirectory <https://builds.apache.org/job/oozie-trunk-precommit-build/ws/minitest/src/main/resources>
[INFO] Copying 3 resources
[INFO]
[INFO] --- maven-compiler-plugin:2.3.2:compile (default-compile) @ oozie-mini ---
[INFO] No sources to compile
[INFO]
[INFO] --- maven-resources-plugin:2.5:testResources (default-testResources) @ oozie-mini ---
[debug] execute contextualize
[INFO] Using 'UTF-8' encoding to copy filtered resources.
[INFO] Copying 3 resources
[INFO] Copying 3 resources
[INFO]
[INFO] --- maven-compiler-plugin:2.3.2:testCompile (default-testCompile) @ oozie-mini ---
[INFO] Nothing to compile - all classes are up to date
[INFO]
[INFO] --- maven-surefire-plugin:2.12.2:test (default-test) @ oozie-mini ---
[INFO] Tests are skipped.
[INFO]
[INFO] --- maven-jar-plugin:2.3.1:jar (default-jar) @ oozie-mini ---
[INFO] Building jar: <https://builds.apache.org/job/oozie-trunk-precommit-build/ws/minitest/target/oozie-mini-4.3.0-SNAPSHOT.jar>
[INFO]
[INFO] --- maven-site-plugin:2.0-beta-6:attach-descriptor (attach-descriptor) @ oozie-mini ---
[INFO]
[INFO] --- maven-assembly-plugin:2.2.1:single (default-cli) @ oozie-mini ---
[INFO] Reading assembly descriptor: src/main/assemblies/empty.xml
[INFO]
[INFO] ------------------------------------------------------------------------
[INFO] Building Apache Oozie Distro 4.3.0-SNAPSHOT
[INFO] ------------------------------------------------------------------------
[INFO]
[INFO] --- maven-remote-resources-plugin:1.5:process (default) @ oozie-distro ---
[INFO]
[INFO] --- maven-resources-plugin:2.5:resources (default-resources) @ oozie-distro ---
[debug] execute contextualize
[INFO] Using 'UTF-8' encoding to copy filtered resources.
[INFO] skip non existing resourceDirectory <https://builds.apache.org/job/oozie-trunk-precommit-build/ws/distro/src/main/resources>
[INFO] Copying 3 resources
[INFO]
[INFO] --- maven-compiler-plugin:2.3.2:compile (default-compile) @ oozie-distro ---
[INFO] No sources to compile
[INFO]
[INFO] --- maven-resources-plugin:2.5:testResources (default-testResources) @ oozie-distro ---
[debug] execute contextualize
[INFO] Using 'UTF-8' encoding to copy filtered resources.
[INFO] skip non existing resourceDirectory <https://builds.apache.org/job/oozie-trunk-precommit-build/ws/distro/src/test/resources>
[INFO] Copying 3 resources
[INFO]
[INFO] --- maven-compiler-plugin:2.3.2:testCompile (default-testCompile) @ oozie-distro ---
[INFO] No sources to compile
[INFO]
[INFO] --- maven-surefire-plugin:2.12.2:test (default-test) @ oozie-distro ---
[INFO] Tests are skipped.
[INFO]
[INFO] --- maven-jar-plugin:2.3.1:jar (default-jar) @ oozie-distro ---
[INFO] Building jar: <https://builds.apache.org/job/oozie-trunk-precommit-build/ws/distro/target/oozie-distro-4.3.0-SNAPSHOT.jar>
[INFO]
[INFO] --- maven-site-plugin:2.0-beta-6:attach-descriptor (attach-descriptor) @ oozie-distro ---
[INFO]
[INFO] --- maven-antrun-plugin:1.6:run (default) @ oozie-distro ---
[INFO] Executing tasks
main:
[get] Getting: http://archive.apache.org/dist/tomcat/tomcat-6/v6.0.44/bin/apache-tomcat-6.0.44.tar.gz
[get] To: <https://builds.apache.org/job/oozie-trunk-precommit-build/ws/distro/downloads/tomcat-6.0.44.tar.gz>
........................................................................................................................................................................................................................................................................................................................................................................................................................................................................................................................................................................................................................................................................................................................................................
[mkdir] Created dir: <https://builds.apache.org/job/oozie-trunk-precommit-build/ws/distro/target/tomcat>
[gunzip] Expanding <https://builds.apache.org/job/oozie-trunk-precommit-build/ws/distro/downloads/tomcat-6.0.44.tar.gz> to <https://builds.apache.org/job/oozie-trunk-precommit-build/ws/distro/target/tomcat/tomcat-6.0.44.tar>
[untar] Expanding: <https://builds.apache.org/job/oozie-trunk-precommit-build/ws/distro/target/tomcat/tomcat-6.0.44.tar> into <https://builds.apache.org/job/oozie-trunk-precommit-build/ws/distro/target/tomcat>
[delete] Deleting directory <https://builds.apache.org/job/oozie-trunk-precommit-build/ws/distro/target/tomcat/oozie-server/webapps>
[mkdir] Created dir: <https://builds.apache.org/job/oozie-trunk-precommit-build/ws/distro/target/tomcat/oozie-server/webapps>
[delete] Deleting: <https://builds.apache.org/job/oozie-trunk-precommit-build/ws/distro/target/tomcat/oozie-server/conf/server.xml>
[copy] Copying 1 file to <https://builds.apache.org/job/oozie-trunk-precommit-build/ws/distro/target/tomcat/oozie-server/conf>
[copy] Copying 1 file to <https://builds.apache.org/job/oozie-trunk-precommit-build/ws/distro/target/tomcat/oozie-server/conf>
[mkdir] Created dir: <https://builds.apache.org/job/oozie-trunk-precommit-build/ws/distro/target/tomcat/oozie-server/conf/ssl>
[copy] Copying 1 file to <https://builds.apache.org/job/oozie-trunk-precommit-build/ws/distro/target/tomcat/oozie-server/conf/ssl>
[copy] Copying 1 file to <https://builds.apache.org/job/oozie-trunk-precommit-build/ws/distro/target/tomcat/oozie-server/conf/ssl>
[copy] Copying 1 file to <https://builds.apache.org/job/oozie-trunk-precommit-build/ws/distro/target/tomcat/oozie-server/conf/ssl>
[copy] Copying 3 files to <https://builds.apache.org/job/oozie-trunk-precommit-build/ws/distro/target/tomcat/oozie-server/webapps/ROOT>
[INFO] Executed tasks
[INFO]
[INFO] --- maven-assembly-plugin:2.2.1:single (default-cli) @ oozie-distro ---
[INFO] Reading assembly descriptor: ../src/main/assemblies/distro.xml
[INFO] Copying files to <https://builds.apache.org/job/oozie-trunk-precommit-build/ws/distro/target/oozie-4.3.0-SNAPSHOT-distro>
[WARNING] Assembly file: <https://builds.apache.org/job/oozie-trunk-precommit-build/ws/distro/target/oozie-4.3.0-SNAPSHOT-distro> is not a regular file (it may be a directory). It cannot be attached to the project build for installation or deployment.
[INFO] Building tar : <https://builds.apache.org/job/oozie-trunk-precommit-build/ws/distro/target/oozie-4.3.0-SNAPSHOT-distro.tar.gz>
[INFO]
[INFO] ------------------------------------------------------------------------
[INFO] Building Apache Oozie ZooKeeper Security Tests 4.3.0-SNAPSHOT
[INFO] ------------------------------------------------------------------------
[INFO]
[INFO] --- maven-remote-resources-plugin:1.5:process (default) @ oozie-zookeeper-security-tests ---
[INFO]
[INFO] --- maven-resources-plugin:2.5:resources (default-resources) @ oozie-zookeeper-security-tests ---
[debug] execute contextualize
[INFO] Using 'UTF-8' encoding to copy filtered resources.
[INFO] skip non existing resourceDirectory <https://builds.apache.org/job/oozie-trunk-precommit-build/ws/zookeeper-security-tests/src/main/resources>
[INFO] Copying 3 resources
[INFO]
[INFO] --- maven-compiler-plugin:2.3.2:compile (default-compile) @ oozie-zookeeper-security-tests ---
[INFO] No sources to compile
[INFO]
[INFO] --- maven-resources-plugin:2.5:testResources (default-testResources) @ oozie-zookeeper-security-tests ---
[debug] execute contextualize
[INFO] Using 'UTF-8' encoding to copy filtered resources.
[INFO] skip non existing resourceDirectory <https://builds.apache.org/job/oozie-trunk-precommit-build/ws/zookeeper-security-tests/src/test/resources>
[INFO] Copying 3 resources
[INFO]
[INFO] --- maven-compiler-plugin:2.3.2:testCompile (default-testCompile) @ oozie-zookeeper-security-tests ---
[INFO] Nothing to compile - all classes are up to date
[INFO]
[INFO] --- maven-surefire-plugin:2.12.2:test (default-test) @ oozie-zookeeper-security-tests ---
[INFO] Tests are skipped.
[INFO]
[INFO] --- maven-jar-plugin:2.3.1:jar (default-jar) @ oozie-zookeeper-security-tests ---
[INFO] Building jar: <https://builds.apache.org/job/oozie-trunk-precommit-build/ws/zookeeper-security-tests/target/oozie-zookeeper-security-tests-4.3.0-SNAPSHOT.jar>
[INFO]
[INFO] --- maven-site-plugin:2.0-beta-6:attach-descriptor (attach-descriptor) @ oozie-zookeeper-security-tests ---
[INFO]
[INFO] --- maven-assembly-plugin:2.2.1:single (default-cli) @ oozie-zookeeper-security-tests ---
[INFO] Reading assembly descriptor: src/main/assemblies/empty.xml
[INFO] ------------------------------------------------------------------------
[INFO] Reactor Summary:
[INFO]
[INFO] Apache Oozie Main ................................. SUCCESS [ 1.413 s]
[INFO] Apache Oozie Hadoop Utils ......................... SUCCESS [ 0.597 s]
[INFO] Apache Oozie Hadoop Distcp hadoop-1-4.3.0-SNAPSHOT SUCCESS [ 0.175 s]
[INFO] Apache Oozie Hadoop Auth hadoop-1-4.3.0-SNAPSHOT .. SUCCESS [ 0.186 s]
[INFO] Apache Oozie Hadoop Libs .......................... SUCCESS [ 0.023 s]
[INFO] Apache Oozie Client ............................... SUCCESS [ 25.638 s]
[INFO] Apache Oozie Share Lib Oozie ...................... SUCCESS [ 0.940 s]
[INFO] Apache Oozie Share Lib HCatalog ................... SUCCESS [ 1.105 s]
[INFO] Apache Oozie Share Lib Distcp ..................... SUCCESS [ 0.231 s]
[INFO] Apache Oozie Core ................................. SUCCESS [ 31.939 s]
[INFO] Apache Oozie Share Lib Streaming .................. SUCCESS [ 1.207 s]
[INFO] Apache Oozie Share Lib Pig ........................ SUCCESS [ 0.945 s]
[INFO] Apache Oozie Share Lib Hive ....................... SUCCESS [ 2.377 s]
[INFO] Apache Oozie Share Lib Hive 2 ..................... SUCCESS [ 1.778 s]
[INFO] Apache Oozie Share Lib Sqoop ...................... SUCCESS [ 0.408 s]
[INFO] Apache Oozie Examples ............................. SUCCESS [ 1.724 s]
[INFO] Apache Oozie Share Lib Spark ...................... SUCCESS [ 4.691 s]
[INFO] Apache Oozie Share Lib ............................ SUCCESS [ 16.934 s]
[INFO] Apache Oozie Docs ................................. SUCCESS [ 11.234 s]
[INFO] Apache Oozie WebApp ............................... SUCCESS [ 24.487 s]
[INFO] Apache Oozie Tools ................................ SUCCESS [ 0.504 s]
[INFO] Apache Oozie MiniOozie ............................ SUCCESS [ 0.213 s]
[INFO] Apache Oozie Distro ............................... SUCCESS [ 40.027 s]
[INFO] Apache Oozie ZooKeeper Security Tests ............. SUCCESS [ 1.642 s]
[INFO] ------------------------------------------------------------------------
[INFO] BUILD SUCCESS
[INFO] ------------------------------------------------------------------------
[INFO] Total time: 02:52 min
[INFO] Finished at: 2016-03-03T16:55:34+00:00
[INFO] Final Memory: 72M/989M
[INFO] ------------------------------------------------------------------------
Reports
Running test-patch task CLEAN
Running test-patch task RAW_PATCH_ANALYSIS
Running test-patch task RAT
Running test-patch task JAVADOC
Running test-patch task COMPILE
Running test-patch task BACKWARDS_COMPATIBILITY
Running test-patch task TESTS
Running test-patch task DISTRO
Testing JIRA OOZIE-2466
Cleaning local git workspace
----------------------------
+1 PATCH_APPLIES
+1 CLEAN
+1 RAW_PATCH_ANALYSIS
+1 the patch does not introduce any @author tags
+1 the patch does not introduce any tabs
+1 the patch does not introduce any trailing spaces
+1 the patch does not introduce any line longer than 132
+1 the patch does adds/modifies 1 testcase(s)
+1 RAT
+1 the patch does not seem to introduce new RAT warnings
+1 JAVADOC
+1 the patch does not seem to introduce new Javadoc warnings
+1 COMPILE
+1 HEAD compiles
+1 patch compiles
+1 the patch does not seem to introduce new javac warnings
+1 BACKWARDS_COMPATIBILITY
+1 the patch does not change any JPA Entity/Colum/Basic/Lob/Transient annotations
+1 the patch does not modify JPA files
-1 TESTS
Tests run: 1762
Tests failed: 2
Tests errors: 0
The patch failed the following testcases:
testForNoDuplicates(org.apache.oozie.event.TestEventGeneration)
testMessage_withMixedStatus(org.apache.oozie.command.coord.TestAbandonedCoordChecker)
+1 DISTRO
+1 distro tarball builds with the patch
----------------------------
-1 Overall result, please check the reported -1(s)
The full output of the test-patch run is available at
https://builds.apache.org/job/oozie-trunk-precommit-build/2777/
Adding comment to JIRA
Comment added.
test-patch exit code: 1
Build step 'Execute shell' marked build as failure
Archiving artifacts
Recording test results
Build failed in Jenkins: oozie-trunk-precommit-build #2788
Posted by Apache Jenkins Server <je...@builds.apache.org>.
See <https://builds.apache.org/job/oozie-trunk-precommit-build/2788/>
------------------------------------------
[...truncated 8412 lines...]
[INFO] --- maven-compiler-plugin:2.3.2:compile (default-compile) @ oozie-tools ---
[INFO] Nothing to compile - all classes are up to date
[INFO]
[INFO] --- maven-resources-plugin:2.5:testResources (default-testResources) @ oozie-tools ---
[debug] execute contextualize
[INFO] Using 'UTF-8' encoding to copy filtered resources.
[INFO] Copying 2 resources
[INFO] Copying 3 resources
[INFO]
[INFO] --- maven-compiler-plugin:2.3.2:testCompile (default-testCompile) @ oozie-tools ---
[INFO] Nothing to compile - all classes are up to date
[INFO]
[INFO] --- maven-surefire-plugin:2.12.2:test (default-test) @ oozie-tools ---
[INFO] Tests are skipped.
[INFO]
[INFO] --- maven-jar-plugin:2.3.1:jar (default-jar) @ oozie-tools ---
[INFO] Building jar: <https://builds.apache.org/job/oozie-trunk-precommit-build/ws/tools/target/oozie-tools-4.3.0-SNAPSHOT.jar>
[INFO]
[INFO] --- maven-site-plugin:2.0-beta-6:attach-descriptor (attach-descriptor) @ oozie-tools ---
[INFO]
[INFO] --- maven-assembly-plugin:2.2.1:single (default-cli) @ oozie-tools ---
[INFO] Reading assembly descriptor: ../src/main/assemblies/tools.xml
[WARNING] The following patterns were never triggered in this artifact exclusion filter:
o '*:*:pom:*'
[INFO] Copying files to <https://builds.apache.org/job/oozie-trunk-precommit-build/ws/tools/target/oozie-tools-4.3.0-SNAPSHOT-tools>
[WARNING] Assembly file: <https://builds.apache.org/job/oozie-trunk-precommit-build/ws/tools/target/oozie-tools-4.3.0-SNAPSHOT-tools> is not a regular file (it may be a directory). It cannot be attached to the project build for installation or deployment.
[INFO]
[INFO] ------------------------------------------------------------------------
[INFO] Building Apache Oozie MiniOozie 4.3.0-SNAPSHOT
[INFO] ------------------------------------------------------------------------
[INFO]
[INFO] --- maven-remote-resources-plugin:1.5:process (default) @ oozie-mini ---
[INFO]
[INFO] --- maven-resources-plugin:2.5:resources (default-resources) @ oozie-mini ---
[debug] execute contextualize
[INFO] Using 'UTF-8' encoding to copy filtered resources.
[INFO] skip non existing resourceDirectory <https://builds.apache.org/job/oozie-trunk-precommit-build/ws/minitest/src/main/resources>
[INFO] Copying 3 resources
[INFO]
[INFO] --- maven-compiler-plugin:2.3.2:compile (default-compile) @ oozie-mini ---
[INFO] No sources to compile
[INFO]
[INFO] --- maven-resources-plugin:2.5:testResources (default-testResources) @ oozie-mini ---
[debug] execute contextualize
[INFO] Using 'UTF-8' encoding to copy filtered resources.
[INFO] Copying 3 resources
[INFO] Copying 3 resources
[INFO]
[INFO] --- maven-compiler-plugin:2.3.2:testCompile (default-testCompile) @ oozie-mini ---
[INFO] Nothing to compile - all classes are up to date
[INFO]
[INFO] --- maven-surefire-plugin:2.12.2:test (default-test) @ oozie-mini ---
[INFO] Tests are skipped.
[INFO]
[INFO] --- maven-jar-plugin:2.3.1:jar (default-jar) @ oozie-mini ---
[INFO] Building jar: <https://builds.apache.org/job/oozie-trunk-precommit-build/ws/minitest/target/oozie-mini-4.3.0-SNAPSHOT.jar>
[INFO]
[INFO] --- maven-site-plugin:2.0-beta-6:attach-descriptor (attach-descriptor) @ oozie-mini ---
[INFO]
[INFO] --- maven-assembly-plugin:2.2.1:single (default-cli) @ oozie-mini ---
[INFO] Reading assembly descriptor: src/main/assemblies/empty.xml
[INFO]
[INFO] ------------------------------------------------------------------------
[INFO] Building Apache Oozie Distro 4.3.0-SNAPSHOT
[INFO] ------------------------------------------------------------------------
[INFO]
[INFO] --- maven-remote-resources-plugin:1.5:process (default) @ oozie-distro ---
[INFO]
[INFO] --- maven-resources-plugin:2.5:resources (default-resources) @ oozie-distro ---
[debug] execute contextualize
[INFO] Using 'UTF-8' encoding to copy filtered resources.
[INFO] skip non existing resourceDirectory <https://builds.apache.org/job/oozie-trunk-precommit-build/ws/distro/src/main/resources>
[INFO] Copying 3 resources
[INFO]
[INFO] --- maven-compiler-plugin:2.3.2:compile (default-compile) @ oozie-distro ---
[INFO] No sources to compile
[INFO]
[INFO] --- maven-resources-plugin:2.5:testResources (default-testResources) @ oozie-distro ---
[debug] execute contextualize
[INFO] Using 'UTF-8' encoding to copy filtered resources.
[INFO] skip non existing resourceDirectory <https://builds.apache.org/job/oozie-trunk-precommit-build/ws/distro/src/test/resources>
[INFO] Copying 3 resources
[INFO]
[INFO] --- maven-compiler-plugin:2.3.2:testCompile (default-testCompile) @ oozie-distro ---
[INFO] No sources to compile
[INFO]
[INFO] --- maven-surefire-plugin:2.12.2:test (default-test) @ oozie-distro ---
[INFO] Tests are skipped.
[INFO]
[INFO] --- maven-jar-plugin:2.3.1:jar (default-jar) @ oozie-distro ---
[INFO] Building jar: <https://builds.apache.org/job/oozie-trunk-precommit-build/ws/distro/target/oozie-distro-4.3.0-SNAPSHOT.jar>
[INFO]
[INFO] --- maven-site-plugin:2.0-beta-6:attach-descriptor (attach-descriptor) @ oozie-distro ---
[INFO]
[INFO] --- maven-antrun-plugin:1.6:run (default) @ oozie-distro ---
[INFO] Executing tasks
main:
[get] Getting: http://archive.apache.org/dist/tomcat/tomcat-6/v6.0.44/bin/apache-tomcat-6.0.44.tar.gz
[get] To: <https://builds.apache.org/job/oozie-trunk-precommit-build/ws/distro/downloads/tomcat-6.0.44.tar.gz>
...............................................................................................................................................................................................................................................................................................................................................................................................................................................................................................................................................................................................................................................................................................................................................................................................................
[mkdir] Created dir: <https://builds.apache.org/job/oozie-trunk-precommit-build/ws/distro/target/tomcat>
[gunzip] Expanding <https://builds.apache.org/job/oozie-trunk-precommit-build/ws/distro/downloads/tomcat-6.0.44.tar.gz> to <https://builds.apache.org/job/oozie-trunk-precommit-build/ws/distro/target/tomcat/tomcat-6.0.44.tar>
[untar] Expanding: <https://builds.apache.org/job/oozie-trunk-precommit-build/ws/distro/target/tomcat/tomcat-6.0.44.tar> into <https://builds.apache.org/job/oozie-trunk-precommit-build/ws/distro/target/tomcat>
[delete] Deleting directory <https://builds.apache.org/job/oozie-trunk-precommit-build/ws/distro/target/tomcat/oozie-server/webapps>
[mkdir] Created dir: <https://builds.apache.org/job/oozie-trunk-precommit-build/ws/distro/target/tomcat/oozie-server/webapps>
[delete] Deleting: <https://builds.apache.org/job/oozie-trunk-precommit-build/ws/distro/target/tomcat/oozie-server/conf/server.xml>
[copy] Copying 1 file to <https://builds.apache.org/job/oozie-trunk-precommit-build/ws/distro/target/tomcat/oozie-server/conf>
[copy] Copying 1 file to <https://builds.apache.org/job/oozie-trunk-precommit-build/ws/distro/target/tomcat/oozie-server/conf>
[mkdir] Created dir: <https://builds.apache.org/job/oozie-trunk-precommit-build/ws/distro/target/tomcat/oozie-server/conf/ssl>
[copy] Copying 1 file to <https://builds.apache.org/job/oozie-trunk-precommit-build/ws/distro/target/tomcat/oozie-server/conf/ssl>
[copy] Copying 1 file to <https://builds.apache.org/job/oozie-trunk-precommit-build/ws/distro/target/tomcat/oozie-server/conf/ssl>
[copy] Copying 1 file to <https://builds.apache.org/job/oozie-trunk-precommit-build/ws/distro/target/tomcat/oozie-server/conf/ssl>
[copy] Copying 3 files to <https://builds.apache.org/job/oozie-trunk-precommit-build/ws/distro/target/tomcat/oozie-server/webapps/ROOT>
[INFO] Executed tasks
[INFO]
[INFO] --- maven-assembly-plugin:2.2.1:single (default-cli) @ oozie-distro ---
[INFO] Reading assembly descriptor: ../src/main/assemblies/distro.xml
[INFO] Copying files to <https://builds.apache.org/job/oozie-trunk-precommit-build/ws/distro/target/oozie-4.3.0-SNAPSHOT-distro>
[WARNING] Assembly file: <https://builds.apache.org/job/oozie-trunk-precommit-build/ws/distro/target/oozie-4.3.0-SNAPSHOT-distro> is not a regular file (it may be a directory). It cannot be attached to the project build for installation or deployment.
[INFO] Building tar : <https://builds.apache.org/job/oozie-trunk-precommit-build/ws/distro/target/oozie-4.3.0-SNAPSHOT-distro.tar.gz>
[INFO]
[INFO] ------------------------------------------------------------------------
[INFO] Building Apache Oozie ZooKeeper Security Tests 4.3.0-SNAPSHOT
[INFO] ------------------------------------------------------------------------
[INFO]
[INFO] --- maven-remote-resources-plugin:1.5:process (default) @ oozie-zookeeper-security-tests ---
[INFO]
[INFO] --- maven-resources-plugin:2.5:resources (default-resources) @ oozie-zookeeper-security-tests ---
[debug] execute contextualize
[INFO] Using 'UTF-8' encoding to copy filtered resources.
[INFO] skip non existing resourceDirectory <https://builds.apache.org/job/oozie-trunk-precommit-build/ws/zookeeper-security-tests/src/main/resources>
[INFO] Copying 3 resources
[INFO]
[INFO] --- maven-compiler-plugin:2.3.2:compile (default-compile) @ oozie-zookeeper-security-tests ---
[INFO] No sources to compile
[INFO]
[INFO] --- maven-resources-plugin:2.5:testResources (default-testResources) @ oozie-zookeeper-security-tests ---
[debug] execute contextualize
[INFO] Using 'UTF-8' encoding to copy filtered resources.
[INFO] skip non existing resourceDirectory <https://builds.apache.org/job/oozie-trunk-precommit-build/ws/zookeeper-security-tests/src/test/resources>
[INFO] Copying 3 resources
[INFO]
[INFO] --- maven-compiler-plugin:2.3.2:testCompile (default-testCompile) @ oozie-zookeeper-security-tests ---
[INFO] Nothing to compile - all classes are up to date
[INFO]
[INFO] --- maven-surefire-plugin:2.12.2:test (default-test) @ oozie-zookeeper-security-tests ---
[INFO] Tests are skipped.
[INFO]
[INFO] --- maven-jar-plugin:2.3.1:jar (default-jar) @ oozie-zookeeper-security-tests ---
[INFO] Building jar: <https://builds.apache.org/job/oozie-trunk-precommit-build/ws/zookeeper-security-tests/target/oozie-zookeeper-security-tests-4.3.0-SNAPSHOT.jar>
[INFO]
[INFO] --- maven-site-plugin:2.0-beta-6:attach-descriptor (attach-descriptor) @ oozie-zookeeper-security-tests ---
[INFO]
[INFO] --- maven-assembly-plugin:2.2.1:single (default-cli) @ oozie-zookeeper-security-tests ---
[INFO] Reading assembly descriptor: src/main/assemblies/empty.xml
[INFO] ------------------------------------------------------------------------
[INFO] Reactor Summary:
[INFO]
[INFO] Apache Oozie Main ................................. SUCCESS [ 1.676 s]
[INFO] Apache Oozie Hadoop Utils ......................... SUCCESS [ 0.614 s]
[INFO] Apache Oozie Hadoop Distcp hadoop-1-4.3.0-SNAPSHOT SUCCESS [ 0.159 s]
[INFO] Apache Oozie Hadoop Auth hadoop-1-4.3.0-SNAPSHOT .. SUCCESS [ 0.170 s]
[INFO] Apache Oozie Hadoop Libs .......................... SUCCESS [ 0.023 s]
[INFO] Apache Oozie Client ............................... SUCCESS [ 27.176 s]
[INFO] Apache Oozie Share Lib Oozie ...................... SUCCESS [ 1.028 s]
[INFO] Apache Oozie Share Lib HCatalog ................... SUCCESS [ 1.366 s]
[INFO] Apache Oozie Share Lib Distcp ..................... SUCCESS [ 0.258 s]
[INFO] Apache Oozie Core ................................. SUCCESS [ 37.325 s]
[INFO] Apache Oozie Share Lib Streaming .................. SUCCESS [ 1.344 s]
[INFO] Apache Oozie Share Lib Pig ........................ SUCCESS [ 1.185 s]
[INFO] Apache Oozie Share Lib Hive ....................... SUCCESS [ 2.361 s]
[INFO] Apache Oozie Share Lib Hive 2 ..................... SUCCESS [ 1.918 s]
[INFO] Apache Oozie Share Lib Sqoop ...................... SUCCESS [ 0.531 s]
[INFO] Apache Oozie Examples ............................. SUCCESS [ 1.962 s]
[INFO] Apache Oozie Share Lib Spark ...................... SUCCESS [ 5.244 s]
[INFO] Apache Oozie Share Lib ............................ SUCCESS [ 18.142 s]
[INFO] Apache Oozie Docs ................................. SUCCESS [ 13.952 s]
[INFO] Apache Oozie WebApp ............................... SUCCESS [ 28.178 s]
[INFO] Apache Oozie Tools ................................ SUCCESS [ 0.541 s]
[INFO] Apache Oozie MiniOozie ............................ SUCCESS [ 0.250 s]
[INFO] Apache Oozie Distro ............................... SUCCESS [ 48.216 s]
[INFO] Apache Oozie ZooKeeper Security Tests ............. SUCCESS [ 1.654 s]
[INFO] ------------------------------------------------------------------------
[INFO] BUILD SUCCESS
[INFO] ------------------------------------------------------------------------
[INFO] Total time: 03:17 min
[INFO] Finished at: 2016-03-29T00:19:17+00:00
[INFO] Final Memory: 69M/979M
[INFO] ------------------------------------------------------------------------
Reports
Running test-patch task CLEAN
Running test-patch task RAW_PATCH_ANALYSIS
Running test-patch task RAT
Running test-patch task JAVADOC
Running test-patch task COMPILE
Running test-patch task BACKWARDS_COMPATIBILITY
Running test-patch task TESTS
Running test-patch task DISTRO
Testing JIRA OOZIE-2481
Cleaning local git workspace
----------------------------
+1 PATCH_APPLIES
+1 CLEAN
-1 RAW_PATCH_ANALYSIS
+1 the patch does not introduce any @author tags
+1 the patch does not introduce any tabs
+1 the patch does not introduce any trailing spaces
-1 the patch contains 1 line(s) longer than 132 characters
+1 the patch does adds/modifies 1 testcase(s)
+1 RAT
+1 the patch does not seem to introduce new RAT warnings
+1 JAVADOC
+1 the patch does not seem to introduce new Javadoc warnings
+1 COMPILE
+1 HEAD compiles
+1 patch compiles
+1 the patch does not seem to introduce new javac warnings
+1 BACKWARDS_COMPATIBILITY
+1 the patch does not change any JPA Entity/Colum/Basic/Lob/Transient annotations
+1 the patch does not modify JPA files
+1 TESTS
Tests run: 1768
+1 DISTRO
+1 distro tarball builds with the patch
----------------------------
-1 Overall result, please check the reported -1(s)
The full output of the test-patch run is available at
https://builds.apache.org/job/oozie-trunk-precommit-build/2788/
Adding comment to JIRA
Comment added.
test-patch exit code: 1
Build step 'Execute shell' marked build as failure
Archiving artifacts
Recording test results
Build failed in Jenkins: oozie-trunk-precommit-build #2787
Posted by Apache Jenkins Server <je...@builds.apache.org>.
See <https://builds.apache.org/job/oozie-trunk-precommit-build/2787/>
------------------------------------------
[...truncated 8127 lines...]
[INFO]
[INFO] --- maven-compiler-plugin:2.3.2:compile (default-compile) @ oozie-tools ---
[INFO] Nothing to compile - all classes are up to date
[INFO]
[INFO] --- maven-resources-plugin:2.5:testResources (default-testResources) @ oozie-tools ---
[debug] execute contextualize
[INFO] Using 'UTF-8' encoding to copy filtered resources.
[INFO] Copying 2 resources
[INFO] Copying 3 resources
[INFO]
[INFO] --- maven-compiler-plugin:2.3.2:testCompile (default-testCompile) @ oozie-tools ---
[INFO] Nothing to compile - all classes are up to date
[INFO]
[INFO] --- maven-surefire-plugin:2.12.2:test (default-test) @ oozie-tools ---
[INFO] Tests are skipped.
[INFO]
[INFO] --- maven-jar-plugin:2.3.1:jar (default-jar) @ oozie-tools ---
[INFO] Building jar: <https://builds.apache.org/job/oozie-trunk-precommit-build/ws/tools/target/oozie-tools-4.3.0-SNAPSHOT.jar>
[INFO]
[INFO] --- maven-site-plugin:2.0-beta-6:attach-descriptor (attach-descriptor) @ oozie-tools ---
[INFO]
[INFO] --- maven-assembly-plugin:2.2.1:single (default-cli) @ oozie-tools ---
[INFO] Reading assembly descriptor: ../src/main/assemblies/tools.xml
[WARNING] The following patterns were never triggered in this artifact exclusion filter:
o '*:*:pom:*'
[INFO] Copying files to <https://builds.apache.org/job/oozie-trunk-precommit-build/ws/tools/target/oozie-tools-4.3.0-SNAPSHOT-tools>
[WARNING] Assembly file: <https://builds.apache.org/job/oozie-trunk-precommit-build/ws/tools/target/oozie-tools-4.3.0-SNAPSHOT-tools> is not a regular file (it may be a directory). It cannot be attached to the project build for installation or deployment.
[INFO]
[INFO] ------------------------------------------------------------------------
[INFO] Building Apache Oozie MiniOozie 4.3.0-SNAPSHOT
[INFO] ------------------------------------------------------------------------
[INFO]
[INFO] --- maven-remote-resources-plugin:1.5:process (default) @ oozie-mini ---
[INFO]
[INFO] --- maven-resources-plugin:2.5:resources (default-resources) @ oozie-mini ---
[debug] execute contextualize
[INFO] Using 'UTF-8' encoding to copy filtered resources.
[INFO] skip non existing resourceDirectory <https://builds.apache.org/job/oozie-trunk-precommit-build/ws/minitest/src/main/resources>
[INFO] Copying 3 resources
[INFO]
[INFO] --- maven-compiler-plugin:2.3.2:compile (default-compile) @ oozie-mini ---
[INFO] No sources to compile
[INFO]
[INFO] --- maven-resources-plugin:2.5:testResources (default-testResources) @ oozie-mini ---
[debug] execute contextualize
[INFO] Using 'UTF-8' encoding to copy filtered resources.
[INFO] Copying 3 resources
[INFO] Copying 3 resources
[INFO]
[INFO] --- maven-compiler-plugin:2.3.2:testCompile (default-testCompile) @ oozie-mini ---
[INFO] Nothing to compile - all classes are up to date
[INFO]
[INFO] --- maven-surefire-plugin:2.12.2:test (default-test) @ oozie-mini ---
[INFO] Tests are skipped.
[INFO]
[INFO] --- maven-jar-plugin:2.3.1:jar (default-jar) @ oozie-mini ---
[INFO] Building jar: <https://builds.apache.org/job/oozie-trunk-precommit-build/ws/minitest/target/oozie-mini-4.3.0-SNAPSHOT.jar>
[INFO]
[INFO] --- maven-site-plugin:2.0-beta-6:attach-descriptor (attach-descriptor) @ oozie-mini ---
[INFO]
[INFO] --- maven-assembly-plugin:2.2.1:single (default-cli) @ oozie-mini ---
[INFO] Reading assembly descriptor: src/main/assemblies/empty.xml
[INFO]
[INFO] ------------------------------------------------------------------------
[INFO] Building Apache Oozie Distro 4.3.0-SNAPSHOT
[INFO] ------------------------------------------------------------------------
[INFO]
[INFO] --- maven-remote-resources-plugin:1.5:process (default) @ oozie-distro ---
[INFO]
[INFO] --- maven-resources-plugin:2.5:resources (default-resources) @ oozie-distro ---
[debug] execute contextualize
[INFO] Using 'UTF-8' encoding to copy filtered resources.
[INFO] skip non existing resourceDirectory <https://builds.apache.org/job/oozie-trunk-precommit-build/ws/distro/src/main/resources>
[INFO] Copying 3 resources
[INFO]
[INFO] --- maven-compiler-plugin:2.3.2:compile (default-compile) @ oozie-distro ---
[INFO] No sources to compile
[INFO]
[INFO] --- maven-resources-plugin:2.5:testResources (default-testResources) @ oozie-distro ---
[debug] execute contextualize
[INFO] Using 'UTF-8' encoding to copy filtered resources.
[INFO] skip non existing resourceDirectory <https://builds.apache.org/job/oozie-trunk-precommit-build/ws/distro/src/test/resources>
[INFO] Copying 3 resources
[INFO]
[INFO] --- maven-compiler-plugin:2.3.2:testCompile (default-testCompile) @ oozie-distro ---
[INFO] No sources to compile
[INFO]
[INFO] --- maven-surefire-plugin:2.12.2:test (default-test) @ oozie-distro ---
[INFO] Tests are skipped.
[INFO]
[INFO] --- maven-jar-plugin:2.3.1:jar (default-jar) @ oozie-distro ---
[INFO] Building jar: <https://builds.apache.org/job/oozie-trunk-precommit-build/ws/distro/target/oozie-distro-4.3.0-SNAPSHOT.jar>
[INFO]
[INFO] --- maven-site-plugin:2.0-beta-6:attach-descriptor (attach-descriptor) @ oozie-distro ---
[INFO]
[INFO] --- maven-antrun-plugin:1.6:run (default) @ oozie-distro ---
[INFO] Executing tasks
main:
[get] Getting: http://archive.apache.org/dist/tomcat/tomcat-6/v6.0.44/bin/apache-tomcat-6.0.44.tar.gz
[get] To: <https://builds.apache.org/job/oozie-trunk-precommit-build/ws/distro/downloads/tomcat-6.0.44.tar.gz>
.............................................................................................................................................................................................................................................................................................................................................................................................................................................................................................................................................
[mkdir] Created dir: <https://builds.apache.org/job/oozie-trunk-precommit-build/ws/distro/target/tomcat>
[gunzip] Expanding <https://builds.apache.org/job/oozie-trunk-precommit-build/ws/distro/downloads/tomcat-6.0.44.tar.gz> to <https://builds.apache.org/job/oozie-trunk-precommit-build/ws/distro/target/tomcat/tomcat-6.0.44.tar>
[untar] Expanding: <https://builds.apache.org/job/oozie-trunk-precommit-build/ws/distro/target/tomcat/tomcat-6.0.44.tar> into <https://builds.apache.org/job/oozie-trunk-precommit-build/ws/distro/target/tomcat>
[delete] Deleting directory <https://builds.apache.org/job/oozie-trunk-precommit-build/ws/distro/target/tomcat/oozie-server/webapps>
[mkdir] Created dir: <https://builds.apache.org/job/oozie-trunk-precommit-build/ws/distro/target/tomcat/oozie-server/webapps>
[delete] Deleting: <https://builds.apache.org/job/oozie-trunk-precommit-build/ws/distro/target/tomcat/oozie-server/conf/server.xml>
[copy] Copying 1 file to <https://builds.apache.org/job/oozie-trunk-precommit-build/ws/distro/target/tomcat/oozie-server/conf>
[copy] Copying 1 file to <https://builds.apache.org/job/oozie-trunk-precommit-build/ws/distro/target/tomcat/oozie-server/conf>
[mkdir] Created dir: <https://builds.apache.org/job/oozie-trunk-precommit-build/ws/distro/target/tomcat/oozie-server/conf/ssl>
[copy] Copying 1 file to <https://builds.apache.org/job/oozie-trunk-precommit-build/ws/distro/target/tomcat/oozie-server/conf/ssl>
[copy] Copying 1 file to <https://builds.apache.org/job/oozie-trunk-precommit-build/ws/distro/target/tomcat/oozie-server/conf/ssl>
[copy] Copying 1 file to <https://builds.apache.org/job/oozie-trunk-precommit-build/ws/distro/target/tomcat/oozie-server/conf/ssl>
[copy] Copying 3 files to <https://builds.apache.org/job/oozie-trunk-precommit-build/ws/distro/target/tomcat/oozie-server/webapps/ROOT>
[INFO] Executed tasks
[INFO]
[INFO] --- maven-assembly-plugin:2.2.1:single (default-cli) @ oozie-distro ---
[INFO] Reading assembly descriptor: ../src/main/assemblies/distro.xml
[INFO] Copying files to <https://builds.apache.org/job/oozie-trunk-precommit-build/ws/distro/target/oozie-4.3.0-SNAPSHOT-distro>
[WARNING] Assembly file: <https://builds.apache.org/job/oozie-trunk-precommit-build/ws/distro/target/oozie-4.3.0-SNAPSHOT-distro> is not a regular file (it may be a directory). It cannot be attached to the project build for installation or deployment.
[INFO] Building tar : <https://builds.apache.org/job/oozie-trunk-precommit-build/ws/distro/target/oozie-4.3.0-SNAPSHOT-distro.tar.gz>
[INFO]
[INFO] ------------------------------------------------------------------------
[INFO] Building Apache Oozie ZooKeeper Security Tests 4.3.0-SNAPSHOT
[INFO] ------------------------------------------------------------------------
[INFO]
[INFO] --- maven-remote-resources-plugin:1.5:process (default) @ oozie-zookeeper-security-tests ---
[INFO]
[INFO] --- maven-resources-plugin:2.5:resources (default-resources) @ oozie-zookeeper-security-tests ---
[debug] execute contextualize
[INFO] Using 'UTF-8' encoding to copy filtered resources.
[INFO] skip non existing resourceDirectory <https://builds.apache.org/job/oozie-trunk-precommit-build/ws/zookeeper-security-tests/src/main/resources>
[INFO] Copying 3 resources
[INFO]
[INFO] --- maven-compiler-plugin:2.3.2:compile (default-compile) @ oozie-zookeeper-security-tests ---
[INFO] No sources to compile
[INFO]
[INFO] --- maven-resources-plugin:2.5:testResources (default-testResources) @ oozie-zookeeper-security-tests ---
[debug] execute contextualize
[INFO] Using 'UTF-8' encoding to copy filtered resources.
[INFO] skip non existing resourceDirectory <https://builds.apache.org/job/oozie-trunk-precommit-build/ws/zookeeper-security-tests/src/test/resources>
[INFO] Copying 3 resources
[INFO]
[INFO] --- maven-compiler-plugin:2.3.2:testCompile (default-testCompile) @ oozie-zookeeper-security-tests ---
[INFO] Nothing to compile - all classes are up to date
[INFO]
[INFO] --- maven-surefire-plugin:2.12.2:test (default-test) @ oozie-zookeeper-security-tests ---
[INFO] Tests are skipped.
[INFO]
[INFO] --- maven-jar-plugin:2.3.1:jar (default-jar) @ oozie-zookeeper-security-tests ---
[INFO] Building jar: <https://builds.apache.org/job/oozie-trunk-precommit-build/ws/zookeeper-security-tests/target/oozie-zookeeper-security-tests-4.3.0-SNAPSHOT.jar>
[INFO]
[INFO] --- maven-site-plugin:2.0-beta-6:attach-descriptor (attach-descriptor) @ oozie-zookeeper-security-tests ---
[INFO]
[INFO] --- maven-assembly-plugin:2.2.1:single (default-cli) @ oozie-zookeeper-security-tests ---
[INFO] Reading assembly descriptor: src/main/assemblies/empty.xml
[INFO] ------------------------------------------------------------------------
[INFO] Reactor Summary:
[INFO]
[INFO] Apache Oozie Main ................................. SUCCESS [ 12.196 s]
[INFO] Apache Oozie Hadoop Utils ......................... SUCCESS [ 4.677 s]
[INFO] Apache Oozie Hadoop Distcp hadoop-1-4.3.0-SNAPSHOT SUCCESS [ 1.185 s]
[INFO] Apache Oozie Hadoop Auth hadoop-1-4.3.0-SNAPSHOT .. SUCCESS [ 1.796 s]
[INFO] Apache Oozie Hadoop Libs .......................... SUCCESS [ 0.142 s]
[INFO] Apache Oozie Client ............................... SUCCESS [01:57 min]
[INFO] Apache Oozie Share Lib Oozie ...................... SUCCESS [ 3.226 s]
[INFO] Apache Oozie Share Lib HCatalog ................... SUCCESS [ 4.404 s]
[INFO] Apache Oozie Share Lib Distcp ..................... SUCCESS [ 0.692 s]
[INFO] Apache Oozie Core ................................. SUCCESS [01:53 min]
[INFO] Apache Oozie Share Lib Streaming .................. SUCCESS [ 14.078 s]
[INFO] Apache Oozie Share Lib Pig ........................ SUCCESS [ 5.185 s]
[INFO] Apache Oozie Share Lib Hive ....................... SUCCESS [ 8.977 s]
[INFO] Apache Oozie Share Lib Hive 2 ..................... SUCCESS [ 9.115 s]
[INFO] Apache Oozie Share Lib Sqoop ...................... SUCCESS [ 1.738 s]
[INFO] Apache Oozie Examples ............................. SUCCESS [ 6.444 s]
[INFO] Apache Oozie Share Lib Spark ...................... SUCCESS [ 23.274 s]
[INFO] Apache Oozie Share Lib ............................ SUCCESS [ 49.863 s]
[INFO] Apache Oozie Docs ................................. SUCCESS [ 39.759 s]
[INFO] Apache Oozie WebApp ............................... SUCCESS [01:07 min]
[INFO] Apache Oozie Tools ................................ SUCCESS [ 2.180 s]
[INFO] Apache Oozie MiniOozie ............................ SUCCESS [ 1.793 s]
[INFO] Apache Oozie Distro ............................... SUCCESS [01:41 min]
[INFO] Apache Oozie ZooKeeper Security Tests ............. SUCCESS [ 4.320 s]
[INFO] ------------------------------------------------------------------------
[INFO] BUILD SUCCESS
[INFO] ------------------------------------------------------------------------
[INFO] Total time: 10:09 min
[INFO] Finished at: 2016-03-29T00:05:45+00:00
[INFO] Final Memory: 73M/1031M
[INFO] ------------------------------------------------------------------------
Reports
Running test-patch task CLEAN
Running test-patch task RAW_PATCH_ANALYSIS
Running test-patch task RAT
Running test-patch task JAVADOC
Running test-patch task COMPILE
Running test-patch task BACKWARDS_COMPATIBILITY
Running test-patch task TESTS
Running test-patch task DISTRO
Testing JIRA OOZIE-2473
Cleaning local git workspace
----------------------------
+1 PATCH_APPLIES
+1 CLEAN
+1 RAW_PATCH_ANALYSIS
+1 the patch does not introduce any @author tags
+1 the patch does not introduce any tabs
+1 the patch does not introduce any trailing spaces
+1 the patch does not introduce any line longer than 132
+1 the patch does adds/modifies 2 testcase(s)
+1 RAT
+1 the patch does not seem to introduce new RAT warnings
+1 JAVADOC
+1 the patch does not seem to introduce new Javadoc warnings
-1 COMPILE
+1 HEAD compiles
+1 patch compiles
-1 the patch seems to introduce 2 new javac warning(s)
+1 BACKWARDS_COMPATIBILITY
+1 the patch does not change any JPA Entity/Colum/Basic/Lob/Transient annotations
+1 the patch does not modify JPA files
-1 TESTS - patch does not compile, cannot run testcases
+1 DISTRO
+1 distro tarball builds with the patch
----------------------------
-1 Overall result, please check the reported -1(s)
The full output of the test-patch run is available at
https://builds.apache.org/job/oozie-trunk-precommit-build/2787/
Adding comment to JIRA
Comment added.
test-patch exit code: 1
Build step 'Execute shell' marked build as failure
Archiving artifacts
Recording test results
Build failed in Jenkins: oozie-trunk-precommit-build #2786
Posted by Apache Jenkins Server <je...@builds.apache.org>.
See <https://builds.apache.org/job/oozie-trunk-precommit-build/2786/>
------------------------------------------
[...truncated 8444 lines...]
[INFO] Building jar: <https://builds.apache.org/job/oozie-trunk-precommit-build/ws/tools/target/oozie-tools-4.3.0-SNAPSHOT.jar>
[INFO]
[INFO] --- maven-site-plugin:2.0-beta-6:attach-descriptor (attach-descriptor) @ oozie-tools ---
[INFO]
[INFO] --- maven-assembly-plugin:2.2.1:single (default-cli) @ oozie-tools ---
[INFO] Reading assembly descriptor: ../src/main/assemblies/tools.xml
[WARNING] The following patterns were never triggered in this artifact exclusion filter:
o '*:*:pom:*'
[INFO] Copying files to <https://builds.apache.org/job/oozie-trunk-precommit-build/ws/tools/target/oozie-tools-4.3.0-SNAPSHOT-tools>
[WARNING] Assembly file: <https://builds.apache.org/job/oozie-trunk-precommit-build/ws/tools/target/oozie-tools-4.3.0-SNAPSHOT-tools> is not a regular file (it may be a directory). It cannot be attached to the project build for installation or deployment.
[INFO]
[INFO] ------------------------------------------------------------------------
[INFO] Building Apache Oozie MiniOozie 4.3.0-SNAPSHOT
[INFO] ------------------------------------------------------------------------
[INFO]
[INFO] --- maven-remote-resources-plugin:1.5:process (default) @ oozie-mini ---
[INFO]
[INFO] --- maven-resources-plugin:2.5:resources (default-resources) @ oozie-mini ---
[debug] execute contextualize
[INFO] Using 'UTF-8' encoding to copy filtered resources.
[INFO] skip non existing resourceDirectory <https://builds.apache.org/job/oozie-trunk-precommit-build/ws/minitest/src/main/resources>
[INFO] Copying 3 resources
[INFO]
[INFO] --- maven-compiler-plugin:2.3.2:compile (default-compile) @ oozie-mini ---
[INFO] No sources to compile
[INFO]
[INFO] --- maven-resources-plugin:2.5:testResources (default-testResources) @ oozie-mini ---
[debug] execute contextualize
[INFO] Using 'UTF-8' encoding to copy filtered resources.
[INFO] Copying 3 resources
[INFO] Copying 3 resources
[INFO]
[INFO] --- maven-compiler-plugin:2.3.2:testCompile (default-testCompile) @ oozie-mini ---
[INFO] Nothing to compile - all classes are up to date
[INFO]
[INFO] --- maven-surefire-plugin:2.12.2:test (default-test) @ oozie-mini ---
[INFO] Tests are skipped.
[INFO]
[INFO] --- maven-jar-plugin:2.3.1:jar (default-jar) @ oozie-mini ---
[INFO] Building jar: <https://builds.apache.org/job/oozie-trunk-precommit-build/ws/minitest/target/oozie-mini-4.3.0-SNAPSHOT.jar>
[INFO]
[INFO] --- maven-site-plugin:2.0-beta-6:attach-descriptor (attach-descriptor) @ oozie-mini ---
[INFO]
[INFO] --- maven-assembly-plugin:2.2.1:single (default-cli) @ oozie-mini ---
[INFO] Reading assembly descriptor: src/main/assemblies/empty.xml
[INFO]
[INFO] ------------------------------------------------------------------------
[INFO] Building Apache Oozie Distro 4.3.0-SNAPSHOT
[INFO] ------------------------------------------------------------------------
[INFO]
[INFO] --- maven-remote-resources-plugin:1.5:process (default) @ oozie-distro ---
[INFO]
[INFO] --- maven-resources-plugin:2.5:resources (default-resources) @ oozie-distro ---
[debug] execute contextualize
[INFO] Using 'UTF-8' encoding to copy filtered resources.
[INFO] skip non existing resourceDirectory <https://builds.apache.org/job/oozie-trunk-precommit-build/ws/distro/src/main/resources>
[INFO] Copying 3 resources
[INFO]
[INFO] --- maven-compiler-plugin:2.3.2:compile (default-compile) @ oozie-distro ---
[INFO] No sources to compile
[INFO]
[INFO] --- maven-resources-plugin:2.5:testResources (default-testResources) @ oozie-distro ---
[debug] execute contextualize
[INFO] Using 'UTF-8' encoding to copy filtered resources.
[INFO] skip non existing resourceDirectory <https://builds.apache.org/job/oozie-trunk-precommit-build/ws/distro/src/test/resources>
[INFO] Copying 3 resources
[INFO]
[INFO] --- maven-compiler-plugin:2.3.2:testCompile (default-testCompile) @ oozie-distro ---
[INFO] No sources to compile
[INFO]
[INFO] --- maven-surefire-plugin:2.12.2:test (default-test) @ oozie-distro ---
[INFO] Tests are skipped.
[INFO]
[INFO] --- maven-jar-plugin:2.3.1:jar (default-jar) @ oozie-distro ---
[INFO] Building jar: <https://builds.apache.org/job/oozie-trunk-precommit-build/ws/distro/target/oozie-distro-4.3.0-SNAPSHOT.jar>
[INFO]
[INFO] --- maven-site-plugin:2.0-beta-6:attach-descriptor (attach-descriptor) @ oozie-distro ---
[INFO]
[INFO] --- maven-antrun-plugin:1.6:run (default) @ oozie-distro ---
[INFO] Executing tasks
main:
[mkdir] Created dir: <https://builds.apache.org/job/oozie-trunk-precommit-build/ws/distro/downloads>
[get] Getting: http://archive.apache.org/dist/tomcat/tomcat-6/v6.0.44/bin/apache-tomcat-6.0.44.tar.gz
[get] To: <https://builds.apache.org/job/oozie-trunk-precommit-build/ws/distro/downloads/tomcat-6.0.44.tar.gz>
...................................................................................................................................................................................................................................................................................................................................................................
[mkdir] Created dir: <https://builds.apache.org/job/oozie-trunk-precommit-build/ws/distro/target/tomcat>
[gunzip] Expanding <https://builds.apache.org/job/oozie-trunk-precommit-build/ws/distro/downloads/tomcat-6.0.44.tar.gz> to <https://builds.apache.org/job/oozie-trunk-precommit-build/ws/distro/target/tomcat/tomcat-6.0.44.tar>
[untar] Expanding: <https://builds.apache.org/job/oozie-trunk-precommit-build/ws/distro/target/tomcat/tomcat-6.0.44.tar> into <https://builds.apache.org/job/oozie-trunk-precommit-build/ws/distro/target/tomcat>
[delete] Deleting directory <https://builds.apache.org/job/oozie-trunk-precommit-build/ws/distro/target/tomcat/oozie-server/webapps>
[mkdir] Created dir: <https://builds.apache.org/job/oozie-trunk-precommit-build/ws/distro/target/tomcat/oozie-server/webapps>
[delete] Deleting: <https://builds.apache.org/job/oozie-trunk-precommit-build/ws/distro/target/tomcat/oozie-server/conf/server.xml>
[copy] Copying 1 file to <https://builds.apache.org/job/oozie-trunk-precommit-build/ws/distro/target/tomcat/oozie-server/conf>
[copy] Copying 1 file to <https://builds.apache.org/job/oozie-trunk-precommit-build/ws/distro/target/tomcat/oozie-server/conf>
[mkdir] Created dir: <https://builds.apache.org/job/oozie-trunk-precommit-build/ws/distro/target/tomcat/oozie-server/conf/ssl>
[copy] Copying 1 file to <https://builds.apache.org/job/oozie-trunk-precommit-build/ws/distro/target/tomcat/oozie-server/conf/ssl>
[copy] Copying 1 file to <https://builds.apache.org/job/oozie-trunk-precommit-build/ws/distro/target/tomcat/oozie-server/conf/ssl>
[copy] Copying 1 file to <https://builds.apache.org/job/oozie-trunk-precommit-build/ws/distro/target/tomcat/oozie-server/conf/ssl>
[copy] Copying 3 files to <https://builds.apache.org/job/oozie-trunk-precommit-build/ws/distro/target/tomcat/oozie-server/webapps/ROOT>
[INFO] Executed tasks
[INFO]
[INFO] --- maven-assembly-plugin:2.2.1:single (default-cli) @ oozie-distro ---
[INFO] Reading assembly descriptor: ../src/main/assemblies/distro.xml
[INFO] Copying files to <https://builds.apache.org/job/oozie-trunk-precommit-build/ws/distro/target/oozie-4.3.0-SNAPSHOT-distro>
[WARNING] Assembly file: <https://builds.apache.org/job/oozie-trunk-precommit-build/ws/distro/target/oozie-4.3.0-SNAPSHOT-distro> is not a regular file (it may be a directory). It cannot be attached to the project build for installation or deployment.
[INFO] Building tar : <https://builds.apache.org/job/oozie-trunk-precommit-build/ws/distro/target/oozie-4.3.0-SNAPSHOT-distro.tar.gz>
[INFO]
[INFO] ------------------------------------------------------------------------
[INFO] Building Apache Oozie ZooKeeper Security Tests 4.3.0-SNAPSHOT
[INFO] ------------------------------------------------------------------------
[INFO]
[INFO] --- maven-remote-resources-plugin:1.5:process (default) @ oozie-zookeeper-security-tests ---
[INFO]
[INFO] --- maven-resources-plugin:2.5:resources (default-resources) @ oozie-zookeeper-security-tests ---
[debug] execute contextualize
[INFO] Using 'UTF-8' encoding to copy filtered resources.
[INFO] skip non existing resourceDirectory <https://builds.apache.org/job/oozie-trunk-precommit-build/ws/zookeeper-security-tests/src/main/resources>
[INFO] Copying 3 resources
[INFO]
[INFO] --- maven-compiler-plugin:2.3.2:compile (default-compile) @ oozie-zookeeper-security-tests ---
[INFO] No sources to compile
[INFO]
[INFO] --- maven-resources-plugin:2.5:testResources (default-testResources) @ oozie-zookeeper-security-tests ---
[debug] execute contextualize
[INFO] Using 'UTF-8' encoding to copy filtered resources.
[INFO] skip non existing resourceDirectory <https://builds.apache.org/job/oozie-trunk-precommit-build/ws/zookeeper-security-tests/src/test/resources>
[INFO] Copying 3 resources
[INFO]
[INFO] --- maven-compiler-plugin:2.3.2:testCompile (default-testCompile) @ oozie-zookeeper-security-tests ---
[INFO] Nothing to compile - all classes are up to date
[INFO]
[INFO] --- maven-surefire-plugin:2.12.2:test (default-test) @ oozie-zookeeper-security-tests ---
[INFO] Tests are skipped.
[INFO]
[INFO] --- maven-jar-plugin:2.3.1:jar (default-jar) @ oozie-zookeeper-security-tests ---
[INFO] Building jar: <https://builds.apache.org/job/oozie-trunk-precommit-build/ws/zookeeper-security-tests/target/oozie-zookeeper-security-tests-4.3.0-SNAPSHOT.jar>
[INFO]
[INFO] --- maven-site-plugin:2.0-beta-6:attach-descriptor (attach-descriptor) @ oozie-zookeeper-security-tests ---
[INFO]
[INFO] --- maven-assembly-plugin:2.2.1:single (default-cli) @ oozie-zookeeper-security-tests ---
[INFO] Reading assembly descriptor: src/main/assemblies/empty.xml
[INFO] ------------------------------------------------------------------------
[INFO] Reactor Summary:
[INFO]
[INFO] Apache Oozie Main ................................. SUCCESS [ 2.213 s]
[INFO] Apache Oozie Hadoop Utils ......................... SUCCESS [ 0.868 s]
[INFO] Apache Oozie Hadoop Distcp hadoop-1-4.3.0-SNAPSHOT SUCCESS [ 0.182 s]
[INFO] Apache Oozie Hadoop Auth hadoop-1-4.3.0-SNAPSHOT .. SUCCESS [ 0.208 s]
[INFO] Apache Oozie Hadoop Libs .......................... SUCCESS [ 0.043 s]
[INFO] Apache Oozie Client ............................... SUCCESS [ 32.964 s]
[INFO] Apache Oozie Share Lib Oozie ...................... SUCCESS [ 1.316 s]
[INFO] Apache Oozie Share Lib HCatalog ................... SUCCESS [ 1.373 s]
[INFO] Apache Oozie Share Lib Distcp ..................... SUCCESS [ 0.285 s]
[INFO] Apache Oozie Core ................................. SUCCESS [ 39.716 s]
[INFO] Apache Oozie Share Lib Streaming .................. SUCCESS [ 1.358 s]
[INFO] Apache Oozie Share Lib Pig ........................ SUCCESS [ 1.189 s]
[INFO] Apache Oozie Share Lib Hive ....................... SUCCESS [ 2.920 s]
[INFO] Apache Oozie Share Lib Hive 2 ..................... SUCCESS [ 2.030 s]
[INFO] Apache Oozie Share Lib Sqoop ...................... SUCCESS [ 0.415 s]
[INFO] Apache Oozie Examples ............................. SUCCESS [ 1.698 s]
[INFO] Apache Oozie Share Lib Spark ...................... SUCCESS [ 5.075 s]
[INFO] Apache Oozie Share Lib ............................ SUCCESS [ 29.702 s]
[INFO] Apache Oozie Docs ................................. SUCCESS [ 18.574 s]
[INFO] Apache Oozie WebApp ............................... SUCCESS [ 32.027 s]
[INFO] Apache Oozie Tools ................................ SUCCESS [ 0.782 s]
[INFO] Apache Oozie MiniOozie ............................ SUCCESS [ 0.267 s]
[INFO] Apache Oozie Distro ............................... SUCCESS [ 52.362 s]
[INFO] Apache Oozie ZooKeeper Security Tests ............. SUCCESS [ 1.961 s]
[INFO] ------------------------------------------------------------------------
[INFO] BUILD SUCCESS
[INFO] ------------------------------------------------------------------------
[INFO] Total time: 03:51 min
[INFO] Finished at: 2016-03-26T02:06:55+00:00
[INFO] Final Memory: 72M/963M
[INFO] ------------------------------------------------------------------------
Reports
Running test-patch task CLEAN
Running test-patch task RAW_PATCH_ANALYSIS
Running test-patch task RAT
Running test-patch task JAVADOC
Running test-patch task COMPILE
Running test-patch task BACKWARDS_COMPATIBILITY
Running test-patch task TESTS
Running test-patch task DISTRO
Testing JIRA OOZIE-2481
Cleaning local git workspace
----------------------------
+1 PATCH_APPLIES
+1 CLEAN
-1 RAW_PATCH_ANALYSIS
+1 the patch does not introduce any @author tags
+1 the patch does not introduce any tabs
+1 the patch does not introduce any trailing spaces
-1 the patch contains 1 line(s) longer than 132 characters
+1 the patch does adds/modifies 1 testcase(s)
+1 RAT
+1 the patch does not seem to introduce new RAT warnings
+1 JAVADOC
+1 the patch does not seem to introduce new Javadoc warnings
+1 COMPILE
+1 HEAD compiles
+1 patch compiles
+1 the patch does not seem to introduce new javac warnings
+1 BACKWARDS_COMPATIBILITY
+1 the patch does not change any JPA Entity/Colum/Basic/Lob/Transient annotations
+1 the patch does not modify JPA files
-1 TESTS
Tests run: 1768
Tests failed: 2
Tests errors: 0
The patch failed the following testcases:
testHive2Action(org.apache.oozie.action.hadoop.TestHive2ActionExecutor)
testCoordStatus_Killed(org.apache.oozie.command.coord.TestCoordChangeXCommand)
+1 DISTRO
+1 distro tarball builds with the patch
----------------------------
-1 Overall result, please check the reported -1(s)
The full output of the test-patch run is available at
https://builds.apache.org/job/oozie-trunk-precommit-build/2786/
% Total % Received % Xferd Average Speed Time Time Time Current
Dload Upload Total Spent Left Speed
0 0 0 0 0 0 0 0 --:--:-- --:--:-- --:--:-- 0
0 0 0 0 0 0 0 0 --:--:-- --:--:-- --:--:-- 0
56 3706k 56 2111k 0 0 2098k 0 0:00:01 0:00:01 --:--:-- 2096k
100 3706k 100 3706k 0 0 2464k 0 0:00:01 0:00:01 --:--:-- 2464k
Adding comment to JIRA
Comment added.
test-patch exit code: 1
Build step 'Execute shell' marked build as failure
Archiving artifacts
Recording test results
Build failed in Jenkins: oozie-trunk-precommit-build #2785
Posted by Apache Jenkins Server <je...@builds.apache.org>.
See <https://builds.apache.org/job/oozie-trunk-precommit-build/2785/>
------------------------------------------
[...truncated 8496 lines...]
[INFO] --- maven-resources-plugin:2.5:testResources (default-testResources) @ oozie-mini ---
[debug] execute contextualize
[INFO] Using 'UTF-8' encoding to copy filtered resources.
[INFO] Copying 3 resources
[INFO] Copying 3 resources
[INFO]
[INFO] --- maven-compiler-plugin:2.3.2:testCompile (default-testCompile) @ oozie-mini ---
[INFO] Nothing to compile - all classes are up to date
[INFO]
[INFO] --- maven-surefire-plugin:2.12.2:test (default-test) @ oozie-mini ---
[INFO] Tests are skipped.
[INFO]
[INFO] --- maven-jar-plugin:2.3.1:jar (default-jar) @ oozie-mini ---
[INFO] Building jar: <https://builds.apache.org/job/oozie-trunk-precommit-build/ws/minitest/target/oozie-mini-4.3.0-SNAPSHOT.jar>
[INFO]
[INFO] --- maven-site-plugin:2.0-beta-6:attach-descriptor (attach-descriptor) @ oozie-mini ---
[INFO]
[INFO] --- maven-assembly-plugin:2.2.1:single (default-cli) @ oozie-mini ---
[INFO] Reading assembly descriptor: src/main/assemblies/empty.xml
[INFO]
[INFO] ------------------------------------------------------------------------
[INFO] Building Apache Oozie Distro 4.3.0-SNAPSHOT
[INFO] ------------------------------------------------------------------------
[INFO]
[INFO] --- maven-remote-resources-plugin:1.5:process (default) @ oozie-distro ---
[INFO]
[INFO] --- maven-resources-plugin:2.5:resources (default-resources) @ oozie-distro ---
[debug] execute contextualize
[INFO] Using 'UTF-8' encoding to copy filtered resources.
[INFO] skip non existing resourceDirectory <https://builds.apache.org/job/oozie-trunk-precommit-build/ws/distro/src/main/resources>
[INFO] Copying 3 resources
[INFO]
[INFO] --- maven-compiler-plugin:2.3.2:compile (default-compile) @ oozie-distro ---
[INFO] No sources to compile
[INFO]
[INFO] --- maven-resources-plugin:2.5:testResources (default-testResources) @ oozie-distro ---
[debug] execute contextualize
[INFO] Using 'UTF-8' encoding to copy filtered resources.
[INFO] skip non existing resourceDirectory <https://builds.apache.org/job/oozie-trunk-precommit-build/ws/distro/src/test/resources>
[INFO] Copying 3 resources
[INFO]
[INFO] --- maven-compiler-plugin:2.3.2:testCompile (default-testCompile) @ oozie-distro ---
[INFO] No sources to compile
[INFO]
[INFO] --- maven-surefire-plugin:2.12.2:test (default-test) @ oozie-distro ---
[INFO] Tests are skipped.
[INFO]
[INFO] --- maven-jar-plugin:2.3.1:jar (default-jar) @ oozie-distro ---
[INFO] Building jar: <https://builds.apache.org/job/oozie-trunk-precommit-build/ws/distro/target/oozie-distro-4.3.0-SNAPSHOT.jar>
[INFO]
[INFO] --- maven-site-plugin:2.0-beta-6:attach-descriptor (attach-descriptor) @ oozie-distro ---
[INFO]
[INFO] --- maven-antrun-plugin:1.6:run (default) @ oozie-distro ---
[INFO] Executing tasks
main:
[mkdir] Created dir: <https://builds.apache.org/job/oozie-trunk-precommit-build/ws/distro/downloads>
[get] Getting: http://archive.apache.org/dist/tomcat/tomcat-6/v6.0.44/bin/apache-tomcat-6.0.44.tar.gz
[get] To: <https://builds.apache.org/job/oozie-trunk-precommit-build/ws/distro/downloads/tomcat-6.0.44.tar.gz>
...........................................................................................................................................................................................................................................................................................................................................................................................................................................................................................................................................................................................................
[mkdir] Created dir: <https://builds.apache.org/job/oozie-trunk-precommit-build/ws/distro/target/tomcat>
[gunzip] Expanding <https://builds.apache.org/job/oozie-trunk-precommit-build/ws/distro/downloads/tomcat-6.0.44.tar.gz> to <https://builds.apache.org/job/oozie-trunk-precommit-build/ws/distro/target/tomcat/tomcat-6.0.44.tar>
[untar] Expanding: <https://builds.apache.org/job/oozie-trunk-precommit-build/ws/distro/target/tomcat/tomcat-6.0.44.tar> into <https://builds.apache.org/job/oozie-trunk-precommit-build/ws/distro/target/tomcat>
[delete] Deleting directory <https://builds.apache.org/job/oozie-trunk-precommit-build/ws/distro/target/tomcat/oozie-server/webapps>
[mkdir] Created dir: <https://builds.apache.org/job/oozie-trunk-precommit-build/ws/distro/target/tomcat/oozie-server/webapps>
[delete] Deleting: <https://builds.apache.org/job/oozie-trunk-precommit-build/ws/distro/target/tomcat/oozie-server/conf/server.xml>
[copy] Copying 1 file to <https://builds.apache.org/job/oozie-trunk-precommit-build/ws/distro/target/tomcat/oozie-server/conf>
[copy] Copying 1 file to <https://builds.apache.org/job/oozie-trunk-precommit-build/ws/distro/target/tomcat/oozie-server/conf>
[mkdir] Created dir: <https://builds.apache.org/job/oozie-trunk-precommit-build/ws/distro/target/tomcat/oozie-server/conf/ssl>
[copy] Copying 1 file to <https://builds.apache.org/job/oozie-trunk-precommit-build/ws/distro/target/tomcat/oozie-server/conf/ssl>
[copy] Copying 1 file to <https://builds.apache.org/job/oozie-trunk-precommit-build/ws/distro/target/tomcat/oozie-server/conf/ssl>
[copy] Copying 1 file to <https://builds.apache.org/job/oozie-trunk-precommit-build/ws/distro/target/tomcat/oozie-server/conf/ssl>
[copy] Copying 3 files to <https://builds.apache.org/job/oozie-trunk-precommit-build/ws/distro/target/tomcat/oozie-server/webapps/ROOT>
[INFO] Executed tasks
[INFO]
[INFO] --- maven-assembly-plugin:2.2.1:single (default-cli) @ oozie-distro ---
[INFO] Reading assembly descriptor: ../src/main/assemblies/distro.xml
[INFO] Copying files to <https://builds.apache.org/job/oozie-trunk-precommit-build/ws/distro/target/oozie-4.3.0-SNAPSHOT-distro>
[WARNING] Assembly file: <https://builds.apache.org/job/oozie-trunk-precommit-build/ws/distro/target/oozie-4.3.0-SNAPSHOT-distro> is not a regular file (it may be a directory). It cannot be attached to the project build for installation or deployment.
[INFO] Building tar : <https://builds.apache.org/job/oozie-trunk-precommit-build/ws/distro/target/oozie-4.3.0-SNAPSHOT-distro.tar.gz>
[INFO]
[INFO] ------------------------------------------------------------------------
[INFO] Building Apache Oozie ZooKeeper Security Tests 4.3.0-SNAPSHOT
[INFO] ------------------------------------------------------------------------
[INFO]
[INFO] --- maven-remote-resources-plugin:1.5:process (default) @ oozie-zookeeper-security-tests ---
[INFO]
[INFO] --- maven-resources-plugin:2.5:resources (default-resources) @ oozie-zookeeper-security-tests ---
[debug] execute contextualize
[INFO] Using 'UTF-8' encoding to copy filtered resources.
[INFO] skip non existing resourceDirectory <https://builds.apache.org/job/oozie-trunk-precommit-build/ws/zookeeper-security-tests/src/main/resources>
[INFO] Copying 3 resources
[INFO]
[INFO] --- maven-compiler-plugin:2.3.2:compile (default-compile) @ oozie-zookeeper-security-tests ---
[INFO] No sources to compile
[INFO]
[INFO] --- maven-resources-plugin:2.5:testResources (default-testResources) @ oozie-zookeeper-security-tests ---
[debug] execute contextualize
[INFO] Using 'UTF-8' encoding to copy filtered resources.
[INFO] skip non existing resourceDirectory <https://builds.apache.org/job/oozie-trunk-precommit-build/ws/zookeeper-security-tests/src/test/resources>
[INFO] Copying 3 resources
[INFO]
[INFO] --- maven-compiler-plugin:2.3.2:testCompile (default-testCompile) @ oozie-zookeeper-security-tests ---
[INFO] Nothing to compile - all classes are up to date
[INFO]
[INFO] --- maven-surefire-plugin:2.12.2:test (default-test) @ oozie-zookeeper-security-tests ---
[INFO] Tests are skipped.
[INFO]
[INFO] --- maven-jar-plugin:2.3.1:jar (default-jar) @ oozie-zookeeper-security-tests ---
[INFO] Building jar: <https://builds.apache.org/job/oozie-trunk-precommit-build/ws/zookeeper-security-tests/target/oozie-zookeeper-security-tests-4.3.0-SNAPSHOT.jar>
[INFO]
[INFO] --- maven-site-plugin:2.0-beta-6:attach-descriptor (attach-descriptor) @ oozie-zookeeper-security-tests ---
[INFO]
[INFO] --- maven-assembly-plugin:2.2.1:single (default-cli) @ oozie-zookeeper-security-tests ---
[INFO] Reading assembly descriptor: src/main/assemblies/empty.xml
[INFO] ------------------------------------------------------------------------
[INFO] Reactor Summary:
[INFO]
[INFO] Apache Oozie Main ................................. SUCCESS [ 1.956 s]
[INFO] Apache Oozie Hadoop Utils ......................... SUCCESS [ 0.605 s]
[INFO] Apache Oozie Hadoop Distcp hadoop-1-4.3.0-SNAPSHOT SUCCESS [ 0.164 s]
[INFO] Apache Oozie Hadoop Auth hadoop-1-4.3.0-SNAPSHOT .. SUCCESS [ 0.213 s]
[INFO] Apache Oozie Hadoop Libs .......................... SUCCESS [ 0.022 s]
[INFO] Apache Oozie Client ............................... SUCCESS [ 25.513 s]
[INFO] Apache Oozie Share Lib Oozie ...................... SUCCESS [ 1.001 s]
[INFO] Apache Oozie Share Lib HCatalog ................... SUCCESS [ 1.071 s]
[INFO] Apache Oozie Share Lib Distcp ..................... SUCCESS [ 0.227 s]
[INFO] Apache Oozie Core ................................. SUCCESS [ 34.113 s]
[INFO] Apache Oozie Share Lib Streaming .................. SUCCESS [ 1.264 s]
[INFO] Apache Oozie Share Lib Pig ........................ SUCCESS [ 0.904 s]
[INFO] Apache Oozie Share Lib Hive ....................... SUCCESS [ 2.203 s]
[INFO] Apache Oozie Share Lib Hive 2 ..................... SUCCESS [ 1.799 s]
[INFO] Apache Oozie Share Lib Sqoop ...................... SUCCESS [ 0.389 s]
[INFO] Apache Oozie Examples ............................. SUCCESS [ 1.690 s]
[INFO] Apache Oozie Share Lib Spark ...................... SUCCESS [ 4.630 s]
[INFO] Apache Oozie Share Lib ............................ SUCCESS [ 17.045 s]
[INFO] Apache Oozie Docs ................................. SUCCESS [ 11.760 s]
[INFO] Apache Oozie WebApp ............................... SUCCESS [ 25.760 s]
[INFO] Apache Oozie Tools ................................ SUCCESS [ 0.826 s]
[INFO] Apache Oozie MiniOozie ............................ SUCCESS [ 0.225 s]
[INFO] Apache Oozie Distro ............................... SUCCESS [ 35.943 s]
[INFO] Apache Oozie ZooKeeper Security Tests ............. SUCCESS [ 1.648 s]
[INFO] ------------------------------------------------------------------------
[INFO] BUILD SUCCESS
[INFO] ------------------------------------------------------------------------
[INFO] Total time: 02:52 min
[INFO] Finished at: 2016-03-25T20:31:36+00:00
[INFO] Final Memory: 68M/922M
[INFO] ------------------------------------------------------------------------
Reports
Running test-patch task CLEAN
Running test-patch task RAW_PATCH_ANALYSIS
Running test-patch task RAT
Running test-patch task JAVADOC
Running test-patch task COMPILE
Running test-patch task BACKWARDS_COMPATIBILITY
Running test-patch task TESTS
Running test-patch task DISTRO
Testing JIRA OOZIE-2489
Cleaning local git workspace
----------------------------
+1 PATCH_APPLIES
+1 CLEAN
-1 RAW_PATCH_ANALYSIS
+1 the patch does not introduce any @author tags
+1 the patch does not introduce any tabs
+1 the patch does not introduce any trailing spaces
+1 the patch does not introduce any line longer than 132
-1 the patch does not add/modify any testcase
+1 RAT
+1 the patch does not seem to introduce new RAT warnings
+1 JAVADOC
+1 the patch does not seem to introduce new Javadoc warnings
+1 COMPILE
+1 HEAD compiles
+1 patch compiles
+1 the patch does not seem to introduce new javac warnings
+1 BACKWARDS_COMPATIBILITY
+1 the patch does not change any JPA Entity/Colum/Basic/Lob/Transient annotations
+1 the patch does not modify JPA files
-1 TESTS
Tests run: 1768
Tests failed: 30
Tests errors: 13
The patch failed the following testcases:
testReRun(org.apache.oozie.client.TestOozieCLI)
testSubmit(org.apache.oozie.client.TestOozieCLI)
testRun(org.apache.oozie.client.TestOozieCLI)
testSubmitPig(org.apache.oozie.client.TestOozieCLI)
testSubmitMapReduce2(org.apache.oozie.client.TestOozieCLI)
testSubmitMapReduce(org.apache.oozie.client.TestOozieCLI)
testRunWithDebug(org.apache.oozie.client.TestOozieCLI)
testUpdate(org.apache.oozie.client.TestOozieCLI)
testSubmitDoAs(org.apache.oozie.client.TestOozieCLI)
testSubmitWithPropertyArguments(org.apache.oozie.client.TestOozieCLI)
testPropertiesWithTrailingSpaces(org.apache.oozie.client.TestOozieCLI)
testJobDryrun(org.apache.oozie.client.TestOozieCLI)
testUpdateWithDryrun(org.apache.oozie.client.TestOozieCLI)
testCoordRerunCleanupOption(org.apache.oozie.command.coord.TestCoordRerunXCommand)
testCoordRerunActions1(org.apache.oozie.command.coord.TestCoordRerunXCommand)
testCoordRerunActions2(org.apache.oozie.command.coord.TestCoordRerunXCommand)
testCoordRerunActions3(org.apache.oozie.command.coord.TestCoordRerunXCommand)
testCoordRerunActionsNeg1(org.apache.oozie.command.coord.TestCoordRerunXCommand)
testCoordRerunActionsNeg2(org.apache.oozie.command.coord.TestCoordRerunXCommand)
testCoordRerunDate1(org.apache.oozie.command.coord.TestCoordRerunXCommand)
testCoordRerunDate2(org.apache.oozie.command.coord.TestCoordRerunXCommand)
testCoordRerunDate3(org.apache.oozie.command.coord.TestCoordRerunXCommand)
testCoordRerunDate4(org.apache.oozie.command.coord.TestCoordRerunXCommand)
testCoordRerunDateNeg(org.apache.oozie.command.coord.TestCoordRerunXCommand)
testCoordRerunRefresh(org.apache.oozie.command.coord.TestCoordRerunXCommand)
testCoordRerunCleanup(org.apache.oozie.command.coord.TestCoordRerunXCommand)
testCoordRerunCleanupForHCat(org.apache.oozie.command.coord.TestCoordRerunXCommand)
testCoordRerunCleanupNoOutputEvents(org.apache.oozie.command.coord.TestCoordRerunXCommand)
testCoordRerunKilledCoord(org.apache.oozie.command.coord.TestCoordRerunXCommand)
testCoordRerunFailedCoordAction(org.apache.oozie.command.coord.TestCoordRerunXCommand)
+1 DISTRO
+1 distro tarball builds with the patch
----------------------------
-1 Overall result, please check the reported -1(s)
The full output of the test-patch run is available at
https://builds.apache.org/job/oozie-trunk-precommit-build/2785/
% Total % Received % Xferd Average Speed Time Time Time Current
Dload Upload Total Spent Left Speed
0 0 0 0 0 0 0 0 --:--:-- --:--:-- --:--:-- 0
0 0 0 0 0 0 0 0 --:--:-- --:--:-- --:--:-- 0
100 3706k 100 3706k 0 0 3728k 0 --:--:-- --:--:-- --:--:-- 3728k
Adding comment to JIRA
Comment added.
test-patch exit code: 1
Build step 'Execute shell' marked build as failure
Archiving artifacts
Recording test results
Build failed in Jenkins: oozie-trunk-precommit-build #2784
Posted by Apache Jenkins Server <je...@builds.apache.org>.
See <https://builds.apache.org/job/oozie-trunk-precommit-build/2784/>
------------------------------------------
[...truncated 8438 lines...]
[INFO] --- maven-assembly-plugin:2.2.1:single (default-cli) @ oozie-tools ---
[INFO] Reading assembly descriptor: ../src/main/assemblies/tools.xml
[WARNING] The following patterns were never triggered in this artifact exclusion filter:
o '*:*:pom:*'
[INFO] Copying files to <https://builds.apache.org/job/oozie-trunk-precommit-build/ws/tools/target/oozie-tools-4.3.0-SNAPSHOT-tools>
[WARNING] Assembly file: <https://builds.apache.org/job/oozie-trunk-precommit-build/ws/tools/target/oozie-tools-4.3.0-SNAPSHOT-tools> is not a regular file (it may be a directory). It cannot be attached to the project build for installation or deployment.
[INFO]
[INFO] ------------------------------------------------------------------------
[INFO] Building Apache Oozie MiniOozie 4.3.0-SNAPSHOT
[INFO] ------------------------------------------------------------------------
[INFO]
[INFO] --- maven-remote-resources-plugin:1.5:process (default) @ oozie-mini ---
[INFO]
[INFO] --- maven-resources-plugin:2.5:resources (default-resources) @ oozie-mini ---
[debug] execute contextualize
[INFO] Using 'UTF-8' encoding to copy filtered resources.
[INFO] skip non existing resourceDirectory <https://builds.apache.org/job/oozie-trunk-precommit-build/ws/minitest/src/main/resources>
[INFO] Copying 3 resources
[INFO]
[INFO] --- maven-compiler-plugin:2.3.2:compile (default-compile) @ oozie-mini ---
[INFO] No sources to compile
[INFO]
[INFO] --- maven-resources-plugin:2.5:testResources (default-testResources) @ oozie-mini ---
[debug] execute contextualize
[INFO] Using 'UTF-8' encoding to copy filtered resources.
[INFO] Copying 3 resources
[INFO] Copying 3 resources
[INFO]
[INFO] --- maven-compiler-plugin:2.3.2:testCompile (default-testCompile) @ oozie-mini ---
[INFO] Nothing to compile - all classes are up to date
[INFO]
[INFO] --- maven-surefire-plugin:2.12.2:test (default-test) @ oozie-mini ---
[INFO] Tests are skipped.
[INFO]
[INFO] --- maven-jar-plugin:2.3.1:jar (default-jar) @ oozie-mini ---
[INFO] Building jar: <https://builds.apache.org/job/oozie-trunk-precommit-build/ws/minitest/target/oozie-mini-4.3.0-SNAPSHOT.jar>
[INFO]
[INFO] --- maven-site-plugin:2.0-beta-6:attach-descriptor (attach-descriptor) @ oozie-mini ---
[INFO]
[INFO] --- maven-assembly-plugin:2.2.1:single (default-cli) @ oozie-mini ---
[INFO] Reading assembly descriptor: src/main/assemblies/empty.xml
[INFO]
[INFO] ------------------------------------------------------------------------
[INFO] Building Apache Oozie Distro 4.3.0-SNAPSHOT
[INFO] ------------------------------------------------------------------------
[INFO]
[INFO] --- maven-remote-resources-plugin:1.5:process (default) @ oozie-distro ---
[INFO]
[INFO] --- maven-resources-plugin:2.5:resources (default-resources) @ oozie-distro ---
[debug] execute contextualize
[INFO] Using 'UTF-8' encoding to copy filtered resources.
[INFO] skip non existing resourceDirectory <https://builds.apache.org/job/oozie-trunk-precommit-build/ws/distro/src/main/resources>
[INFO] Copying 3 resources
[INFO]
[INFO] --- maven-compiler-plugin:2.3.2:compile (default-compile) @ oozie-distro ---
[INFO] No sources to compile
[INFO]
[INFO] --- maven-resources-plugin:2.5:testResources (default-testResources) @ oozie-distro ---
[debug] execute contextualize
[INFO] Using 'UTF-8' encoding to copy filtered resources.
[INFO] skip non existing resourceDirectory <https://builds.apache.org/job/oozie-trunk-precommit-build/ws/distro/src/test/resources>
[INFO] Copying 3 resources
[INFO]
[INFO] --- maven-compiler-plugin:2.3.2:testCompile (default-testCompile) @ oozie-distro ---
[INFO] No sources to compile
[INFO]
[INFO] --- maven-surefire-plugin:2.12.2:test (default-test) @ oozie-distro ---
[INFO] Tests are skipped.
[INFO]
[INFO] --- maven-jar-plugin:2.3.1:jar (default-jar) @ oozie-distro ---
[INFO] Building jar: <https://builds.apache.org/job/oozie-trunk-precommit-build/ws/distro/target/oozie-distro-4.3.0-SNAPSHOT.jar>
[INFO]
[INFO] --- maven-site-plugin:2.0-beta-6:attach-descriptor (attach-descriptor) @ oozie-distro ---
[INFO]
[INFO] --- maven-antrun-plugin:1.6:run (default) @ oozie-distro ---
[INFO] Executing tasks
main:
[mkdir] Created dir: <https://builds.apache.org/job/oozie-trunk-precommit-build/ws/distro/downloads>
[get] Getting: http://archive.apache.org/dist/tomcat/tomcat-6/v6.0.44/bin/apache-tomcat-6.0.44.tar.gz
[get] To: <https://builds.apache.org/job/oozie-trunk-precommit-build/ws/distro/downloads/tomcat-6.0.44.tar.gz>
........................................................................................................................................................................................................................................................................................................................................................................................................................................................................................................................................................................................................................................................................................................................................................................................................................................................................................................................................................................................................
[mkdir] Created dir: <https://builds.apache.org/job/oozie-trunk-precommit-build/ws/distro/target/tomcat>
[gunzip] Expanding <https://builds.apache.org/job/oozie-trunk-precommit-build/ws/distro/downloads/tomcat-6.0.44.tar.gz> to <https://builds.apache.org/job/oozie-trunk-precommit-build/ws/distro/target/tomcat/tomcat-6.0.44.tar>
[untar] Expanding: <https://builds.apache.org/job/oozie-trunk-precommit-build/ws/distro/target/tomcat/tomcat-6.0.44.tar> into <https://builds.apache.org/job/oozie-trunk-precommit-build/ws/distro/target/tomcat>
[delete] Deleting directory <https://builds.apache.org/job/oozie-trunk-precommit-build/ws/distro/target/tomcat/oozie-server/webapps>
[mkdir] Created dir: <https://builds.apache.org/job/oozie-trunk-precommit-build/ws/distro/target/tomcat/oozie-server/webapps>
[delete] Deleting: <https://builds.apache.org/job/oozie-trunk-precommit-build/ws/distro/target/tomcat/oozie-server/conf/server.xml>
[copy] Copying 1 file to <https://builds.apache.org/job/oozie-trunk-precommit-build/ws/distro/target/tomcat/oozie-server/conf>
[copy] Copying 1 file to <https://builds.apache.org/job/oozie-trunk-precommit-build/ws/distro/target/tomcat/oozie-server/conf>
[mkdir] Created dir: <https://builds.apache.org/job/oozie-trunk-precommit-build/ws/distro/target/tomcat/oozie-server/conf/ssl>
[copy] Copying 1 file to <https://builds.apache.org/job/oozie-trunk-precommit-build/ws/distro/target/tomcat/oozie-server/conf/ssl>
[copy] Copying 1 file to <https://builds.apache.org/job/oozie-trunk-precommit-build/ws/distro/target/tomcat/oozie-server/conf/ssl>
[copy] Copying 1 file to <https://builds.apache.org/job/oozie-trunk-precommit-build/ws/distro/target/tomcat/oozie-server/conf/ssl>
[copy] Copying 3 files to <https://builds.apache.org/job/oozie-trunk-precommit-build/ws/distro/target/tomcat/oozie-server/webapps/ROOT>
[INFO] Executed tasks
[INFO]
[INFO] --- maven-assembly-plugin:2.2.1:single (default-cli) @ oozie-distro ---
[INFO] Reading assembly descriptor: ../src/main/assemblies/distro.xml
[INFO] Copying files to <https://builds.apache.org/job/oozie-trunk-precommit-build/ws/distro/target/oozie-4.3.0-SNAPSHOT-distro>
[WARNING] Assembly file: <https://builds.apache.org/job/oozie-trunk-precommit-build/ws/distro/target/oozie-4.3.0-SNAPSHOT-distro> is not a regular file (it may be a directory). It cannot be attached to the project build for installation or deployment.
[INFO] Building tar : <https://builds.apache.org/job/oozie-trunk-precommit-build/ws/distro/target/oozie-4.3.0-SNAPSHOT-distro.tar.gz>
[INFO]
[INFO] ------------------------------------------------------------------------
[INFO] Building Apache Oozie ZooKeeper Security Tests 4.3.0-SNAPSHOT
[INFO] ------------------------------------------------------------------------
[INFO]
[INFO] --- maven-remote-resources-plugin:1.5:process (default) @ oozie-zookeeper-security-tests ---
[INFO]
[INFO] --- maven-resources-plugin:2.5:resources (default-resources) @ oozie-zookeeper-security-tests ---
[debug] execute contextualize
[INFO] Using 'UTF-8' encoding to copy filtered resources.
[INFO] skip non existing resourceDirectory <https://builds.apache.org/job/oozie-trunk-precommit-build/ws/zookeeper-security-tests/src/main/resources>
[INFO] Copying 3 resources
[INFO]
[INFO] --- maven-compiler-plugin:2.3.2:compile (default-compile) @ oozie-zookeeper-security-tests ---
[INFO] No sources to compile
[INFO]
[INFO] --- maven-resources-plugin:2.5:testResources (default-testResources) @ oozie-zookeeper-security-tests ---
[debug] execute contextualize
[INFO] Using 'UTF-8' encoding to copy filtered resources.
[INFO] skip non existing resourceDirectory <https://builds.apache.org/job/oozie-trunk-precommit-build/ws/zookeeper-security-tests/src/test/resources>
[INFO] Copying 3 resources
[INFO]
[INFO] --- maven-compiler-plugin:2.3.2:testCompile (default-testCompile) @ oozie-zookeeper-security-tests ---
[INFO] Nothing to compile - all classes are up to date
[INFO]
[INFO] --- maven-surefire-plugin:2.12.2:test (default-test) @ oozie-zookeeper-security-tests ---
[INFO] Tests are skipped.
[INFO]
[INFO] --- maven-jar-plugin:2.3.1:jar (default-jar) @ oozie-zookeeper-security-tests ---
[INFO] Building jar: <https://builds.apache.org/job/oozie-trunk-precommit-build/ws/zookeeper-security-tests/target/oozie-zookeeper-security-tests-4.3.0-SNAPSHOT.jar>
[INFO]
[INFO] --- maven-site-plugin:2.0-beta-6:attach-descriptor (attach-descriptor) @ oozie-zookeeper-security-tests ---
[INFO]
[INFO] --- maven-assembly-plugin:2.2.1:single (default-cli) @ oozie-zookeeper-security-tests ---
[INFO] Reading assembly descriptor: src/main/assemblies/empty.xml
[INFO] ------------------------------------------------------------------------
[INFO] Reactor Summary:
[INFO]
[INFO] Apache Oozie Main ................................. SUCCESS [ 2.474 s]
[INFO] Apache Oozie Hadoop Utils ......................... SUCCESS [ 0.749 s]
[INFO] Apache Oozie Hadoop Distcp hadoop-1-4.3.0-SNAPSHOT SUCCESS [ 0.216 s]
[INFO] Apache Oozie Hadoop Auth hadoop-1-4.3.0-SNAPSHOT .. SUCCESS [ 0.316 s]
[INFO] Apache Oozie Hadoop Libs .......................... SUCCESS [ 0.040 s]
[INFO] Apache Oozie Client ............................... SUCCESS [ 35.627 s]
[INFO] Apache Oozie Share Lib Oozie ...................... SUCCESS [ 1.361 s]
[INFO] Apache Oozie Share Lib HCatalog ................... SUCCESS [ 1.588 s]
[INFO] Apache Oozie Share Lib Distcp ..................... SUCCESS [ 0.270 s]
[INFO] Apache Oozie Core ................................. SUCCESS [ 49.762 s]
[INFO] Apache Oozie Share Lib Streaming .................. SUCCESS [ 1.994 s]
[INFO] Apache Oozie Share Lib Pig ........................ SUCCESS [ 1.583 s]
[INFO] Apache Oozie Share Lib Hive ....................... SUCCESS [ 3.111 s]
[INFO] Apache Oozie Share Lib Hive 2 ..................... SUCCESS [ 2.219 s]
[INFO] Apache Oozie Share Lib Sqoop ...................... SUCCESS [ 0.475 s]
[INFO] Apache Oozie Examples ............................. SUCCESS [ 2.082 s]
[INFO] Apache Oozie Share Lib Spark ...................... SUCCESS [ 5.156 s]
[INFO] Apache Oozie Share Lib ............................ SUCCESS [ 20.354 s]
[INFO] Apache Oozie Docs ................................. SUCCESS [ 15.712 s]
[INFO] Apache Oozie WebApp ............................... SUCCESS [ 28.822 s]
[INFO] Apache Oozie Tools ................................ SUCCESS [ 0.831 s]
[INFO] Apache Oozie MiniOozie ............................ SUCCESS [ 0.304 s]
[INFO] Apache Oozie Distro ............................... SUCCESS [ 46.625 s]
[INFO] Apache Oozie ZooKeeper Security Tests ............. SUCCESS [ 2.227 s]
[INFO] ------------------------------------------------------------------------
[INFO] BUILD SUCCESS
[INFO] ------------------------------------------------------------------------
[INFO] Total time: 03:46 min
[INFO] Finished at: 2016-03-24T23:14:40+00:00
[INFO] Final Memory: 67M/925M
[INFO] ------------------------------------------------------------------------
Reports
Running test-patch task CLEAN
Running test-patch task RAW_PATCH_ANALYSIS
Running test-patch task RAT
Running test-patch task JAVADOC
Running test-patch task COMPILE
Running test-patch task BACKWARDS_COMPATIBILITY
Running test-patch task TESTS
Running test-patch task DISTRO
Testing JIRA OOZIE-2492
Cleaning local git workspace
----------------------------
+1 PATCH_APPLIES
+1 CLEAN
-1 RAW_PATCH_ANALYSIS
+1 the patch does not introduce any @author tags
+1 the patch does not introduce any tabs
+1 the patch does not introduce any trailing spaces
+1 the patch does not introduce any line longer than 132
-1 the patch does not add/modify any testcase
+1 RAT
+1 the patch does not seem to introduce new RAT warnings
+1 JAVADOC
+1 the patch does not seem to introduce new Javadoc warnings
+1 COMPILE
+1 HEAD compiles
+1 patch compiles
+1 the patch does not seem to introduce new javac warnings
+1 BACKWARDS_COMPATIBILITY
+1 the patch does not change any JPA Entity/Colum/Basic/Lob/Transient annotations
+1 the patch does not modify JPA files
-1 TESTS
Tests run: 1768
Tests failed: 7
Tests errors: 2
The patch failed the following testcases:
testNone(org.apache.oozie.command.coord.TestCoordActionInputCheckXCommand)
testIDGeneration(org.apache.oozie.service.TestZKUUIDService)
testMain(org.apache.oozie.action.hadoop.TestHiveMain)
testPigScript(org.apache.oozie.action.hadoop.TestPigMain)
testPig_withNullExternalID(org.apache.oozie.action.hadoop.TestPigMain)
testEmbeddedPigWithinPython(org.apache.oozie.action.hadoop.TestPigMain)
testPigScript(org.apache.oozie.action.hadoop.TestPigMainWithOldAPI)
+1 DISTRO
+1 distro tarball builds with the patch
----------------------------
-1 Overall result, please check the reported -1(s)
The full output of the test-patch run is available at
https://builds.apache.org/job/oozie-trunk-precommit-build/2784/
% Total % Received % Xferd Average Speed Time Time Time Current
Dload Upload Total Spent Left Speed
0 0 0 0 0 0 0 0 --:--:-- --:--:-- --:--:-- 0
21 3706k 21 799k 0 0 1204k 0 0:00:03 --:--:-- 0:00:03 1203k
100 3706k 100 3706k 0 0 3307k 0 0:00:01 0:00:01 --:--:-- 3309k
Adding comment to JIRA
Comment added.
test-patch exit code: 1
Build step 'Execute shell' marked build as failure
Archiving artifacts
Recording test results
Build failed in Jenkins: oozie-trunk-precommit-build #2783
Posted by Apache Jenkins Server <je...@builds.apache.org>.
See <https://builds.apache.org/job/oozie-trunk-precommit-build/2783/changes>
Changes:
[rkanter] OOZIE-2429 TestEventGeneration test is flakey addendum (fdenes via
------------------------------------------
[...truncated 2472 lines...]
[debug] execute contextualize
[INFO] Using 'UTF-8' encoding to copy filtered resources.
[INFO] Copying 2 resources
[INFO] Copying 3 resources
[INFO]
[INFO] --- maven-compiler-plugin:2.3.2:testCompile (default-testCompile) @ oozie-tools ---
[INFO] Compiling 6 source files to <https://builds.apache.org/job/oozie-trunk-precommit-build/ws/tools/target/test-classes>
[WARNING] <https://builds.apache.org/job/oozie-trunk-precommit-build/ws/tools/src/test/java/org/apache/oozie/tools/TestOozieSharelibCLI.java>:[196,20] [deprecation] getConf() in Services has been deprecated
[INFO]
[INFO] --- maven-surefire-plugin:2.12.2:test (default-test) @ oozie-tools ---
[INFO] Tests are skipped.
[INFO]
[INFO] ------------------------------------------------------------------------
[INFO] Building Apache Oozie MiniOozie 4.3.0-SNAPSHOT
[INFO] ------------------------------------------------------------------------
[INFO]
[INFO] --- maven-clean-plugin:2.5:clean (default-clean) @ oozie-mini ---
[INFO] Deleting <https://builds.apache.org/job/oozie-trunk-precommit-build/ws/minitest/target>
[INFO]
[INFO] --- maven-remote-resources-plugin:1.5:process (default) @ oozie-mini ---
[INFO]
[INFO] --- maven-resources-plugin:2.5:resources (default-resources) @ oozie-mini ---
[debug] execute contextualize
[INFO] Using 'UTF-8' encoding to copy filtered resources.
[INFO] skip non existing resourceDirectory <https://builds.apache.org/job/oozie-trunk-precommit-build/ws/minitest/src/main/resources>
[INFO] Copying 3 resources
[INFO]
[INFO] --- maven-compiler-plugin:2.3.2:compile (default-compile) @ oozie-mini ---
[INFO] No sources to compile
[INFO]
[INFO] --- maven-resources-plugin:2.5:testResources (default-testResources) @ oozie-mini ---
[debug] execute contextualize
[INFO] Using 'UTF-8' encoding to copy filtered resources.
[INFO] Copying 3 resources
[INFO] Copying 3 resources
[INFO]
[INFO] --- maven-compiler-plugin:2.3.2:testCompile (default-testCompile) @ oozie-mini ---
[INFO] Compiling 1 source file to <https://builds.apache.org/job/oozie-trunk-precommit-build/ws/minitest/target/test-classes>
[INFO]
[INFO] --- maven-surefire-plugin:2.12.2:test (default-test) @ oozie-mini ---
[INFO] Tests are skipped.
[INFO]
[INFO] ------------------------------------------------------------------------
[INFO] Building Apache Oozie WorkflowGenerator 4.3.0-SNAPSHOT
[INFO] ------------------------------------------------------------------------
Downloading: http://repository.apache.org/snapshots/com/orange/links/gwt-links/1.3-SNAPSHOT/maven-metadata.xml
Downloading: https://repository.apache.org/content/groups/snapshots/com/orange/links/gwt-links/1.3-SNAPSHOT/maven-metadata.xml
Downloading: http://gwt-links.googlecode.com/svn/repository/com/orange/links/gwt-links/1.3-SNAPSHOT/maven-metadata.xml
Downloading: http://gwt-links.googlecode.com/svn/repository/com/orange/links/gwt-links-parent/1.3-SNAPSHOT/maven-metadata.xml
Downloading: https://repository.apache.org/content/groups/snapshots/com/orange/links/gwt-links-parent/1.3-SNAPSHOT/maven-metadata.xml
Downloading: http://repository.apache.org/snapshots/com/orange/links/gwt-links-parent/1.3-SNAPSHOT/maven-metadata.xml
605/605 B
Downloaded: http://gwt-links.googlecode.com/svn/repository/com/orange/links/gwt-links-parent/1.3-SNAPSHOT/maven-metadata.xml (605 B at 1.5 KB/sec)
[INFO]
[INFO] --- maven-clean-plugin:2.5:clean (default-clean) @ oozie-workflowgenerator ---
[INFO] Deleting <https://builds.apache.org/job/oozie-trunk-precommit-build/ws/workflowgenerator/target>
[INFO]
[INFO] --- maven-remote-resources-plugin:1.5:process (default) @ oozie-workflowgenerator ---
[INFO]
[INFO] --- maven-resources-plugin:2.5:resources (default-resources) @ oozie-workflowgenerator ---
[debug] execute contextualize
[INFO] Using 'UTF-8' encoding to copy filtered resources.
[INFO] Copying 24 resources to ../../img
[INFO] Copying 3 resources
[INFO]
[INFO] --- maven-compiler-plugin:2.3.2:compile (default-compile) @ oozie-workflowgenerator ---
[INFO] Compiling 39 source files to <https://builds.apache.org/job/oozie-trunk-precommit-build/ws/workflowgenerator/target/oozie-wfgen/WEB-INF/classes>
[WARNING] <https://builds.apache.org/job/oozie-trunk-precommit-build/ws/workflowgenerator/src/main/java/org/apache/oozie/tools/workflowgenerator/client/OozieWorkflowGenerator.java>:[243,30] [deprecation] TreeItem(String) in TreeItem has been deprecated
[WARNING] <https://builds.apache.org/job/oozie-trunk-precommit-build/ws/workflowgenerator/src/main/java/org/apache/oozie/tools/workflowgenerator/client/OozieWorkflowGenerator.java>:[270,30] [deprecation] TreeItem(String) in TreeItem has been deprecated
[WARNING] <https://builds.apache.org/job/oozie-trunk-precommit-build/ws/workflowgenerator/src/main/java/org/apache/oozie/tools/workflowgenerator/client/OozieWorkflowGenerator.java>:[271,26] [deprecation] TreeItem(String) in TreeItem has been deprecated
[WARNING] <https://builds.apache.org/job/oozie-trunk-precommit-build/ws/workflowgenerator/src/main/java/org/apache/oozie/tools/workflowgenerator/client/OozieWorkflowGenerator.java>:[272,14] [deprecation] addItem(String) in TreeItem has been deprecated
[WARNING] <https://builds.apache.org/job/oozie-trunk-precommit-build/ws/workflowgenerator/src/main/java/org/apache/oozie/tools/workflowgenerator/client/OozieWorkflowGenerator.java>:[273,14] [deprecation] addItem(String) in TreeItem has been deprecated
[WARNING] <https://builds.apache.org/job/oozie-trunk-precommit-build/ws/workflowgenerator/src/main/java/org/apache/oozie/tools/workflowgenerator/client/OozieWorkflowGenerator.java>:[275,18] [deprecation] addItem(String) in TreeItem has been deprecated
[WARNING] <https://builds.apache.org/job/oozie-trunk-precommit-build/ws/workflowgenerator/src/main/java/org/apache/oozie/tools/workflowgenerator/client/OozieWorkflowGenerator.java>:[276,18] [deprecation] addItem(String) in TreeItem has been deprecated
[WARNING] <https://builds.apache.org/job/oozie-trunk-precommit-build/ws/workflowgenerator/src/main/java/org/apache/oozie/tools/workflowgenerator/client/OozieWorkflowGenerator.java>:[277,18] [deprecation] addItem(String) in TreeItem has been deprecated
[WARNING] <https://builds.apache.org/job/oozie-trunk-precommit-build/ws/workflowgenerator/src/main/java/org/apache/oozie/tools/workflowgenerator/client/OozieWorkflowGenerator.java>:[278,18] [deprecation] addItem(String) in TreeItem has been deprecated
[WARNING] <https://builds.apache.org/job/oozie-trunk-precommit-build/ws/workflowgenerator/src/main/java/org/apache/oozie/tools/workflowgenerator/client/OozieWorkflowGenerator.java>:[279,18] [deprecation] addItem(String) in TreeItem has been deprecated
[WARNING] <https://builds.apache.org/job/oozie-trunk-precommit-build/ws/workflowgenerator/src/main/java/org/apache/oozie/tools/workflowgenerator/client/OozieWorkflowGenerator.java>:[280,18] [deprecation] addItem(String) in TreeItem has been deprecated
[WARNING] <https://builds.apache.org/job/oozie-trunk-precommit-build/ws/workflowgenerator/src/main/java/org/apache/oozie/tools/workflowgenerator/client/OozieWorkflowGenerator.java>:[281,18] [deprecation] addItem(String) in TreeItem has been deprecated
[WARNING] <https://builds.apache.org/job/oozie-trunk-precommit-build/ws/workflowgenerator/src/main/java/org/apache/oozie/tools/workflowgenerator/client/OozieWorkflowGenerator.java>:[284,31] [deprecation] TreeItem(String) in TreeItem has been deprecated
[WARNING] <https://builds.apache.org/job/oozie-trunk-precommit-build/ws/workflowgenerator/src/main/java/org/apache/oozie/tools/workflowgenerator/client/OozieWorkflowGenerator.java>:[285,19] [deprecation] addItem(String) in TreeItem has been deprecated
[WARNING] <https://builds.apache.org/job/oozie-trunk-precommit-build/ws/workflowgenerator/src/main/java/org/apache/oozie/tools/workflowgenerator/client/OozieWorkflowGenerator.java>:[286,19] [deprecation] addItem(String) in TreeItem has been deprecated
[WARNING] <https://builds.apache.org/job/oozie-trunk-precommit-build/ws/workflowgenerator/src/main/java/org/apache/oozie/tools/workflowgenerator/client/OozieWorkflowGenerator.java>:[287,19] [deprecation] addItem(String) in TreeItem has been deprecated
[WARNING] <https://builds.apache.org/job/oozie-trunk-precommit-build/ws/workflowgenerator/src/main/java/org/apache/oozie/tools/workflowgenerator/client/OozieWorkflowGenerator.java>:[288,19] [deprecation] addItem(String) in TreeItem has been deprecated
[WARNING] <https://builds.apache.org/job/oozie-trunk-precommit-build/ws/workflowgenerator/src/main/java/org/apache/oozie/tools/workflowgenerator/client/OozieWorkflowGenerator.java>:[289,19] [deprecation] addItem(String) in TreeItem has been deprecated
[WARNING] <https://builds.apache.org/job/oozie-trunk-precommit-build/ws/workflowgenerator/src/main/java/org/apache/oozie/tools/workflowgenerator/client/property/action/SubWFPropertyTable.java>:[129,11] [deprecation] setChecked(boolean) in CheckBox has been deprecated
[WARNING] <https://builds.apache.org/job/oozie-trunk-precommit-build/ws/workflowgenerator/src/main/java/org/apache/oozie/tools/workflowgenerator/client/property/action/SSHPropertyTable.java>:[150,11] [deprecation] setChecked(boolean) in CheckBox has been deprecated
[WARNING] <https://builds.apache.org/job/oozie-trunk-precommit-build/ws/workflowgenerator/src/main/java/org/apache/oozie/tools/workflowgenerator/client/property/action/JavaPropertyTable.java>:[126,11] [deprecation] setChecked(boolean) in CheckBox has been deprecated
[WARNING] <https://builds.apache.org/job/oozie-trunk-precommit-build/ws/workflowgenerator/src/main/java/org/apache/oozie/tools/workflowgenerator/client/property/action/ShellPropertyTable.java>:[184,11] [deprecation] setChecked(boolean) in CheckBox has been deprecated
[INFO]
[INFO] --- maven-war-plugin:2.1.1:exploded (default) @ oozie-workflowgenerator ---
[INFO] Exploding webapp
[INFO] Assembling webapp [oozie-workflowgenerator] in [<https://builds.apache.org/job/oozie-trunk-precommit-build/ws/workflowgenerator/target/oozie-wfgen]>
[INFO] Processing war project
[INFO] Copying webapp resources [<https://builds.apache.org/job/oozie-trunk-precommit-build/ws/workflowgenerator/src/main/webapp]>
[INFO] Webapp assembled in [121 msecs]
[INFO]
[INFO] --- maven-resources-plugin:2.5:testResources (default-testResources) @ oozie-workflowgenerator ---
[debug] execute contextualize
[INFO] Using 'UTF-8' encoding to copy filtered resources.
[INFO] skip non existing resourceDirectory <https://builds.apache.org/job/oozie-trunk-precommit-build/ws/workflowgenerator/src/test/resources>
[INFO] Copying 3 resources
[INFO]
[INFO] --- maven-compiler-plugin:2.3.2:testCompile (default-testCompile) @ oozie-workflowgenerator ---
[INFO] Compiling 1 source file to <https://builds.apache.org/job/oozie-trunk-precommit-build/ws/workflowgenerator/target/test-classes>
[INFO]
[INFO] --- maven-surefire-plugin:2.12.2:test (default-test) @ oozie-workflowgenerator ---
[INFO] Tests are skipped.
[INFO]
[INFO] ------------------------------------------------------------------------
[INFO] Building Apache Oozie Distro 4.3.0-SNAPSHOT
[INFO] ------------------------------------------------------------------------
[INFO]
[INFO] --- maven-clean-plugin:2.5:clean (default-clean) @ oozie-distro ---
[INFO] Deleting <https://builds.apache.org/job/oozie-trunk-precommit-build/ws/distro/target>
[INFO]
[INFO] --- maven-remote-resources-plugin:1.5:process (default) @ oozie-distro ---
[INFO]
[INFO] --- maven-resources-plugin:2.5:resources (default-resources) @ oozie-distro ---
[debug] execute contextualize
[INFO] Using 'UTF-8' encoding to copy filtered resources.
[INFO] skip non existing resourceDirectory <https://builds.apache.org/job/oozie-trunk-precommit-build/ws/distro/src/main/resources>
[INFO] Copying 3 resources
[INFO]
[INFO] --- maven-compiler-plugin:2.3.2:compile (default-compile) @ oozie-distro ---
[INFO] No sources to compile
[INFO]
[INFO] --- maven-resources-plugin:2.5:testResources (default-testResources) @ oozie-distro ---
[debug] execute contextualize
[INFO] Using 'UTF-8' encoding to copy filtered resources.
[INFO] skip non existing resourceDirectory <https://builds.apache.org/job/oozie-trunk-precommit-build/ws/distro/src/test/resources>
[INFO] Copying 3 resources
[INFO]
[INFO] --- maven-compiler-plugin:2.3.2:testCompile (default-testCompile) @ oozie-distro ---
[INFO] No sources to compile
[INFO]
[INFO] --- maven-surefire-plugin:2.12.2:test (default-test) @ oozie-distro ---
[INFO] Tests are skipped.
[INFO]
[INFO] ------------------------------------------------------------------------
[INFO] Building Apache Oozie ZooKeeper Security Tests 4.3.0-SNAPSHOT
[INFO] ------------------------------------------------------------------------
[INFO]
[INFO] --- maven-clean-plugin:2.5:clean (default-clean) @ oozie-zookeeper-security-tests ---
[INFO] Deleting <https://builds.apache.org/job/oozie-trunk-precommit-build/ws/zookeeper-security-tests/target>
[INFO]
[INFO] --- maven-remote-resources-plugin:1.5:process (default) @ oozie-zookeeper-security-tests ---
[INFO]
[INFO] --- maven-resources-plugin:2.5:resources (default-resources) @ oozie-zookeeper-security-tests ---
[debug] execute contextualize
[INFO] Using 'UTF-8' encoding to copy filtered resources.
[INFO] skip non existing resourceDirectory <https://builds.apache.org/job/oozie-trunk-precommit-build/ws/zookeeper-security-tests/src/main/resources>
[INFO] Copying 3 resources
[INFO]
[INFO] --- maven-compiler-plugin:2.3.2:compile (default-compile) @ oozie-zookeeper-security-tests ---
[INFO] No sources to compile
[INFO]
[INFO] --- maven-resources-plugin:2.5:testResources (default-testResources) @ oozie-zookeeper-security-tests ---
[debug] execute contextualize
[INFO] Using 'UTF-8' encoding to copy filtered resources.
[INFO] skip non existing resourceDirectory <https://builds.apache.org/job/oozie-trunk-precommit-build/ws/zookeeper-security-tests/src/test/resources>
[INFO] Copying 3 resources
[INFO]
[INFO] --- maven-compiler-plugin:2.3.2:testCompile (default-testCompile) @ oozie-zookeeper-security-tests ---
[INFO] Compiling 2 source files to <https://builds.apache.org/job/oozie-trunk-precommit-build/ws/zookeeper-security-tests/target/test-classes>
[WARNING] <https://builds.apache.org/job/oozie-trunk-precommit-build/ws/zookeeper-security-tests/src/test/java/org/apache/oozie/test/ZKXTestCaseWithSecurity.java>:[55,42] [deprecation] getConf() in Services has been deprecated
[WARNING] <https://builds.apache.org/job/oozie-trunk-precommit-build/ws/zookeeper-security-tests/src/test/java/org/apache/oozie/test/ZKXTestCaseWithSecurity.java>:[56,42] [deprecation] getConf() in Services has been deprecated
[WARNING] <https://builds.apache.org/job/oozie-trunk-precommit-build/ws/zookeeper-security-tests/src/test/java/org/apache/oozie/test/ZKXTestCaseWithSecurity.java>:[57,22] [deprecation] getConf() in Services has been deprecated
[WARNING] <https://builds.apache.org/job/oozie-trunk-precommit-build/ws/zookeeper-security-tests/src/test/java/org/apache/oozie/test/ZKXTestCaseWithSecurity.java>:[58,22] [deprecation] getConf() in Services has been deprecated
[WARNING] <https://builds.apache.org/job/oozie-trunk-precommit-build/ws/zookeeper-security-tests/src/test/java/org/apache/oozie/test/ZKXTestCaseWithSecurity.java>:[64,22] [deprecation] getConf() in Services has been deprecated
[WARNING] <https://builds.apache.org/job/oozie-trunk-precommit-build/ws/zookeeper-security-tests/src/test/java/org/apache/oozie/test/ZKXTestCaseWithSecurity.java>:[65,22] [deprecation] getConf() in Services has been deprecated
[WARNING] <https://builds.apache.org/job/oozie-trunk-precommit-build/ws/zookeeper-security-tests/src/test/java/org/apache/oozie/test/ZKXTestCaseWithSecurity.java>:[67,22] [deprecation] getConf() in Services has been deprecated
[WARNING] <https://builds.apache.org/job/oozie-trunk-precommit-build/ws/zookeeper-security-tests/src/test/java/org/apache/oozie/util/TestZKUtilsWithSecurity.java>:[108,26] [deprecation] getConf() in Services has been deprecated
[WARNING] <https://builds.apache.org/job/oozie-trunk-precommit-build/ws/zookeeper-security-tests/src/test/java/org/apache/oozie/util/TestZKUtilsWithSecurity.java>:[139,26] [deprecation] getConf() in Services has been deprecated
[WARNING] <https://builds.apache.org/job/oozie-trunk-precommit-build/ws/zookeeper-security-tests/src/test/java/org/apache/oozie/util/TestZKUtilsWithSecurity.java>:[149,26] [deprecation] getConf() in Services has been deprecated
[WARNING] <https://builds.apache.org/job/oozie-trunk-precommit-build/ws/zookeeper-security-tests/src/test/java/org/apache/oozie/util/TestZKUtilsWithSecurity.java>:[185,26] [deprecation] getConf() in Services has been deprecated
[INFO]
[INFO] --- maven-surefire-plugin:2.12.2:test (default-test) @ oozie-zookeeper-security-tests ---
[INFO] Tests are skipped.
[INFO] ------------------------------------------------------------------------
[INFO] Reactor Summary:
[INFO]
[INFO] Apache Oozie Main ................................. SUCCESS [ 1.179 s]
[INFO] Apache Oozie Hadoop Utils ......................... SUCCESS [ 1.558 s]
[INFO] Apache Oozie Hadoop Distcp hadoop-1-4.3.0-SNAPSHOT SUCCESS [ 0.062 s]
[INFO] Apache Oozie Hadoop Auth hadoop-1-4.3.0-SNAPSHOT .. SUCCESS [ 0.147 s]
[INFO] Apache Oozie Hadoop Libs .......................... SUCCESS [ 0.027 s]
[INFO] Apache Oozie Client ............................... SUCCESS [ 6.375 s]
[INFO] Apache Oozie Share Lib Oozie ...................... SUCCESS [ 3.305 s]
[INFO] Apache Oozie Share Lib HCatalog ................... SUCCESS [ 3.554 s]
[INFO] Apache Oozie Share Lib Distcp ..................... SUCCESS [ 1.281 s]
[INFO] Apache Oozie Core ................................. SUCCESS [ 28.728 s]
[INFO] Apache Oozie Share Lib Streaming .................. SUCCESS [ 6.401 s]
[INFO] Apache Oozie Share Lib Pig ........................ SUCCESS [ 5.792 s]
[INFO] Apache Oozie Share Lib Hive ....................... SUCCESS [ 5.447 s]
[INFO] Apache Oozie Share Lib Hive 2 ..................... SUCCESS [ 4.733 s]
[INFO] Apache Oozie Share Lib Sqoop ...................... SUCCESS [ 4.622 s]
[INFO] Apache Oozie Examples ............................. SUCCESS [ 6.298 s]
[INFO] Apache Oozie Share Lib Spark ...................... SUCCESS [ 9.780 s]
[INFO] Apache Oozie Share Lib ............................ SUCCESS [ 0.022 s]
[INFO] Apache Oozie Docs ................................. SUCCESS [ 1.057 s]
[INFO] Apache Oozie WebApp ............................... SUCCESS [ 0.857 s]
[INFO] Apache Oozie Tools ................................ SUCCESS [ 5.596 s]
[INFO] Apache Oozie MiniOozie ............................ SUCCESS [ 2.524 s]
[INFO] Apache Oozie WorkflowGenerator .................... SUCCESS [ 7.402 s]
[INFO] Apache Oozie Distro ............................... SUCCESS [ 1.242 s]
[INFO] Apache Oozie ZooKeeper Security Tests ............. SUCCESS [ 3.974 s]
[INFO] ------------------------------------------------------------------------
[INFO] BUILD SUCCESS
[INFO] ------------------------------------------------------------------------
[INFO] Total time: 01:53 min
[INFO] Finished at: 2016-03-24T20:45:49+00:00
[INFO] Final Memory: 59M/1063M
[INFO] ------------------------------------------------------------------------
[WARNING] The requested profile "testPatchCompile" could not be activated because it does not exist.
Running test-patch task BACKWARDS_COMPATIBILITY
Running test-patch task TESTS
Running test-patch task DISTRO
Applying patch
checking file client/src/main/java/org/apache/oozie/cli/OozieCLI.java
Hunk #1 succeeded at 752 with fuzz 1 (offset 27 lines).
checking file client/src/main/java/org/apache/oozie/client/OozieClient.java
Hunk #1 succeeded at 650 (offset 13 lines).
checking file core/src/main/java/org/apache/oozie/util/GraphGenerator.java
checking file core/src/main/java/org/apache/oozie/util/XConfiguration.java
checking file core/src/main/java/org/apache/oozie/util/XmlUtils.java
checking file sharelib/oozie/src/main/java/org/apache/oozie/action/hadoop/PrepareActionsDriver.java
Hunk #1 FAILED at 98.
1 out of 1 hunk FAILED
Patch failed to apply to head of branch
Adding comment to JIRA
Comment added.
test-patch exit code: 1
Build step 'Execute shell' marked build as failure
Archiving artifacts
Recording test results
ERROR: Step ?Publish JUnit test result report? failed: No test report files were found. Configuration error?
Build failed in Jenkins: oozie-trunk-precommit-build #2782
Posted by Apache Jenkins Server <je...@builds.apache.org>.
See <https://builds.apache.org/job/oozie-trunk-precommit-build/2782/>
------------------------------------------
[...truncated 8409 lines...]
[INFO] Copying 3 resources
[INFO]
[INFO] --- maven-compiler-plugin:2.3.2:testCompile (default-testCompile) @ oozie-tools ---
[INFO] Nothing to compile - all classes are up to date
[INFO]
[INFO] --- maven-surefire-plugin:2.12.2:test (default-test) @ oozie-tools ---
[INFO] Tests are skipped.
[INFO]
[INFO] --- maven-jar-plugin:2.3.1:jar (default-jar) @ oozie-tools ---
[INFO] Building jar: <https://builds.apache.org/job/oozie-trunk-precommit-build/ws/tools/target/oozie-tools-4.3.0-SNAPSHOT.jar>
[INFO]
[INFO] --- maven-site-plugin:2.0-beta-6:attach-descriptor (attach-descriptor) @ oozie-tools ---
[INFO]
[INFO] --- maven-assembly-plugin:2.2.1:single (default-cli) @ oozie-tools ---
[INFO] Reading assembly descriptor: ../src/main/assemblies/tools.xml
[WARNING] The following patterns were never triggered in this artifact exclusion filter:
o '*:*:pom:*'
[INFO] Copying files to <https://builds.apache.org/job/oozie-trunk-precommit-build/ws/tools/target/oozie-tools-4.3.0-SNAPSHOT-tools>
[WARNING] Assembly file: <https://builds.apache.org/job/oozie-trunk-precommit-build/ws/tools/target/oozie-tools-4.3.0-SNAPSHOT-tools> is not a regular file (it may be a directory). It cannot be attached to the project build for installation or deployment.
[INFO]
[INFO] ------------------------------------------------------------------------
[INFO] Building Apache Oozie MiniOozie 4.3.0-SNAPSHOT
[INFO] ------------------------------------------------------------------------
[INFO]
[INFO] --- maven-remote-resources-plugin:1.5:process (default) @ oozie-mini ---
[INFO]
[INFO] --- maven-resources-plugin:2.5:resources (default-resources) @ oozie-mini ---
[debug] execute contextualize
[INFO] Using 'UTF-8' encoding to copy filtered resources.
[INFO] skip non existing resourceDirectory <https://builds.apache.org/job/oozie-trunk-precommit-build/ws/minitest/src/main/resources>
[INFO] Copying 3 resources
[INFO]
[INFO] --- maven-compiler-plugin:2.3.2:compile (default-compile) @ oozie-mini ---
[INFO] No sources to compile
[INFO]
[INFO] --- maven-resources-plugin:2.5:testResources (default-testResources) @ oozie-mini ---
[debug] execute contextualize
[INFO] Using 'UTF-8' encoding to copy filtered resources.
[INFO] Copying 3 resources
[INFO] Copying 3 resources
[INFO]
[INFO] --- maven-compiler-plugin:2.3.2:testCompile (default-testCompile) @ oozie-mini ---
[INFO] Nothing to compile - all classes are up to date
[INFO]
[INFO] --- maven-surefire-plugin:2.12.2:test (default-test) @ oozie-mini ---
[INFO] Tests are skipped.
[INFO]
[INFO] --- maven-jar-plugin:2.3.1:jar (default-jar) @ oozie-mini ---
[INFO] Building jar: <https://builds.apache.org/job/oozie-trunk-precommit-build/ws/minitest/target/oozie-mini-4.3.0-SNAPSHOT.jar>
[INFO]
[INFO] --- maven-site-plugin:2.0-beta-6:attach-descriptor (attach-descriptor) @ oozie-mini ---
[INFO]
[INFO] --- maven-assembly-plugin:2.2.1:single (default-cli) @ oozie-mini ---
[INFO] Reading assembly descriptor: src/main/assemblies/empty.xml
[INFO]
[INFO] ------------------------------------------------------------------------
[INFO] Building Apache Oozie Distro 4.3.0-SNAPSHOT
[INFO] ------------------------------------------------------------------------
[INFO]
[INFO] --- maven-remote-resources-plugin:1.5:process (default) @ oozie-distro ---
[INFO]
[INFO] --- maven-resources-plugin:2.5:resources (default-resources) @ oozie-distro ---
[debug] execute contextualize
[INFO] Using 'UTF-8' encoding to copy filtered resources.
[INFO] skip non existing resourceDirectory <https://builds.apache.org/job/oozie-trunk-precommit-build/ws/distro/src/main/resources>
[INFO] Copying 3 resources
[INFO]
[INFO] --- maven-compiler-plugin:2.3.2:compile (default-compile) @ oozie-distro ---
[INFO] No sources to compile
[INFO]
[INFO] --- maven-resources-plugin:2.5:testResources (default-testResources) @ oozie-distro ---
[debug] execute contextualize
[INFO] Using 'UTF-8' encoding to copy filtered resources.
[INFO] skip non existing resourceDirectory <https://builds.apache.org/job/oozie-trunk-precommit-build/ws/distro/src/test/resources>
[INFO] Copying 3 resources
[INFO]
[INFO] --- maven-compiler-plugin:2.3.2:testCompile (default-testCompile) @ oozie-distro ---
[INFO] No sources to compile
[INFO]
[INFO] --- maven-surefire-plugin:2.12.2:test (default-test) @ oozie-distro ---
[INFO] Tests are skipped.
[INFO]
[INFO] --- maven-jar-plugin:2.3.1:jar (default-jar) @ oozie-distro ---
[INFO] Building jar: <https://builds.apache.org/job/oozie-trunk-precommit-build/ws/distro/target/oozie-distro-4.3.0-SNAPSHOT.jar>
[INFO]
[INFO] --- maven-site-plugin:2.0-beta-6:attach-descriptor (attach-descriptor) @ oozie-distro ---
[INFO]
[INFO] --- maven-antrun-plugin:1.6:run (default) @ oozie-distro ---
[INFO] Executing tasks
main:
[get] Getting: http://archive.apache.org/dist/tomcat/tomcat-6/v6.0.44/bin/apache-tomcat-6.0.44.tar.gz
[get] To: <https://builds.apache.org/job/oozie-trunk-precommit-build/ws/distro/downloads/tomcat-6.0.44.tar.gz>
...................................................................................................................................................................................................................................................................................................................................................................................................................................................................................................................................................................................................................................................................................
[mkdir] Created dir: <https://builds.apache.org/job/oozie-trunk-precommit-build/ws/distro/target/tomcat>
[gunzip] Expanding <https://builds.apache.org/job/oozie-trunk-precommit-build/ws/distro/downloads/tomcat-6.0.44.tar.gz> to <https://builds.apache.org/job/oozie-trunk-precommit-build/ws/distro/target/tomcat/tomcat-6.0.44.tar>
[untar] Expanding: <https://builds.apache.org/job/oozie-trunk-precommit-build/ws/distro/target/tomcat/tomcat-6.0.44.tar> into <https://builds.apache.org/job/oozie-trunk-precommit-build/ws/distro/target/tomcat>
[delete] Deleting directory <https://builds.apache.org/job/oozie-trunk-precommit-build/ws/distro/target/tomcat/oozie-server/webapps>
[mkdir] Created dir: <https://builds.apache.org/job/oozie-trunk-precommit-build/ws/distro/target/tomcat/oozie-server/webapps>
[delete] Deleting: <https://builds.apache.org/job/oozie-trunk-precommit-build/ws/distro/target/tomcat/oozie-server/conf/server.xml>
[copy] Copying 1 file to <https://builds.apache.org/job/oozie-trunk-precommit-build/ws/distro/target/tomcat/oozie-server/conf>
[copy] Copying 1 file to <https://builds.apache.org/job/oozie-trunk-precommit-build/ws/distro/target/tomcat/oozie-server/conf>
[mkdir] Created dir: <https://builds.apache.org/job/oozie-trunk-precommit-build/ws/distro/target/tomcat/oozie-server/conf/ssl>
[copy] Copying 1 file to <https://builds.apache.org/job/oozie-trunk-precommit-build/ws/distro/target/tomcat/oozie-server/conf/ssl>
[copy] Copying 1 file to <https://builds.apache.org/job/oozie-trunk-precommit-build/ws/distro/target/tomcat/oozie-server/conf/ssl>
[copy] Copying 1 file to <https://builds.apache.org/job/oozie-trunk-precommit-build/ws/distro/target/tomcat/oozie-server/conf/ssl>
[copy] Copying 3 files to <https://builds.apache.org/job/oozie-trunk-precommit-build/ws/distro/target/tomcat/oozie-server/webapps/ROOT>
[INFO] Executed tasks
[INFO]
[INFO] --- maven-assembly-plugin:2.2.1:single (default-cli) @ oozie-distro ---
[INFO] Reading assembly descriptor: ../src/main/assemblies/distro.xml
[INFO] Copying files to <https://builds.apache.org/job/oozie-trunk-precommit-build/ws/distro/target/oozie-4.3.0-SNAPSHOT-distro>
[WARNING] Assembly file: <https://builds.apache.org/job/oozie-trunk-precommit-build/ws/distro/target/oozie-4.3.0-SNAPSHOT-distro> is not a regular file (it may be a directory). It cannot be attached to the project build for installation or deployment.
[INFO] Building tar : <https://builds.apache.org/job/oozie-trunk-precommit-build/ws/distro/target/oozie-4.3.0-SNAPSHOT-distro.tar.gz>
[INFO]
[INFO] ------------------------------------------------------------------------
[INFO] Building Apache Oozie ZooKeeper Security Tests 4.3.0-SNAPSHOT
[INFO] ------------------------------------------------------------------------
[INFO]
[INFO] --- maven-remote-resources-plugin:1.5:process (default) @ oozie-zookeeper-security-tests ---
[INFO]
[INFO] --- maven-resources-plugin:2.5:resources (default-resources) @ oozie-zookeeper-security-tests ---
[debug] execute contextualize
[INFO] Using 'UTF-8' encoding to copy filtered resources.
[INFO] skip non existing resourceDirectory <https://builds.apache.org/job/oozie-trunk-precommit-build/ws/zookeeper-security-tests/src/main/resources>
[INFO] Copying 3 resources
[INFO]
[INFO] --- maven-compiler-plugin:2.3.2:compile (default-compile) @ oozie-zookeeper-security-tests ---
[INFO] No sources to compile
[INFO]
[INFO] --- maven-resources-plugin:2.5:testResources (default-testResources) @ oozie-zookeeper-security-tests ---
[debug] execute contextualize
[INFO] Using 'UTF-8' encoding to copy filtered resources.
[INFO] skip non existing resourceDirectory <https://builds.apache.org/job/oozie-trunk-precommit-build/ws/zookeeper-security-tests/src/test/resources>
[INFO] Copying 3 resources
[INFO]
[INFO] --- maven-compiler-plugin:2.3.2:testCompile (default-testCompile) @ oozie-zookeeper-security-tests ---
[INFO] Nothing to compile - all classes are up to date
[INFO]
[INFO] --- maven-surefire-plugin:2.12.2:test (default-test) @ oozie-zookeeper-security-tests ---
[INFO] Tests are skipped.
[INFO]
[INFO] --- maven-jar-plugin:2.3.1:jar (default-jar) @ oozie-zookeeper-security-tests ---
[INFO] Building jar: <https://builds.apache.org/job/oozie-trunk-precommit-build/ws/zookeeper-security-tests/target/oozie-zookeeper-security-tests-4.3.0-SNAPSHOT.jar>
[INFO]
[INFO] --- maven-site-plugin:2.0-beta-6:attach-descriptor (attach-descriptor) @ oozie-zookeeper-security-tests ---
[INFO]
[INFO] --- maven-assembly-plugin:2.2.1:single (default-cli) @ oozie-zookeeper-security-tests ---
[INFO] Reading assembly descriptor: src/main/assemblies/empty.xml
[INFO] ------------------------------------------------------------------------
[INFO] Reactor Summary:
[INFO]
[INFO] Apache Oozie Main ................................. SUCCESS [ 1.545 s]
[INFO] Apache Oozie Hadoop Utils ......................... SUCCESS [ 0.618 s]
[INFO] Apache Oozie Hadoop Distcp hadoop-1-4.3.0-SNAPSHOT SUCCESS [ 0.173 s]
[INFO] Apache Oozie Hadoop Auth hadoop-1-4.3.0-SNAPSHOT .. SUCCESS [ 0.180 s]
[INFO] Apache Oozie Hadoop Libs .......................... SUCCESS [ 0.023 s]
[INFO] Apache Oozie Client ............................... SUCCESS [ 24.220 s]
[INFO] Apache Oozie Share Lib Oozie ...................... SUCCESS [ 0.972 s]
[INFO] Apache Oozie Share Lib HCatalog ................... SUCCESS [ 1.089 s]
[INFO] Apache Oozie Share Lib Distcp ..................... SUCCESS [ 0.226 s]
[INFO] Apache Oozie Core ................................. SUCCESS [ 34.406 s]
[INFO] Apache Oozie Share Lib Streaming .................. SUCCESS [ 1.265 s]
[INFO] Apache Oozie Share Lib Pig ........................ SUCCESS [ 0.886 s]
[INFO] Apache Oozie Share Lib Hive ....................... SUCCESS [ 2.328 s]
[INFO] Apache Oozie Share Lib Hive 2 ..................... SUCCESS [ 1.829 s]
[INFO] Apache Oozie Share Lib Sqoop ...................... SUCCESS [ 0.405 s]
[INFO] Apache Oozie Examples ............................. SUCCESS [ 1.651 s]
[INFO] Apache Oozie Share Lib Spark ...................... SUCCESS [ 4.651 s]
[INFO] Apache Oozie Share Lib ............................ SUCCESS [ 16.979 s]
[INFO] Apache Oozie Docs ................................. SUCCESS [ 11.557 s]
[INFO] Apache Oozie WebApp ............................... SUCCESS [ 25.166 s]
[INFO] Apache Oozie Tools ................................ SUCCESS [ 0.502 s]
[INFO] Apache Oozie MiniOozie ............................ SUCCESS [ 0.215 s]
[INFO] Apache Oozie Distro ............................... SUCCESS [ 37.231 s]
[INFO] Apache Oozie ZooKeeper Security Tests ............. SUCCESS [ 1.595 s]
[INFO] ------------------------------------------------------------------------
[INFO] BUILD SUCCESS
[INFO] ------------------------------------------------------------------------
[INFO] Total time: 02:51 min
[INFO] Finished at: 2016-03-23T00:11:24+00:00
[INFO] Final Memory: 71M/918M
[INFO] ------------------------------------------------------------------------
Reports
Running test-patch task CLEAN
Running test-patch task RAW_PATCH_ANALYSIS
Running test-patch task RAT
Running test-patch task JAVADOC
Running test-patch task COMPILE
Running test-patch task BACKWARDS_COMPATIBILITY
Running test-patch task TESTS
Running test-patch task DISTRO
Testing JIRA OOZIE-2429
Cleaning local git workspace
----------------------------
+1 PATCH_APPLIES
+1 CLEAN
+1 RAW_PATCH_ANALYSIS
+1 the patch does not introduce any @author tags
+1 the patch does not introduce any tabs
+1 the patch does not introduce any trailing spaces
+1 the patch does not introduce any line longer than 132
+1 the patch does adds/modifies 1 testcase(s)
+1 RAT
+1 the patch does not seem to introduce new RAT warnings
+1 JAVADOC
+1 the patch does not seem to introduce new Javadoc warnings
+1 COMPILE
+1 HEAD compiles
+1 patch compiles
+1 the patch does not seem to introduce new javac warnings
+1 BACKWARDS_COMPATIBILITY
+1 the patch does not change any JPA Entity/Colum/Basic/Lob/Transient annotations
+1 the patch does not modify JPA files
-1 TESTS
Tests run: 1768
Tests failed: 1
Tests errors: 0
The patch failed the following testcases:
testCoord_throwException(org.apache.oozie.command.coord.TestCoordChangeXCommand)
+1 DISTRO
+1 distro tarball builds with the patch
----------------------------
-1 Overall result, please check the reported -1(s)
The full output of the test-patch run is available at
https://builds.apache.org/job/oozie-trunk-precommit-build/2782/
Adding comment to JIRA
Comment added.
test-patch exit code: 1
Build step 'Execute shell' marked build as failure
Archiving artifacts
Recording test results
Build failed in Jenkins: oozie-trunk-precommit-build #2781
Posted by Apache Jenkins Server <je...@builds.apache.org>.
See <https://builds.apache.org/job/oozie-trunk-precommit-build/2781/changes>
Changes:
[rkanter] OOZIE-2429 TestEventGeneration test is flakey (fdenes via rkanter)
------------------------------------------
[...truncated 5548 lines...]
[INFO]
[INFO] --- maven-remote-resources-plugin:1.5:process (default) @ oozie-sharelib-distcp ---
[INFO]
[INFO] --- maven-resources-plugin:2.5:resources (default-resources) @ oozie-sharelib-distcp ---
[debug] execute contextualize
[INFO] Using 'UTF-8' encoding to copy filtered resources.
[INFO] skip non existing resourceDirectory <https://builds.apache.org/job/oozie-trunk-precommit-build/ws/sharelib/distcp/src/main/resources>
[INFO] Copying 3 resources
[INFO]
[INFO] --- maven-compiler-plugin:2.3.2:compile (default-compile) @ oozie-sharelib-distcp ---
[INFO] Nothing to compile - all classes are up to date
[INFO]
[INFO] --- maven-dependency-plugin:2.4:build-classpath (gen-classpath) @ oozie-sharelib-distcp ---
[INFO] Wrote classpath file '<https://builds.apache.org/job/oozie-trunk-precommit-build/ws/sharelib/distcp/target/classpath'.>
[INFO]
[INFO] --- maven-dependency-plugin:2.4:build-classpath (create-mrapp-generated-classpath) @ oozie-sharelib-distcp ---
[INFO] Wrote classpath file '<https://builds.apache.org/job/oozie-trunk-precommit-build/ws/sharelib/distcp/target/test-classes/mrapp-generated-classpath'.>
[INFO]
[INFO] --- maven-antrun-plugin:1.6:run (default) @ oozie-sharelib-distcp ---
[INFO] Executing tasks
main:
[INFO] Executed tasks
[INFO]
[INFO] --- maven-resources-plugin:2.5:testResources (default-testResources) @ oozie-sharelib-distcp ---
[debug] execute contextualize
[INFO] Using 'UTF-8' encoding to copy filtered resources.
[INFO] skip non existing resourceDirectory <https://builds.apache.org/job/oozie-trunk-precommit-build/ws/sharelib/distcp/src/test/resources>
[INFO] Copying 3 resources
[INFO]
[INFO] --- maven-compiler-plugin:2.3.2:testCompile (default-testCompile) @ oozie-sharelib-distcp ---
[INFO] No sources to compile
[INFO]
[INFO] --- maven-surefire-plugin:2.12.2:test (default-test) @ oozie-sharelib-distcp ---
[INFO] Tests are skipped.
[INFO]
[INFO] --- maven-jar-plugin:2.3.1:jar (default-jar) @ oozie-sharelib-distcp ---
[INFO] Building jar: <https://builds.apache.org/job/oozie-trunk-precommit-build/ws/sharelib/distcp/target/oozie-sharelib-distcp-4.3.0-SNAPSHOT.jar>
[INFO]
[INFO] --- maven-site-plugin:2.0-beta-6:attach-descriptor (attach-descriptor) @ oozie-sharelib-distcp ---
[INFO]
[INFO] --- maven-assembly-plugin:2.2.1:single (default-cli) @ oozie-sharelib-distcp ---
[INFO] Reading assembly descriptor: ../../src/main/assemblies/partial-sharelib.xml
[INFO] Copying files to <https://builds.apache.org/job/oozie-trunk-precommit-build/ws/sharelib/distcp/target/partial-sharelib>
[WARNING] Assembly file: <https://builds.apache.org/job/oozie-trunk-precommit-build/ws/sharelib/distcp/target/partial-sharelib> is not a regular file (it may be a directory). It cannot be attached to the project build for installation or deployment.
[INFO]
[INFO] ------------------------------------------------------------------------
[INFO] Building Apache Oozie Core 4.3.0-SNAPSHOT
[INFO] ------------------------------------------------------------------------
[INFO]
[INFO] --- maven-remote-resources-plugin:1.5:process (default) @ oozie-core ---
[INFO]
[INFO] --- maven-resources-plugin:2.5:resources (default-resources) @ oozie-core ---
[debug] execute contextualize
[INFO] Using 'UTF-8' encoding to copy filtered resources.
[INFO] Copying 14 resources
[INFO] Copying 3 resources
[INFO]
[INFO] --- maven-compiler-plugin:2.3.2:compile (default-compile) @ oozie-core ---
[INFO] Nothing to compile - all classes are up to date
[INFO]
[INFO] --- openjpa-maven-plugin:2.2.2:enhance (enhancer) @ oozie-core ---
16/03/22 19:18:26 INFO openjpa.Tool: Enhancer running on type "class org.apache.oozie.sla.SLASummaryBean".
16/03/22 19:18:27 INFO openjpa.Tool: Enhancer running on type "class org.apache.oozie.WorkflowJobBean".
16/03/22 19:18:27 INFO openjpa.Tool: Enhancer running on type "class org.apache.oozie.BundleActionBean".
16/03/22 19:18:27 INFO openjpa.Tool: Enhancer running on type "class org.apache.oozie.WorkflowActionBean".
16/03/22 19:18:27 INFO openjpa.Tool: Enhancer running on type "class org.apache.oozie.SLAEventBean".
16/03/22 19:18:27 INFO openjpa.Tool: Enhancer running on type "class org.apache.oozie.client.rest.JsonSLAEvent".
16/03/22 19:18:27 INFO openjpa.Tool: Enhancer running on type "class org.apache.oozie.BundleJobBean".
16/03/22 19:18:27 INFO openjpa.Tool: Enhancer running on type "class org.apache.oozie.CoordinatorActionBean".
16/03/22 19:18:27 INFO openjpa.Tool: Enhancer running on type "class org.apache.oozie.sla.SLARegistrationBean".
16/03/22 19:18:27 INFO openjpa.Tool: Enhancer running on type "class org.apache.oozie.CoordinatorJobBean".
16/03/22 19:18:27 INFO openjpa.Tool: Enhancer running on type "class org.apache.oozie.util.db.ValidateConnectionBean".
16/03/22 19:18:27 INFO openjpa.Tool: Enhancer running on type "class org.apache.oozie.sla.SLASummaryBean".
16/03/22 19:18:27 INFO openjpa.Tool: Enhancer running on type "class org.apache.oozie.WorkflowJobBean".
16/03/22 19:18:27 INFO openjpa.Tool: Enhancer running on type "class org.apache.oozie.BundleActionBean".
16/03/22 19:18:27 INFO openjpa.Tool: Enhancer running on type "class org.apache.oozie.WorkflowActionBean".
16/03/22 19:18:27 INFO openjpa.Tool: Enhancer running on type "class org.apache.oozie.SLAEventBean".
16/03/22 19:18:27 INFO openjpa.Tool: Enhancer running on type "class org.apache.oozie.client.rest.JsonSLAEvent".
16/03/22 19:18:27 INFO openjpa.Tool: Enhancer running on type "class org.apache.oozie.BundleJobBean".
16/03/22 19:18:27 INFO openjpa.Tool: Enhancer running on type "class org.apache.oozie.CoordinatorActionBean".
16/03/22 19:18:27 INFO openjpa.Tool: Enhancer running on type "class org.apache.oozie.sla.SLARegistrationBean".
16/03/22 19:18:27 INFO openjpa.Tool: Enhancer running on type "class org.apache.oozie.CoordinatorJobBean".
16/03/22 19:18:27 INFO openjpa.Tool: Enhancer running on type "class org.apache.oozie.util.db.ValidateConnectionBean".
16/03/22 19:18:27 INFO openjpa.Tool: Enhancer running on type "class org.apache.oozie.sla.SLASummaryBean".
16/03/22 19:18:27 INFO openjpa.Tool: Enhancer running on type "class org.apache.oozie.WorkflowJobBean".
16/03/22 19:18:27 INFO openjpa.Tool: Enhancer running on type "class org.apache.oozie.BundleActionBean".
16/03/22 19:18:27 INFO openjpa.Tool: Enhancer running on type "class org.apache.oozie.WorkflowActionBean".
16/03/22 19:18:27 INFO openjpa.Tool: Enhancer running on type "class org.apache.oozie.SLAEventBean".
16/03/22 19:18:27 INFO openjpa.Tool: Enhancer running on type "class org.apache.oozie.client.rest.JsonSLAEvent".
16/03/22 19:18:27 INFO openjpa.Tool: Enhancer running on type "class org.apache.oozie.BundleJobBean".
16/03/22 19:18:27 INFO openjpa.Tool: Enhancer running on type "class org.apache.oozie.CoordinatorActionBean".
16/03/22 19:18:27 INFO openjpa.Tool: Enhancer running on type "class org.apache.oozie.sla.SLARegistrationBean".
16/03/22 19:18:27 INFO openjpa.Tool: Enhancer running on type "class org.apache.oozie.CoordinatorJobBean".
16/03/22 19:18:27 INFO openjpa.Tool: Enhancer running on type "class org.apache.oozie.util.db.ValidateConnectionBean".
16/03/22 19:18:27 INFO openjpa.Tool: Enhancer running on type "class org.apache.oozie.sla.SLASummaryBean".
16/03/22 19:18:27 INFO openjpa.Tool: Enhancer running on type "class org.apache.oozie.WorkflowJobBean".
16/03/22 19:18:27 INFO openjpa.Tool: Enhancer running on type "class org.apache.oozie.BundleActionBean".
16/03/22 19:18:28 INFO openjpa.Tool: Enhancer running on type "class org.apache.oozie.WorkflowActionBean".
16/03/22 19:18:28 INFO openjpa.Tool: Enhancer running on type "class org.apache.oozie.SLAEventBean".
16/03/22 19:18:28 INFO openjpa.Tool: Enhancer running on type "class org.apache.oozie.client.rest.JsonSLAEvent".
16/03/22 19:18:28 INFO openjpa.Tool: Enhancer running on type "class org.apache.oozie.BundleJobBean".
16/03/22 19:18:28 INFO openjpa.Tool: Enhancer running on type "class org.apache.oozie.CoordinatorActionBean".
16/03/22 19:18:28 INFO openjpa.Tool: Enhancer running on type "class org.apache.oozie.sla.SLARegistrationBean".
16/03/22 19:18:28 INFO openjpa.Tool: Enhancer running on type "class org.apache.oozie.CoordinatorJobBean".
16/03/22 19:18:28 INFO openjpa.Tool: Enhancer running on type "class org.apache.oozie.util.db.ValidateConnectionBean".
16/03/22 19:18:28 INFO openjpa.Tool: Enhancer running on type "class org.apache.oozie.sla.SLASummaryBean".
16/03/22 19:18:28 INFO openjpa.Tool: Enhancer running on type "class org.apache.oozie.WorkflowJobBean".
16/03/22 19:18:28 INFO openjpa.Tool: Enhancer running on type "class org.apache.oozie.BundleActionBean".
16/03/22 19:18:28 INFO openjpa.Tool: Enhancer running on type "class org.apache.oozie.WorkflowActionBean".
16/03/22 19:18:28 INFO openjpa.Tool: Enhancer running on type "class org.apache.oozie.SLAEventBean".
16/03/22 19:18:28 INFO openjpa.Tool: Enhancer running on type "class org.apache.oozie.client.rest.JsonSLAEvent".
16/03/22 19:18:28 INFO openjpa.Tool: Enhancer running on type "class org.apache.oozie.BundleJobBean".
16/03/22 19:18:28 INFO openjpa.Tool: Enhancer running on type "class org.apache.oozie.CoordinatorActionBean".
16/03/22 19:18:28 INFO openjpa.Tool: Enhancer running on type "class org.apache.oozie.sla.SLARegistrationBean".
16/03/22 19:18:28 INFO openjpa.Tool: Enhancer running on type "class org.apache.oozie.CoordinatorJobBean".
16/03/22 19:18:28 INFO openjpa.Tool: Enhancer running on type "class org.apache.oozie.util.db.ValidateConnectionBean".
16/03/22 19:18:28 INFO openjpa.Tool: Enhancer running on type "class org.apache.oozie.sla.SLASummaryBean".
16/03/22 19:18:28 INFO openjpa.Tool: Enhancer running on type "class org.apache.oozie.WorkflowJobBean".
16/03/22 19:18:28 INFO openjpa.Tool: Enhancer running on type "class org.apache.oozie.BundleActionBean".
16/03/22 19:18:28 INFO openjpa.Tool: Enhancer running on type "class org.apache.oozie.WorkflowActionBean".
16/03/22 19:18:28 INFO openjpa.Tool: Enhancer running on type "class org.apache.oozie.SLAEventBean".
16/03/22 19:18:28 INFO openjpa.Tool: Enhancer running on type "class org.apache.oozie.client.rest.JsonSLAEvent".
16/03/22 19:18:28 INFO openjpa.Tool: Enhancer running on type "class org.apache.oozie.BundleJobBean".
16/03/22 19:18:28 INFO openjpa.Tool: Enhancer running on type "class org.apache.oozie.CoordinatorActionBean".
16/03/22 19:18:28 INFO openjpa.Tool: Enhancer running on type "class org.apache.oozie.sla.SLARegistrationBean".
16/03/22 19:18:28 INFO openjpa.Tool: Enhancer running on type "class org.apache.oozie.CoordinatorJobBean".
16/03/22 19:18:28 INFO openjpa.Tool: Enhancer running on type "class org.apache.oozie.util.db.ValidateConnectionBean".
[INFO]
[INFO] --- maven-dependency-plugin:2.4:build-classpath (create-mrapp-generated-classpath) @ oozie-core ---
[INFO] Wrote classpath file '<https://builds.apache.org/job/oozie-trunk-precommit-build/ws/core/target/test-classes/mrapp-generated-classpath'.>
[INFO]
[INFO] --- maven-resources-plugin:2.5:testResources (default-testResources) @ oozie-core ---
[debug] execute contextualize
[INFO] Using 'UTF-8' encoding to copy filtered resources.
[INFO] Copying 122 resources
[INFO] Copying 3 resources
[INFO]
[INFO] --- maven-compiler-plugin:2.3.2:testCompile (default-testCompile) @ oozie-core ---
[INFO] Compiling 337 source files to <https://builds.apache.org/job/oozie-trunk-precommit-build/ws/core/target/test-classes>
[INFO] -------------------------------------------------------------
[ERROR] COMPILATION ERROR :
[INFO] -------------------------------------------------------------
[ERROR] <https://builds.apache.org/job/oozie-trunk-precommit-build/ws/core/src/test/java/org/apache/oozie/event/TestEventGeneration.java>:[575,58] error: diamond operator is not supported in -source 1.6
[INFO] 1 error
[INFO] -------------------------------------------------------------
[INFO] ------------------------------------------------------------------------
[INFO] Reactor Summary:
[INFO]
[INFO] Apache Oozie Main ................................. SUCCESS [ 1.676 s]
[INFO] Apache Oozie Hadoop Utils ......................... SUCCESS [ 0.642 s]
[INFO] Apache Oozie Hadoop Distcp hadoop-1-4.3.0-SNAPSHOT SUCCESS [ 0.168 s]
[INFO] Apache Oozie Hadoop Auth hadoop-1-4.3.0-SNAPSHOT .. SUCCESS [ 0.179 s]
[INFO] Apache Oozie Hadoop Libs .......................... SUCCESS [ 0.027 s]
[INFO] Apache Oozie Client ............................... SUCCESS [ 16.566 s]
[INFO] Apache Oozie Share Lib Oozie ...................... SUCCESS [ 0.958 s]
[INFO] Apache Oozie Share Lib HCatalog ................... SUCCESS [ 1.195 s]
[INFO] Apache Oozie Share Lib Distcp ..................... SUCCESS [ 0.256 s]
[INFO] Apache Oozie Core ................................. FAILURE [ 5.853 s]
[INFO] Apache Oozie Share Lib Streaming .................. SKIPPED
[INFO] Apache Oozie Share Lib Pig ........................ SKIPPED
[INFO] Apache Oozie Share Lib Hive ....................... SKIPPED
[INFO] Apache Oozie Share Lib Hive 2 ..................... SKIPPED
[INFO] Apache Oozie Share Lib Sqoop ...................... SKIPPED
[INFO] Apache Oozie Examples ............................. SKIPPED
[INFO] Apache Oozie Share Lib Spark ...................... SKIPPED
[INFO] Apache Oozie Share Lib ............................ SKIPPED
[INFO] Apache Oozie Docs ................................. SKIPPED
[INFO] Apache Oozie WebApp ............................... SKIPPED
[INFO] Apache Oozie Tools ................................ SKIPPED
[INFO] Apache Oozie MiniOozie ............................ SKIPPED
[INFO] Apache Oozie Distro ............................... SKIPPED
[INFO] Apache Oozie ZooKeeper Security Tests ............. SKIPPED
[INFO] ------------------------------------------------------------------------
[INFO] BUILD FAILURE
[INFO] ------------------------------------------------------------------------
[INFO] Total time: 29.253 s
[INFO] Finished at: 2016-03-22T19:18:30+00:00
[INFO] Final Memory: 50M/1098M
[INFO] ------------------------------------------------------------------------
[ERROR] Failed to execute goal org.apache.maven.plugins:maven-compiler-plugin:2.3.2:testCompile (default-testCompile) on project oozie-core: Compilation failure
[ERROR] <https://builds.apache.org/job/oozie-trunk-precommit-build/ws/core/src/test/java/org/apache/oozie/event/TestEventGeneration.java>:[575,58] error: diamond operator is not supported in -source 1.6
[ERROR] -> [Help 1]
[ERROR]
[ERROR] To see the full stack trace of the errors, re-run Maven with the -e switch.
[ERROR] Re-run Maven using the -X switch to enable full debug logging.
[ERROR]
[ERROR] For more information about the errors and possible solutions, please read the following articles:
[ERROR] [Help 1] http://cwiki.apache.org/confluence/display/MAVEN/MojoFailureException
[ERROR]
[ERROR] After correcting the problems, you can resume the build with the command
[ERROR] mvn <goals> -rf :oozie-core
Reports
Running test-patch task CLEAN
Running test-patch task RAW_PATCH_ANALYSIS
Running test-patch task RAT
Running test-patch task JAVADOC
Running test-patch task COMPILE
Running test-patch task BACKWARDS_COMPATIBILITY
Running test-patch task TESTS
Running test-patch task DISTRO
Testing JIRA OOZIE-2429
Cleaning local git workspace
----------------------------
+1 PATCH_APPLIES
+1 CLEAN
+1 RAW_PATCH_ANALYSIS
+1 the patch does not introduce any @author tags
+1 the patch does not introduce any tabs
+1 the patch does not introduce any trailing spaces
+1 the patch does not introduce any line longer than 132
+1 the patch does adds/modifies 1 testcase(s)
+1 RAT
+1 the patch does not seem to introduce new RAT warnings
+1 JAVADOC
+1 the patch does not seem to introduce new Javadoc warnings
-1 COMPILE
+1 HEAD compiles
-1 patch does not compile
+1 the patch does not seem to introduce new javac warnings
+1 BACKWARDS_COMPATIBILITY
+1 the patch does not change any JPA Entity/Colum/Basic/Lob/Transient annotations
+1 the patch does not modify JPA files
-1 TESTS - patch does not compile, cannot run testcases
-1 DISTRO
-1 distro tarball fails with the patch
----------------------------
-1 Overall result, please check the reported -1(s)
The full output of the test-patch run is available at
https://builds.apache.org/job/oozie-trunk-precommit-build/2781/
Adding comment to JIRA
Comment added.
test-patch exit code: 1
Build step 'Execute shell' marked build as failure
Archiving artifacts
Recording test results
Build failed in Jenkins: oozie-trunk-precommit-build #2780
Posted by Apache Jenkins Server <je...@builds.apache.org>.
See <https://builds.apache.org/job/oozie-trunk-precommit-build/2780/changes>
Changes:
[harsh] OOZIE-2472 Remove infinite socket timeouts in the Oozie email action
[rkanter] OOZIE-2466 Repeated failure of TestMetricsInstrumentation.testSamplers
------------------------------------------
[...truncated 8405 lines...]
[INFO]
[INFO] --- maven-compiler-plugin:2.3.2:testCompile (default-testCompile) @ oozie-tools ---
[INFO] Nothing to compile - all classes are up to date
[INFO]
[INFO] --- maven-surefire-plugin:2.12.2:test (default-test) @ oozie-tools ---
[INFO] Tests are skipped.
[INFO]
[INFO] --- maven-jar-plugin:2.3.1:jar (default-jar) @ oozie-tools ---
[INFO] Building jar: <https://builds.apache.org/job/oozie-trunk-precommit-build/ws/tools/target/oozie-tools-4.3.0-SNAPSHOT.jar>
[INFO]
[INFO] --- maven-site-plugin:2.0-beta-6:attach-descriptor (attach-descriptor) @ oozie-tools ---
[INFO]
[INFO] --- maven-assembly-plugin:2.2.1:single (default-cli) @ oozie-tools ---
[INFO] Reading assembly descriptor: ../src/main/assemblies/tools.xml
[WARNING] The following patterns were never triggered in this artifact exclusion filter:
o '*:*:pom:*'
[INFO] Copying files to <https://builds.apache.org/job/oozie-trunk-precommit-build/ws/tools/target/oozie-tools-4.3.0-SNAPSHOT-tools>
[WARNING] Assembly file: <https://builds.apache.org/job/oozie-trunk-precommit-build/ws/tools/target/oozie-tools-4.3.0-SNAPSHOT-tools> is not a regular file (it may be a directory). It cannot be attached to the project build for installation or deployment.
[INFO]
[INFO] ------------------------------------------------------------------------
[INFO] Building Apache Oozie MiniOozie 4.3.0-SNAPSHOT
[INFO] ------------------------------------------------------------------------
[INFO]
[INFO] --- maven-remote-resources-plugin:1.5:process (default) @ oozie-mini ---
[INFO]
[INFO] --- maven-resources-plugin:2.5:resources (default-resources) @ oozie-mini ---
[debug] execute contextualize
[INFO] Using 'UTF-8' encoding to copy filtered resources.
[INFO] skip non existing resourceDirectory <https://builds.apache.org/job/oozie-trunk-precommit-build/ws/minitest/src/main/resources>
[INFO] Copying 3 resources
[INFO]
[INFO] --- maven-compiler-plugin:2.3.2:compile (default-compile) @ oozie-mini ---
[INFO] No sources to compile
[INFO]
[INFO] --- maven-resources-plugin:2.5:testResources (default-testResources) @ oozie-mini ---
[debug] execute contextualize
[INFO] Using 'UTF-8' encoding to copy filtered resources.
[INFO] Copying 3 resources
[INFO] Copying 3 resources
[INFO]
[INFO] --- maven-compiler-plugin:2.3.2:testCompile (default-testCompile) @ oozie-mini ---
[INFO] Nothing to compile - all classes are up to date
[INFO]
[INFO] --- maven-surefire-plugin:2.12.2:test (default-test) @ oozie-mini ---
[INFO] Tests are skipped.
[INFO]
[INFO] --- maven-jar-plugin:2.3.1:jar (default-jar) @ oozie-mini ---
[INFO] Building jar: <https://builds.apache.org/job/oozie-trunk-precommit-build/ws/minitest/target/oozie-mini-4.3.0-SNAPSHOT.jar>
[INFO]
[INFO] --- maven-site-plugin:2.0-beta-6:attach-descriptor (attach-descriptor) @ oozie-mini ---
[INFO]
[INFO] --- maven-assembly-plugin:2.2.1:single (default-cli) @ oozie-mini ---
[INFO] Reading assembly descriptor: src/main/assemblies/empty.xml
[INFO]
[INFO] ------------------------------------------------------------------------
[INFO] Building Apache Oozie Distro 4.3.0-SNAPSHOT
[INFO] ------------------------------------------------------------------------
[INFO]
[INFO] --- maven-remote-resources-plugin:1.5:process (default) @ oozie-distro ---
[INFO]
[INFO] --- maven-resources-plugin:2.5:resources (default-resources) @ oozie-distro ---
[debug] execute contextualize
[INFO] Using 'UTF-8' encoding to copy filtered resources.
[INFO] skip non existing resourceDirectory <https://builds.apache.org/job/oozie-trunk-precommit-build/ws/distro/src/main/resources>
[INFO] Copying 3 resources
[INFO]
[INFO] --- maven-compiler-plugin:2.3.2:compile (default-compile) @ oozie-distro ---
[INFO] No sources to compile
[INFO]
[INFO] --- maven-resources-plugin:2.5:testResources (default-testResources) @ oozie-distro ---
[debug] execute contextualize
[INFO] Using 'UTF-8' encoding to copy filtered resources.
[INFO] skip non existing resourceDirectory <https://builds.apache.org/job/oozie-trunk-precommit-build/ws/distro/src/test/resources>
[INFO] Copying 3 resources
[INFO]
[INFO] --- maven-compiler-plugin:2.3.2:testCompile (default-testCompile) @ oozie-distro ---
[INFO] No sources to compile
[INFO]
[INFO] --- maven-surefire-plugin:2.12.2:test (default-test) @ oozie-distro ---
[INFO] Tests are skipped.
[INFO]
[INFO] --- maven-jar-plugin:2.3.1:jar (default-jar) @ oozie-distro ---
[INFO] Building jar: <https://builds.apache.org/job/oozie-trunk-precommit-build/ws/distro/target/oozie-distro-4.3.0-SNAPSHOT.jar>
[INFO]
[INFO] --- maven-site-plugin:2.0-beta-6:attach-descriptor (attach-descriptor) @ oozie-distro ---
[INFO]
[INFO] --- maven-antrun-plugin:1.6:run (default) @ oozie-distro ---
[INFO] Executing tasks
main:
[get] Getting: http://archive.apache.org/dist/tomcat/tomcat-6/v6.0.44/bin/apache-tomcat-6.0.44.tar.gz
[get] To: <https://builds.apache.org/job/oozie-trunk-precommit-build/ws/distro/downloads/tomcat-6.0.44.tar.gz>
.........................................................................................................................................................................................................................................................................................................................................................................................................................................................................................................................................................................................................................................................................................................................................................................................................
[mkdir] Created dir: <https://builds.apache.org/job/oozie-trunk-precommit-build/ws/distro/target/tomcat>
[gunzip] Expanding <https://builds.apache.org/job/oozie-trunk-precommit-build/ws/distro/downloads/tomcat-6.0.44.tar.gz> to <https://builds.apache.org/job/oozie-trunk-precommit-build/ws/distro/target/tomcat/tomcat-6.0.44.tar>
[untar] Expanding: <https://builds.apache.org/job/oozie-trunk-precommit-build/ws/distro/target/tomcat/tomcat-6.0.44.tar> into <https://builds.apache.org/job/oozie-trunk-precommit-build/ws/distro/target/tomcat>
[delete] Deleting directory <https://builds.apache.org/job/oozie-trunk-precommit-build/ws/distro/target/tomcat/oozie-server/webapps>
[mkdir] Created dir: <https://builds.apache.org/job/oozie-trunk-precommit-build/ws/distro/target/tomcat/oozie-server/webapps>
[delete] Deleting: <https://builds.apache.org/job/oozie-trunk-precommit-build/ws/distro/target/tomcat/oozie-server/conf/server.xml>
[copy] Copying 1 file to <https://builds.apache.org/job/oozie-trunk-precommit-build/ws/distro/target/tomcat/oozie-server/conf>
[copy] Copying 1 file to <https://builds.apache.org/job/oozie-trunk-precommit-build/ws/distro/target/tomcat/oozie-server/conf>
[mkdir] Created dir: <https://builds.apache.org/job/oozie-trunk-precommit-build/ws/distro/target/tomcat/oozie-server/conf/ssl>
[copy] Copying 1 file to <https://builds.apache.org/job/oozie-trunk-precommit-build/ws/distro/target/tomcat/oozie-server/conf/ssl>
[copy] Copying 1 file to <https://builds.apache.org/job/oozie-trunk-precommit-build/ws/distro/target/tomcat/oozie-server/conf/ssl>
[copy] Copying 1 file to <https://builds.apache.org/job/oozie-trunk-precommit-build/ws/distro/target/tomcat/oozie-server/conf/ssl>
[copy] Copying 3 files to <https://builds.apache.org/job/oozie-trunk-precommit-build/ws/distro/target/tomcat/oozie-server/webapps/ROOT>
[INFO] Executed tasks
[INFO]
[INFO] --- maven-assembly-plugin:2.2.1:single (default-cli) @ oozie-distro ---
[INFO] Reading assembly descriptor: ../src/main/assemblies/distro.xml
[INFO] Copying files to <https://builds.apache.org/job/oozie-trunk-precommit-build/ws/distro/target/oozie-4.3.0-SNAPSHOT-distro>
[WARNING] Assembly file: <https://builds.apache.org/job/oozie-trunk-precommit-build/ws/distro/target/oozie-4.3.0-SNAPSHOT-distro> is not a regular file (it may be a directory). It cannot be attached to the project build for installation or deployment.
[INFO] Building tar : <https://builds.apache.org/job/oozie-trunk-precommit-build/ws/distro/target/oozie-4.3.0-SNAPSHOT-distro.tar.gz>
[INFO]
[INFO] ------------------------------------------------------------------------
[INFO] Building Apache Oozie ZooKeeper Security Tests 4.3.0-SNAPSHOT
[INFO] ------------------------------------------------------------------------
[INFO]
[INFO] --- maven-remote-resources-plugin:1.5:process (default) @ oozie-zookeeper-security-tests ---
[INFO]
[INFO] --- maven-resources-plugin:2.5:resources (default-resources) @ oozie-zookeeper-security-tests ---
[debug] execute contextualize
[INFO] Using 'UTF-8' encoding to copy filtered resources.
[INFO] skip non existing resourceDirectory <https://builds.apache.org/job/oozie-trunk-precommit-build/ws/zookeeper-security-tests/src/main/resources>
[INFO] Copying 3 resources
[INFO]
[INFO] --- maven-compiler-plugin:2.3.2:compile (default-compile) @ oozie-zookeeper-security-tests ---
[INFO] No sources to compile
[INFO]
[INFO] --- maven-resources-plugin:2.5:testResources (default-testResources) @ oozie-zookeeper-security-tests ---
[debug] execute contextualize
[INFO] Using 'UTF-8' encoding to copy filtered resources.
[INFO] skip non existing resourceDirectory <https://builds.apache.org/job/oozie-trunk-precommit-build/ws/zookeeper-security-tests/src/test/resources>
[INFO] Copying 3 resources
[INFO]
[INFO] --- maven-compiler-plugin:2.3.2:testCompile (default-testCompile) @ oozie-zookeeper-security-tests ---
[INFO] Nothing to compile - all classes are up to date
[INFO]
[INFO] --- maven-surefire-plugin:2.12.2:test (default-test) @ oozie-zookeeper-security-tests ---
[INFO] Tests are skipped.
[INFO]
[INFO] --- maven-jar-plugin:2.3.1:jar (default-jar) @ oozie-zookeeper-security-tests ---
[INFO] Building jar: <https://builds.apache.org/job/oozie-trunk-precommit-build/ws/zookeeper-security-tests/target/oozie-zookeeper-security-tests-4.3.0-SNAPSHOT.jar>
[INFO]
[INFO] --- maven-site-plugin:2.0-beta-6:attach-descriptor (attach-descriptor) @ oozie-zookeeper-security-tests ---
[INFO]
[INFO] --- maven-assembly-plugin:2.2.1:single (default-cli) @ oozie-zookeeper-security-tests ---
[INFO] Reading assembly descriptor: src/main/assemblies/empty.xml
[INFO] ------------------------------------------------------------------------
[INFO] Reactor Summary:
[INFO]
[INFO] Apache Oozie Main ................................. SUCCESS [ 1.757 s]
[INFO] Apache Oozie Hadoop Utils ......................... SUCCESS [ 0.612 s]
[INFO] Apache Oozie Hadoop Distcp hadoop-1-4.3.0-SNAPSHOT SUCCESS [ 0.213 s]
[INFO] Apache Oozie Hadoop Auth hadoop-1-4.3.0-SNAPSHOT .. SUCCESS [ 0.235 s]
[INFO] Apache Oozie Hadoop Libs .......................... SUCCESS [ 0.033 s]
[INFO] Apache Oozie Client ............................... SUCCESS [ 27.733 s]
[INFO] Apache Oozie Share Lib Oozie ...................... SUCCESS [ 1.009 s]
[INFO] Apache Oozie Share Lib HCatalog ................... SUCCESS [ 1.128 s]
[INFO] Apache Oozie Share Lib Distcp ..................... SUCCESS [ 0.232 s]
[INFO] Apache Oozie Core ................................. SUCCESS [ 40.483 s]
[INFO] Apache Oozie Share Lib Streaming .................. SUCCESS [ 1.608 s]
[INFO] Apache Oozie Share Lib Pig ........................ SUCCESS [ 1.158 s]
[INFO] Apache Oozie Share Lib Hive ....................... SUCCESS [ 2.663 s]
[INFO] Apache Oozie Share Lib Hive 2 ..................... SUCCESS [ 1.956 s]
[INFO] Apache Oozie Share Lib Sqoop ...................... SUCCESS [ 0.521 s]
[INFO] Apache Oozie Examples ............................. SUCCESS [ 1.755 s]
[INFO] Apache Oozie Share Lib Spark ...................... SUCCESS [ 4.727 s]
[INFO] Apache Oozie Share Lib ............................ SUCCESS [ 17.733 s]
[INFO] Apache Oozie Docs ................................. SUCCESS [ 14.068 s]
[INFO] Apache Oozie WebApp ............................... SUCCESS [ 26.963 s]
[INFO] Apache Oozie Tools ................................ SUCCESS [ 0.534 s]
[INFO] Apache Oozie MiniOozie ............................ SUCCESS [ 0.658 s]
[INFO] Apache Oozie Distro ............................... SUCCESS [ 40.179 s]
[INFO] Apache Oozie ZooKeeper Security Tests ............. SUCCESS [ 1.661 s]
[INFO] ------------------------------------------------------------------------
[INFO] BUILD SUCCESS
[INFO] ------------------------------------------------------------------------
[INFO] Total time: 03:11 min
[INFO] Finished at: 2016-03-09T03:39:25+00:00
[INFO] Final Memory: 69M/1051M
[INFO] ------------------------------------------------------------------------
Reports
Running test-patch task CLEAN
Running test-patch task RAW_PATCH_ANALYSIS
Running test-patch task RAT
Running test-patch task JAVADOC
Running test-patch task COMPILE
Running test-patch task BACKWARDS_COMPATIBILITY
Running test-patch task TESTS
Running test-patch task DISTRO
Testing JIRA OOZIE-2476
Cleaning local git workspace
----------------------------
+1 PATCH_APPLIES
+1 CLEAN
-1 RAW_PATCH_ANALYSIS
+1 the patch does not introduce any @author tags
+1 the patch does not introduce any tabs
+1 the patch does not introduce any trailing spaces
+1 the patch does not introduce any line longer than 132
-1 the patch does not add/modify any testcase
+1 RAT
+1 the patch does not seem to introduce new RAT warnings
+1 JAVADOC
+1 the patch does not seem to introduce new Javadoc warnings
+1 COMPILE
+1 HEAD compiles
+1 patch compiles
+1 the patch does not seem to introduce new javac warnings
+1 BACKWARDS_COMPATIBILITY
+1 the patch does not change any JPA Entity/Colum/Basic/Lob/Transient annotations
+1 the patch does not modify JPA files
-1 TESTS
Tests run: 1766
Tests failed: 2
Tests errors: 0
The patch failed the following testcases:
testForNoDuplicates(org.apache.oozie.event.TestEventGeneration)
testLastOnlyMaterialization(org.apache.oozie.command.coord.TestCoordMaterializeTransitionXCommand)
+1 DISTRO
+1 distro tarball builds with the patch
----------------------------
-1 Overall result, please check the reported -1(s)
The full output of the test-patch run is available at
https://builds.apache.org/job/oozie-trunk-precommit-build/2780/
Adding comment to JIRA
Comment added.
test-patch exit code: 1
Build step 'Execute shell' marked build as failure
Archiving artifacts
Recording test results
Build failed in Jenkins: oozie-trunk-precommit-build #2779
Posted by Apache Jenkins Server <je...@builds.apache.org>.
See <https://builds.apache.org/job/oozie-trunk-precommit-build/2779/>
------------------------------------------
[...truncated 8407 lines...]
[INFO]
[INFO] --- maven-compiler-plugin:2.3.2:testCompile (default-testCompile) @ oozie-tools ---
[INFO] Nothing to compile - all classes are up to date
[INFO]
[INFO] --- maven-surefire-plugin:2.12.2:test (default-test) @ oozie-tools ---
[INFO] Tests are skipped.
[INFO]
[INFO] --- maven-jar-plugin:2.3.1:jar (default-jar) @ oozie-tools ---
[INFO] Building jar: <https://builds.apache.org/job/oozie-trunk-precommit-build/ws/tools/target/oozie-tools-4.3.0-SNAPSHOT.jar>
[INFO]
[INFO] --- maven-site-plugin:2.0-beta-6:attach-descriptor (attach-descriptor) @ oozie-tools ---
[INFO]
[INFO] --- maven-assembly-plugin:2.2.1:single (default-cli) @ oozie-tools ---
[INFO] Reading assembly descriptor: ../src/main/assemblies/tools.xml
[WARNING] The following patterns were never triggered in this artifact exclusion filter:
o '*:*:pom:*'
[INFO] Copying files to <https://builds.apache.org/job/oozie-trunk-precommit-build/ws/tools/target/oozie-tools-4.3.0-SNAPSHOT-tools>
[WARNING] Assembly file: <https://builds.apache.org/job/oozie-trunk-precommit-build/ws/tools/target/oozie-tools-4.3.0-SNAPSHOT-tools> is not a regular file (it may be a directory). It cannot be attached to the project build for installation or deployment.
[INFO]
[INFO] ------------------------------------------------------------------------
[INFO] Building Apache Oozie MiniOozie 4.3.0-SNAPSHOT
[INFO] ------------------------------------------------------------------------
[INFO]
[INFO] --- maven-remote-resources-plugin:1.5:process (default) @ oozie-mini ---
[INFO]
[INFO] --- maven-resources-plugin:2.5:resources (default-resources) @ oozie-mini ---
[debug] execute contextualize
[INFO] Using 'UTF-8' encoding to copy filtered resources.
[INFO] skip non existing resourceDirectory <https://builds.apache.org/job/oozie-trunk-precommit-build/ws/minitest/src/main/resources>
[INFO] Copying 3 resources
[INFO]
[INFO] --- maven-compiler-plugin:2.3.2:compile (default-compile) @ oozie-mini ---
[INFO] No sources to compile
[INFO]
[INFO] --- maven-resources-plugin:2.5:testResources (default-testResources) @ oozie-mini ---
[debug] execute contextualize
[INFO] Using 'UTF-8' encoding to copy filtered resources.
[INFO] Copying 3 resources
[INFO] Copying 3 resources
[INFO]
[INFO] --- maven-compiler-plugin:2.3.2:testCompile (default-testCompile) @ oozie-mini ---
[INFO] Nothing to compile - all classes are up to date
[INFO]
[INFO] --- maven-surefire-plugin:2.12.2:test (default-test) @ oozie-mini ---
[INFO] Tests are skipped.
[INFO]
[INFO] --- maven-jar-plugin:2.3.1:jar (default-jar) @ oozie-mini ---
[INFO] Building jar: <https://builds.apache.org/job/oozie-trunk-precommit-build/ws/minitest/target/oozie-mini-4.3.0-SNAPSHOT.jar>
[INFO]
[INFO] --- maven-site-plugin:2.0-beta-6:attach-descriptor (attach-descriptor) @ oozie-mini ---
[INFO]
[INFO] --- maven-assembly-plugin:2.2.1:single (default-cli) @ oozie-mini ---
[INFO] Reading assembly descriptor: src/main/assemblies/empty.xml
[INFO]
[INFO] ------------------------------------------------------------------------
[INFO] Building Apache Oozie Distro 4.3.0-SNAPSHOT
[INFO] ------------------------------------------------------------------------
[INFO]
[INFO] --- maven-remote-resources-plugin:1.5:process (default) @ oozie-distro ---
[INFO]
[INFO] --- maven-resources-plugin:2.5:resources (default-resources) @ oozie-distro ---
[debug] execute contextualize
[INFO] Using 'UTF-8' encoding to copy filtered resources.
[INFO] skip non existing resourceDirectory <https://builds.apache.org/job/oozie-trunk-precommit-build/ws/distro/src/main/resources>
[INFO] Copying 3 resources
[INFO]
[INFO] --- maven-compiler-plugin:2.3.2:compile (default-compile) @ oozie-distro ---
[INFO] No sources to compile
[INFO]
[INFO] --- maven-resources-plugin:2.5:testResources (default-testResources) @ oozie-distro ---
[debug] execute contextualize
[INFO] Using 'UTF-8' encoding to copy filtered resources.
[INFO] skip non existing resourceDirectory <https://builds.apache.org/job/oozie-trunk-precommit-build/ws/distro/src/test/resources>
[INFO] Copying 3 resources
[INFO]
[INFO] --- maven-compiler-plugin:2.3.2:testCompile (default-testCompile) @ oozie-distro ---
[INFO] No sources to compile
[INFO]
[INFO] --- maven-surefire-plugin:2.12.2:test (default-test) @ oozie-distro ---
[INFO] Tests are skipped.
[INFO]
[INFO] --- maven-jar-plugin:2.3.1:jar (default-jar) @ oozie-distro ---
[INFO] Building jar: <https://builds.apache.org/job/oozie-trunk-precommit-build/ws/distro/target/oozie-distro-4.3.0-SNAPSHOT.jar>
[INFO]
[INFO] --- maven-site-plugin:2.0-beta-6:attach-descriptor (attach-descriptor) @ oozie-distro ---
[INFO]
[INFO] --- maven-antrun-plugin:1.6:run (default) @ oozie-distro ---
[INFO] Executing tasks
main:
[get] Getting: http://archive.apache.org/dist/tomcat/tomcat-6/v6.0.44/bin/apache-tomcat-6.0.44.tar.gz
[get] To: <https://builds.apache.org/job/oozie-trunk-precommit-build/ws/distro/downloads/tomcat-6.0.44.tar.gz>
.....................................................................................................................................................................................................................................................................................................................................................................................................................................................................................................................................................................................................................................................................................
[mkdir] Created dir: <https://builds.apache.org/job/oozie-trunk-precommit-build/ws/distro/target/tomcat>
[gunzip] Expanding <https://builds.apache.org/job/oozie-trunk-precommit-build/ws/distro/downloads/tomcat-6.0.44.tar.gz> to <https://builds.apache.org/job/oozie-trunk-precommit-build/ws/distro/target/tomcat/tomcat-6.0.44.tar>
[untar] Expanding: <https://builds.apache.org/job/oozie-trunk-precommit-build/ws/distro/target/tomcat/tomcat-6.0.44.tar> into <https://builds.apache.org/job/oozie-trunk-precommit-build/ws/distro/target/tomcat>
[delete] Deleting directory <https://builds.apache.org/job/oozie-trunk-precommit-build/ws/distro/target/tomcat/oozie-server/webapps>
[mkdir] Created dir: <https://builds.apache.org/job/oozie-trunk-precommit-build/ws/distro/target/tomcat/oozie-server/webapps>
[delete] Deleting: <https://builds.apache.org/job/oozie-trunk-precommit-build/ws/distro/target/tomcat/oozie-server/conf/server.xml>
[copy] Copying 1 file to <https://builds.apache.org/job/oozie-trunk-precommit-build/ws/distro/target/tomcat/oozie-server/conf>
[copy] Copying 1 file to <https://builds.apache.org/job/oozie-trunk-precommit-build/ws/distro/target/tomcat/oozie-server/conf>
[mkdir] Created dir: <https://builds.apache.org/job/oozie-trunk-precommit-build/ws/distro/target/tomcat/oozie-server/conf/ssl>
[copy] Copying 1 file to <https://builds.apache.org/job/oozie-trunk-precommit-build/ws/distro/target/tomcat/oozie-server/conf/ssl>
[copy] Copying 1 file to <https://builds.apache.org/job/oozie-trunk-precommit-build/ws/distro/target/tomcat/oozie-server/conf/ssl>
[copy] Copying 1 file to <https://builds.apache.org/job/oozie-trunk-precommit-build/ws/distro/target/tomcat/oozie-server/conf/ssl>
[copy] Copying 3 files to <https://builds.apache.org/job/oozie-trunk-precommit-build/ws/distro/target/tomcat/oozie-server/webapps/ROOT>
[INFO] Executed tasks
[INFO]
[INFO] --- maven-assembly-plugin:2.2.1:single (default-cli) @ oozie-distro ---
[INFO] Reading assembly descriptor: ../src/main/assemblies/distro.xml
[INFO] Copying files to <https://builds.apache.org/job/oozie-trunk-precommit-build/ws/distro/target/oozie-4.3.0-SNAPSHOT-distro>
[WARNING] Assembly file: <https://builds.apache.org/job/oozie-trunk-precommit-build/ws/distro/target/oozie-4.3.0-SNAPSHOT-distro> is not a regular file (it may be a directory). It cannot be attached to the project build for installation or deployment.
[INFO] Building tar : <https://builds.apache.org/job/oozie-trunk-precommit-build/ws/distro/target/oozie-4.3.0-SNAPSHOT-distro.tar.gz>
[INFO]
[INFO] ------------------------------------------------------------------------
[INFO] Building Apache Oozie ZooKeeper Security Tests 4.3.0-SNAPSHOT
[INFO] ------------------------------------------------------------------------
[INFO]
[INFO] --- maven-remote-resources-plugin:1.5:process (default) @ oozie-zookeeper-security-tests ---
[INFO]
[INFO] --- maven-resources-plugin:2.5:resources (default-resources) @ oozie-zookeeper-security-tests ---
[debug] execute contextualize
[INFO] Using 'UTF-8' encoding to copy filtered resources.
[INFO] skip non existing resourceDirectory <https://builds.apache.org/job/oozie-trunk-precommit-build/ws/zookeeper-security-tests/src/main/resources>
[INFO] Copying 3 resources
[INFO]
[INFO] --- maven-compiler-plugin:2.3.2:compile (default-compile) @ oozie-zookeeper-security-tests ---
[INFO] No sources to compile
[INFO]
[INFO] --- maven-resources-plugin:2.5:testResources (default-testResources) @ oozie-zookeeper-security-tests ---
[debug] execute contextualize
[INFO] Using 'UTF-8' encoding to copy filtered resources.
[INFO] skip non existing resourceDirectory <https://builds.apache.org/job/oozie-trunk-precommit-build/ws/zookeeper-security-tests/src/test/resources>
[INFO] Copying 3 resources
[INFO]
[INFO] --- maven-compiler-plugin:2.3.2:testCompile (default-testCompile) @ oozie-zookeeper-security-tests ---
[INFO] Nothing to compile - all classes are up to date
[INFO]
[INFO] --- maven-surefire-plugin:2.12.2:test (default-test) @ oozie-zookeeper-security-tests ---
[INFO] Tests are skipped.
[INFO]
[INFO] --- maven-jar-plugin:2.3.1:jar (default-jar) @ oozie-zookeeper-security-tests ---
[INFO] Building jar: <https://builds.apache.org/job/oozie-trunk-precommit-build/ws/zookeeper-security-tests/target/oozie-zookeeper-security-tests-4.3.0-SNAPSHOT.jar>
[INFO]
[INFO] --- maven-site-plugin:2.0-beta-6:attach-descriptor (attach-descriptor) @ oozie-zookeeper-security-tests ---
[INFO]
[INFO] --- maven-assembly-plugin:2.2.1:single (default-cli) @ oozie-zookeeper-security-tests ---
[INFO] Reading assembly descriptor: src/main/assemblies/empty.xml
[INFO] ------------------------------------------------------------------------
[INFO] Reactor Summary:
[INFO]
[INFO] Apache Oozie Main ................................. SUCCESS [ 1.537 s]
[INFO] Apache Oozie Hadoop Utils ......................... SUCCESS [ 0.643 s]
[INFO] Apache Oozie Hadoop Distcp hadoop-1-4.3.0-SNAPSHOT SUCCESS [ 0.189 s]
[INFO] Apache Oozie Hadoop Auth hadoop-1-4.3.0-SNAPSHOT .. SUCCESS [ 0.211 s]
[INFO] Apache Oozie Hadoop Libs .......................... SUCCESS [ 0.028 s]
[INFO] Apache Oozie Client ............................... SUCCESS [ 31.062 s]
[INFO] Apache Oozie Share Lib Oozie ...................... SUCCESS [ 1.000 s]
[INFO] Apache Oozie Share Lib HCatalog ................... SUCCESS [ 1.071 s]
[INFO] Apache Oozie Share Lib Distcp ..................... SUCCESS [ 0.220 s]
[INFO] Apache Oozie Core ................................. SUCCESS [ 31.807 s]
[INFO] Apache Oozie Share Lib Streaming .................. SUCCESS [ 1.186 s]
[INFO] Apache Oozie Share Lib Pig ........................ SUCCESS [ 0.909 s]
[INFO] Apache Oozie Share Lib Hive ....................... SUCCESS [ 2.254 s]
[INFO] Apache Oozie Share Lib Hive 2 ..................... SUCCESS [ 1.788 s]
[INFO] Apache Oozie Share Lib Sqoop ...................... SUCCESS [ 0.401 s]
[INFO] Apache Oozie Examples ............................. SUCCESS [ 1.767 s]
[INFO] Apache Oozie Share Lib Spark ...................... SUCCESS [ 4.676 s]
[INFO] Apache Oozie Share Lib ............................ SUCCESS [ 17.470 s]
[INFO] Apache Oozie Docs ................................. SUCCESS [ 12.011 s]
[INFO] Apache Oozie WebApp ............................... SUCCESS [ 24.901 s]
[INFO] Apache Oozie Tools ................................ SUCCESS [ 0.571 s]
[INFO] Apache Oozie MiniOozie ............................ SUCCESS [ 0.235 s]
[INFO] Apache Oozie Distro ............................... SUCCESS [ 37.393 s]
[INFO] Apache Oozie ZooKeeper Security Tests ............. SUCCESS [ 1.627 s]
[INFO] ------------------------------------------------------------------------
[INFO] BUILD SUCCESS
[INFO] ------------------------------------------------------------------------
[INFO] Total time: 02:56 min
[INFO] Finished at: 2016-03-03T23:38:14+00:00
[INFO] Final Memory: 72M/1009M
[INFO] ------------------------------------------------------------------------
Reports
Running test-patch task CLEAN
Running test-patch task RAW_PATCH_ANALYSIS
Running test-patch task RAT
Running test-patch task JAVADOC
Running test-patch task COMPILE
Running test-patch task BACKWARDS_COMPATIBILITY
Running test-patch task TESTS
Running test-patch task DISTRO
Testing JIRA OOZIE-2430
Cleaning local git workspace
----------------------------
+1 PATCH_APPLIES
+1 CLEAN
-1 RAW_PATCH_ANALYSIS
+1 the patch does not introduce any @author tags
+1 the patch does not introduce any tabs
+1 the patch does not introduce any trailing spaces
+1 the patch does not introduce any line longer than 132
-1 the patch does not add/modify any testcase
+1 RAT
+1 the patch does not seem to introduce new RAT warnings
+1 JAVADOC
+1 the patch does not seem to introduce new Javadoc warnings
+1 COMPILE
+1 HEAD compiles
+1 patch compiles
+1 the patch does not seem to introduce new javac warnings
+1 BACKWARDS_COMPATIBILITY
+1 the patch does not change any JPA Entity/Colum/Basic/Lob/Transient annotations
+1 the patch does not modify JPA files
-1 TESTS
Tests run: 1765
Tests failed: 2
Tests errors: 0
The patch failed the following testcases:
testForNoDuplicates(org.apache.oozie.event.TestEventGeneration)
testSamplers(org.apache.oozie.util.TestMetricsInstrumentation)
+1 DISTRO
+1 distro tarball builds with the patch
----------------------------
-1 Overall result, please check the reported -1(s)
The full output of the test-patch run is available at
https://builds.apache.org/job/oozie-trunk-precommit-build/2779/
Adding comment to JIRA
Comment added.
test-patch exit code: 1
Build step 'Execute shell' marked build as failure
Archiving artifacts
Recording test results
Build failed in Jenkins: oozie-trunk-precommit-build #2778
Posted by Apache Jenkins Server <je...@builds.apache.org>.
See <https://builds.apache.org/job/oozie-trunk-precommit-build/2778/changes>
Changes:
[purushah] OOZIE-2446 Job does not fail during submission if non existent
[purushah] OOZIE-2246 CoordinatorInputCheckCommand does not behave properly when
------------------------------------------
[...truncated 8409 lines...]
[INFO]
[INFO] --- maven-compiler-plugin:2.3.2:testCompile (default-testCompile) @ oozie-tools ---
[INFO] Nothing to compile - all classes are up to date
[INFO]
[INFO] --- maven-surefire-plugin:2.12.2:test (default-test) @ oozie-tools ---
[INFO] Tests are skipped.
[INFO]
[INFO] --- maven-jar-plugin:2.3.1:jar (default-jar) @ oozie-tools ---
[INFO] Building jar: <https://builds.apache.org/job/oozie-trunk-precommit-build/ws/tools/target/oozie-tools-4.3.0-SNAPSHOT.jar>
[INFO]
[INFO] --- maven-site-plugin:2.0-beta-6:attach-descriptor (attach-descriptor) @ oozie-tools ---
[INFO]
[INFO] --- maven-assembly-plugin:2.2.1:single (default-cli) @ oozie-tools ---
[INFO] Reading assembly descriptor: ../src/main/assemblies/tools.xml
[WARNING] The following patterns were never triggered in this artifact exclusion filter:
o '*:*:pom:*'
[INFO] Copying files to <https://builds.apache.org/job/oozie-trunk-precommit-build/ws/tools/target/oozie-tools-4.3.0-SNAPSHOT-tools>
[WARNING] Assembly file: <https://builds.apache.org/job/oozie-trunk-precommit-build/ws/tools/target/oozie-tools-4.3.0-SNAPSHOT-tools> is not a regular file (it may be a directory). It cannot be attached to the project build for installation or deployment.
[INFO]
[INFO] ------------------------------------------------------------------------
[INFO] Building Apache Oozie MiniOozie 4.3.0-SNAPSHOT
[INFO] ------------------------------------------------------------------------
[INFO]
[INFO] --- maven-remote-resources-plugin:1.5:process (default) @ oozie-mini ---
[INFO]
[INFO] --- maven-resources-plugin:2.5:resources (default-resources) @ oozie-mini ---
[debug] execute contextualize
[INFO] Using 'UTF-8' encoding to copy filtered resources.
[INFO] skip non existing resourceDirectory <https://builds.apache.org/job/oozie-trunk-precommit-build/ws/minitest/src/main/resources>
[INFO] Copying 3 resources
[INFO]
[INFO] --- maven-compiler-plugin:2.3.2:compile (default-compile) @ oozie-mini ---
[INFO] No sources to compile
[INFO]
[INFO] --- maven-resources-plugin:2.5:testResources (default-testResources) @ oozie-mini ---
[debug] execute contextualize
[INFO] Using 'UTF-8' encoding to copy filtered resources.
[INFO] Copying 3 resources
[INFO] Copying 3 resources
[INFO]
[INFO] --- maven-compiler-plugin:2.3.2:testCompile (default-testCompile) @ oozie-mini ---
[INFO] Nothing to compile - all classes are up to date
[INFO]
[INFO] --- maven-surefire-plugin:2.12.2:test (default-test) @ oozie-mini ---
[INFO] Tests are skipped.
[INFO]
[INFO] --- maven-jar-plugin:2.3.1:jar (default-jar) @ oozie-mini ---
[INFO] Building jar: <https://builds.apache.org/job/oozie-trunk-precommit-build/ws/minitest/target/oozie-mini-4.3.0-SNAPSHOT.jar>
[INFO]
[INFO] --- maven-site-plugin:2.0-beta-6:attach-descriptor (attach-descriptor) @ oozie-mini ---
[INFO]
[INFO] --- maven-assembly-plugin:2.2.1:single (default-cli) @ oozie-mini ---
[INFO] Reading assembly descriptor: src/main/assemblies/empty.xml
[INFO]
[INFO] ------------------------------------------------------------------------
[INFO] Building Apache Oozie Distro 4.3.0-SNAPSHOT
[INFO] ------------------------------------------------------------------------
[INFO]
[INFO] --- maven-remote-resources-plugin:1.5:process (default) @ oozie-distro ---
[INFO]
[INFO] --- maven-resources-plugin:2.5:resources (default-resources) @ oozie-distro ---
[debug] execute contextualize
[INFO] Using 'UTF-8' encoding to copy filtered resources.
[INFO] skip non existing resourceDirectory <https://builds.apache.org/job/oozie-trunk-precommit-build/ws/distro/src/main/resources>
[INFO] Copying 3 resources
[INFO]
[INFO] --- maven-compiler-plugin:2.3.2:compile (default-compile) @ oozie-distro ---
[INFO] No sources to compile
[INFO]
[INFO] --- maven-resources-plugin:2.5:testResources (default-testResources) @ oozie-distro ---
[debug] execute contextualize
[INFO] Using 'UTF-8' encoding to copy filtered resources.
[INFO] skip non existing resourceDirectory <https://builds.apache.org/job/oozie-trunk-precommit-build/ws/distro/src/test/resources>
[INFO] Copying 3 resources
[INFO]
[INFO] --- maven-compiler-plugin:2.3.2:testCompile (default-testCompile) @ oozie-distro ---
[INFO] No sources to compile
[INFO]
[INFO] --- maven-surefire-plugin:2.12.2:test (default-test) @ oozie-distro ---
[INFO] Tests are skipped.
[INFO]
[INFO] --- maven-jar-plugin:2.3.1:jar (default-jar) @ oozie-distro ---
[INFO] Building jar: <https://builds.apache.org/job/oozie-trunk-precommit-build/ws/distro/target/oozie-distro-4.3.0-SNAPSHOT.jar>
[INFO]
[INFO] --- maven-site-plugin:2.0-beta-6:attach-descriptor (attach-descriptor) @ oozie-distro ---
[INFO]
[INFO] --- maven-antrun-plugin:1.6:run (default) @ oozie-distro ---
[INFO] Executing tasks
main:
[get] Getting: http://archive.apache.org/dist/tomcat/tomcat-6/v6.0.44/bin/apache-tomcat-6.0.44.tar.gz
[get] To: <https://builds.apache.org/job/oozie-trunk-precommit-build/ws/distro/downloads/tomcat-6.0.44.tar.gz>
......................................................................................................................................................................................................................................................................................................................................................................................................................................................................................................................................................................................................................................................................................................
[mkdir] Created dir: <https://builds.apache.org/job/oozie-trunk-precommit-build/ws/distro/target/tomcat>
[gunzip] Expanding <https://builds.apache.org/job/oozie-trunk-precommit-build/ws/distro/downloads/tomcat-6.0.44.tar.gz> to <https://builds.apache.org/job/oozie-trunk-precommit-build/ws/distro/target/tomcat/tomcat-6.0.44.tar>
[untar] Expanding: <https://builds.apache.org/job/oozie-trunk-precommit-build/ws/distro/target/tomcat/tomcat-6.0.44.tar> into <https://builds.apache.org/job/oozie-trunk-precommit-build/ws/distro/target/tomcat>
[delete] Deleting directory <https://builds.apache.org/job/oozie-trunk-precommit-build/ws/distro/target/tomcat/oozie-server/webapps>
[mkdir] Created dir: <https://builds.apache.org/job/oozie-trunk-precommit-build/ws/distro/target/tomcat/oozie-server/webapps>
[delete] Deleting: <https://builds.apache.org/job/oozie-trunk-precommit-build/ws/distro/target/tomcat/oozie-server/conf/server.xml>
[copy] Copying 1 file to <https://builds.apache.org/job/oozie-trunk-precommit-build/ws/distro/target/tomcat/oozie-server/conf>
[copy] Copying 1 file to <https://builds.apache.org/job/oozie-trunk-precommit-build/ws/distro/target/tomcat/oozie-server/conf>
[mkdir] Created dir: <https://builds.apache.org/job/oozie-trunk-precommit-build/ws/distro/target/tomcat/oozie-server/conf/ssl>
[copy] Copying 1 file to <https://builds.apache.org/job/oozie-trunk-precommit-build/ws/distro/target/tomcat/oozie-server/conf/ssl>
[copy] Copying 1 file to <https://builds.apache.org/job/oozie-trunk-precommit-build/ws/distro/target/tomcat/oozie-server/conf/ssl>
[copy] Copying 1 file to <https://builds.apache.org/job/oozie-trunk-precommit-build/ws/distro/target/tomcat/oozie-server/conf/ssl>
[copy] Copying 3 files to <https://builds.apache.org/job/oozie-trunk-precommit-build/ws/distro/target/tomcat/oozie-server/webapps/ROOT>
[INFO] Executed tasks
[INFO]
[INFO] --- maven-assembly-plugin:2.2.1:single (default-cli) @ oozie-distro ---
[INFO] Reading assembly descriptor: ../src/main/assemblies/distro.xml
[INFO] Copying files to <https://builds.apache.org/job/oozie-trunk-precommit-build/ws/distro/target/oozie-4.3.0-SNAPSHOT-distro>
[WARNING] Assembly file: <https://builds.apache.org/job/oozie-trunk-precommit-build/ws/distro/target/oozie-4.3.0-SNAPSHOT-distro> is not a regular file (it may be a directory). It cannot be attached to the project build for installation or deployment.
[INFO] Building tar : <https://builds.apache.org/job/oozie-trunk-precommit-build/ws/distro/target/oozie-4.3.0-SNAPSHOT-distro.tar.gz>
[INFO]
[INFO] ------------------------------------------------------------------------
[INFO] Building Apache Oozie ZooKeeper Security Tests 4.3.0-SNAPSHOT
[INFO] ------------------------------------------------------------------------
[INFO]
[INFO] --- maven-remote-resources-plugin:1.5:process (default) @ oozie-zookeeper-security-tests ---
[INFO]
[INFO] --- maven-resources-plugin:2.5:resources (default-resources) @ oozie-zookeeper-security-tests ---
[debug] execute contextualize
[INFO] Using 'UTF-8' encoding to copy filtered resources.
[INFO] skip non existing resourceDirectory <https://builds.apache.org/job/oozie-trunk-precommit-build/ws/zookeeper-security-tests/src/main/resources>
[INFO] Copying 3 resources
[INFO]
[INFO] --- maven-compiler-plugin:2.3.2:compile (default-compile) @ oozie-zookeeper-security-tests ---
[INFO] No sources to compile
[INFO]
[INFO] --- maven-resources-plugin:2.5:testResources (default-testResources) @ oozie-zookeeper-security-tests ---
[debug] execute contextualize
[INFO] Using 'UTF-8' encoding to copy filtered resources.
[INFO] skip non existing resourceDirectory <https://builds.apache.org/job/oozie-trunk-precommit-build/ws/zookeeper-security-tests/src/test/resources>
[INFO] Copying 3 resources
[INFO]
[INFO] --- maven-compiler-plugin:2.3.2:testCompile (default-testCompile) @ oozie-zookeeper-security-tests ---
[INFO] Nothing to compile - all classes are up to date
[INFO]
[INFO] --- maven-surefire-plugin:2.12.2:test (default-test) @ oozie-zookeeper-security-tests ---
[INFO] Tests are skipped.
[INFO]
[INFO] --- maven-jar-plugin:2.3.1:jar (default-jar) @ oozie-zookeeper-security-tests ---
[INFO] Building jar: <https://builds.apache.org/job/oozie-trunk-precommit-build/ws/zookeeper-security-tests/target/oozie-zookeeper-security-tests-4.3.0-SNAPSHOT.jar>
[INFO]
[INFO] --- maven-site-plugin:2.0-beta-6:attach-descriptor (attach-descriptor) @ oozie-zookeeper-security-tests ---
[INFO]
[INFO] --- maven-assembly-plugin:2.2.1:single (default-cli) @ oozie-zookeeper-security-tests ---
[INFO] Reading assembly descriptor: src/main/assemblies/empty.xml
[INFO] ------------------------------------------------------------------------
[INFO] Reactor Summary:
[INFO]
[INFO] Apache Oozie Main ................................. SUCCESS [ 1.538 s]
[INFO] Apache Oozie Hadoop Utils ......................... SUCCESS [ 0.635 s]
[INFO] Apache Oozie Hadoop Distcp hadoop-1-4.3.0-SNAPSHOT SUCCESS [ 0.168 s]
[INFO] Apache Oozie Hadoop Auth hadoop-1-4.3.0-SNAPSHOT .. SUCCESS [ 0.185 s]
[INFO] Apache Oozie Hadoop Libs .......................... SUCCESS [ 0.028 s]
[INFO] Apache Oozie Client ............................... SUCCESS [ 28.449 s]
[INFO] Apache Oozie Share Lib Oozie ...................... SUCCESS [ 0.987 s]
[INFO] Apache Oozie Share Lib HCatalog ................... SUCCESS [ 1.302 s]
[INFO] Apache Oozie Share Lib Distcp ..................... SUCCESS [ 0.244 s]
[INFO] Apache Oozie Core ................................. SUCCESS [ 31.740 s]
[INFO] Apache Oozie Share Lib Streaming .................. SUCCESS [ 1.284 s]
[INFO] Apache Oozie Share Lib Pig ........................ SUCCESS [ 0.977 s]
[INFO] Apache Oozie Share Lib Hive ....................... SUCCESS [ 2.449 s]
[INFO] Apache Oozie Share Lib Hive 2 ..................... SUCCESS [ 1.805 s]
[INFO] Apache Oozie Share Lib Sqoop ...................... SUCCESS [ 0.437 s]
[INFO] Apache Oozie Examples ............................. SUCCESS [ 1.699 s]
[INFO] Apache Oozie Share Lib Spark ...................... SUCCESS [ 4.911 s]
[INFO] Apache Oozie Share Lib ............................ SUCCESS [ 16.829 s]
[INFO] Apache Oozie Docs ................................. SUCCESS [ 11.445 s]
[INFO] Apache Oozie WebApp ............................... SUCCESS [ 24.888 s]
[INFO] Apache Oozie Tools ................................ SUCCESS [ 0.523 s]
[INFO] Apache Oozie MiniOozie ............................ SUCCESS [ 0.254 s]
[INFO] Apache Oozie Distro ............................... SUCCESS [ 38.555 s]
[INFO] Apache Oozie ZooKeeper Security Tests ............. SUCCESS [ 1.653 s]
[INFO] ------------------------------------------------------------------------
[INFO] BUILD SUCCESS
[INFO] ------------------------------------------------------------------------
[INFO] Total time: 02:54 min
[INFO] Finished at: 2016-03-03T21:01:28+00:00
[INFO] Final Memory: 69M/975M
[INFO] ------------------------------------------------------------------------
Reports
Running test-patch task CLEAN
Running test-patch task RAW_PATCH_ANALYSIS
Running test-patch task RAT
Running test-patch task JAVADOC
Running test-patch task COMPILE
Running test-patch task BACKWARDS_COMPATIBILITY
Running test-patch task TESTS
Running test-patch task DISTRO
Testing JIRA OOZIE-2471
Cleaning local git workspace
----------------------------
+1 PATCH_APPLIES
+1 CLEAN
+1 RAW_PATCH_ANALYSIS
+1 the patch does not introduce any @author tags
+1 the patch does not introduce any tabs
+1 the patch does not introduce any trailing spaces
+1 the patch does not introduce any line longer than 132
+1 the patch does adds/modifies 1 testcase(s)
+1 RAT
+1 the patch does not seem to introduce new RAT warnings
+1 JAVADOC
+1 the patch does not seem to introduce new Javadoc warnings
+1 COMPILE
+1 HEAD compiles
+1 patch compiles
+1 the patch does not seem to introduce new javac warnings
+1 BACKWARDS_COMPATIBILITY
+1 the patch does not change any JPA Entity/Colum/Basic/Lob/Transient annotations
+1 the patch does not modify JPA files
-1 TESTS
Tests run: 1765
Tests failed: 2
Tests errors: 0
The patch failed the following testcases:
testForNoDuplicates(org.apache.oozie.event.TestEventGeneration)
testSamplers(org.apache.oozie.util.TestMetricsInstrumentation)
+1 DISTRO
+1 distro tarball builds with the patch
----------------------------
-1 Overall result, please check the reported -1(s)
The full output of the test-patch run is available at
https://builds.apache.org/job/oozie-trunk-precommit-build/2778/
Adding comment to JIRA
Comment added.
test-patch exit code: 1
Build step 'Execute shell' marked build as failure
Archiving artifacts
Recording test results