You are viewing a plain text version of this content. The canonical link for it is here.
Posted to builds@beam.apache.org by Apache Jenkins Server <je...@builds.apache.org> on 2023/06/28 16:08:08 UTC

Build failed in Jenkins: beam_PostCommit_Python_Examples_Flink #2019

See <https://ci-beam.apache.org/job/beam_PostCommit_Python_Examples_Flink/2019/display/redirect?page=changes>

Changes:

[noreply] Add explicit PortablePipelineOptions.enableHeapDumps to control heap


------------------------------------------
[...truncated 45.62 MB...]
      raise self
  grpc._channel._MultiThreadedRendezvous: <_MultiThreadedRendezvous of RPC that terminated with:
  	status = StatusCode.CANCELLED
  	details = "Multiplexer hanging up"
  	debug_error_string = "UNKNOWN:Error received from peer ipv6:%5B::1%5D:46763 {grpc_message:"Multiplexer hanging up", grpc_status:1, created_time:"2023-06-28T15:52:54.828826963+00:00"}"
  >
  
    warnings.warn(pytest.PytestUnhandledThreadExceptionWarning(msg))

apache_beam/examples/complete/game/user_score_it_test.py::UserScoreIT::test_userscore_output_checksum_on_small_input
  <https://ci-beam.apache.org/job/beam_PostCommit_Python_Examples_Flink/ws/src/build/gradleenv/2022703442/lib/python3.8/site-packages/_pytest/threadexception.py>:73: PytestUnhandledThreadExceptionWarning: Exception in thread read_grpc_client_inputs
  
  Traceback (most recent call last):
    File "/usr/lib/python3.8/threading.py", line 932, in _bootstrap_inner
      self.run()
    File "/usr/lib/python3.8/threading.py", line 870, in run
      self._target(*self._args, **self._kwargs)
    File "<https://ci-beam.apache.org/job/beam_PostCommit_Python_Examples_Flink/ws/src/sdks/python/apache_beam/runners/worker/data_plane.py",> line 669, in <lambda>
      target=lambda: self._read_inputs(elements_iterator),
    File "<https://ci-beam.apache.org/job/beam_PostCommit_Python_Examples_Flink/ws/src/sdks/python/apache_beam/runners/worker/data_plane.py",> line 652, in _read_inputs
      for elements in elements_iterator:
    File "<https://ci-beam.apache.org/job/beam_PostCommit_Python_Examples_Flink/ws/src/build/gradleenv/2022703442/lib/python3.8/site-packages/grpc/_channel.py",> line 475, in __next__
      return self._next()
    File "<https://ci-beam.apache.org/job/beam_PostCommit_Python_Examples_Flink/ws/src/build/gradleenv/2022703442/lib/python3.8/site-packages/grpc/_channel.py",> line 881, in _next
      raise self
  grpc._channel._MultiThreadedRendezvous: <_MultiThreadedRendezvous of RPC that terminated with:
  	status = StatusCode.CANCELLED
  	details = "Multiplexer hanging up"
  	debug_error_string = "UNKNOWN:Error received from peer ipv6:%5B::1%5D:41183 {grpc_message:"Multiplexer hanging up", grpc_status:1, created_time:"2023-06-28T15:53:27.036496073+00:00"}"
  >
  
    warnings.warn(pytest.PytestUnhandledThreadExceptionWarning(msg))

apache_beam/examples/cookbook/bigquery_tornadoes_it_test.py::BigqueryTornadoesIT::test_bigquery_tornadoes_it
apache_beam/examples/cookbook/filters_test.py::FiltersTest::test_filters_output_bigquery_matcher
apache_beam/examples/dataframe/flight_delays_it_test.py::FlightDelaysTest::test_flight_delays
  <https://ci-beam.apache.org/job/beam_PostCommit_Python_Examples_Flink/ws/src/sdks/python/apache_beam/io/gcp/bigquery.py>:2664: BeamDeprecationWarning: options is deprecated since First stable release. References to <pipeline>.options will not be supported
    temp_location = pcoll.pipeline.options.view_as(

apache_beam/examples/cookbook/bigquery_tornadoes_it_test.py::BigqueryTornadoesIT::test_bigquery_tornadoes_it
apache_beam/examples/cookbook/filters_test.py::FiltersTest::test_filters_output_bigquery_matcher
apache_beam/examples/dataframe/flight_delays_it_test.py::FlightDelaysTest::test_flight_delays
  <https://ci-beam.apache.org/job/beam_PostCommit_Python_Examples_Flink/ws/src/sdks/python/apache_beam/io/gcp/bigquery.py>:2666: BeamDeprecationWarning: options is deprecated since First stable release. References to <pipeline>.options will not be supported
    job_name = pcoll.pipeline.options.view_as(GoogleCloudOptions).job_name

apache_beam/examples/cookbook/bigquery_tornadoes_it_test.py::BigqueryTornadoesIT::test_bigquery_tornadoes_it
apache_beam/examples/cookbook/filters_test.py::FiltersTest::test_filters_output_bigquery_matcher
apache_beam/examples/dataframe/flight_delays_it_test.py::FlightDelaysTest::test_flight_delays
  <https://ci-beam.apache.org/job/beam_PostCommit_Python_Examples_Flink/ws/src/sdks/python/apache_beam/io/gcp/bigquery.py>:2690: BeamDeprecationWarning: options is deprecated since First stable release. References to <pipeline>.options will not be supported
    pipeline_options=pcoll.pipeline.options,

apache_beam/examples/cookbook/bigquery_tornadoes_it_test.py::BigqueryTornadoesIT::test_bigquery_tornadoes_it
apache_beam/examples/cookbook/filters_test.py::FiltersTest::test_filters_output_bigquery_matcher
  <https://ci-beam.apache.org/job/beam_PostCommit_Python_Examples_Flink/ws/src/sdks/python/apache_beam/io/gcp/bigquery.py>:2024: BeamDeprecationWarning: options is deprecated since First stable release. References to <pipeline>.options will not be supported
    self.table_reference.projectId = pcoll.pipeline.options.view_as(

apache_beam/examples/cookbook/bigquery_tornadoes_it_test.py::BigqueryTornadoesIT::test_bigquery_tornadoes_it
apache_beam/examples/cookbook/filters_test.py::FiltersTest::test_filters_output_bigquery_matcher
  <https://ci-beam.apache.org/job/beam_PostCommit_Python_Examples_Flink/ws/src/sdks/python/apache_beam/io/gcp/bigquery_file_loads.py>:1169: BeamDeprecationWarning: options is deprecated since First stable release. References to <pipeline>.options will not be supported
    self.project = self.project or p.options.view_as(GoogleCloudOptions).project

apache_beam/examples/cookbook/bigquery_tornadoes_it_test.py::BigqueryTornadoesIT::test_bigquery_tornadoes_it
apache_beam/examples/cookbook/filters_test.py::FiltersTest::test_filters_output_bigquery_matcher
  <https://ci-beam.apache.org/job/beam_PostCommit_Python_Examples_Flink/ws/src/sdks/python/apache_beam/io/gcp/tests/utils.py>:100: PendingDeprecationWarning: Client.dataset is deprecated and will be removed in a future version. Use a string like 'my_project.my_dataset' or a cloud.google.bigquery.DatasetReference object, instead.
    table_ref = client.dataset(dataset_id).table(table_id)

apache_beam/examples/cookbook/coders_it_test.py::CodersIT::test_coders_output_files_on_small_input
  <https://ci-beam.apache.org/job/beam_PostCommit_Python_Examples_Flink/ws/src/build/gradleenv/2022703442/lib/python3.8/site-packages/_pytest/threadexception.py>:73: PytestUnhandledThreadExceptionWarning: Exception in thread read_grpc_client_inputs
  
  Traceback (most recent call last):
    File "/usr/lib/python3.8/threading.py", line 932, in _bootstrap_inner
      self.run()
    File "/usr/lib/python3.8/threading.py", line 870, in run
      self._target(*self._args, **self._kwargs)
    File "<https://ci-beam.apache.org/job/beam_PostCommit_Python_Examples_Flink/ws/src/sdks/python/apache_beam/runners/worker/data_plane.py",> line 669, in <lambda>
      target=lambda: self._read_inputs(elements_iterator),
    File "<https://ci-beam.apache.org/job/beam_PostCommit_Python_Examples_Flink/ws/src/sdks/python/apache_beam/runners/worker/data_plane.py",> line 652, in _read_inputs
      for elements in elements_iterator:
    File "<https://ci-beam.apache.org/job/beam_PostCommit_Python_Examples_Flink/ws/src/build/gradleenv/2022703442/lib/python3.8/site-packages/grpc/_channel.py",> line 475, in __next__
      return self._next()
    File "<https://ci-beam.apache.org/job/beam_PostCommit_Python_Examples_Flink/ws/src/build/gradleenv/2022703442/lib/python3.8/site-packages/grpc/_channel.py",> line 881, in _next
      raise self
  grpc._channel._MultiThreadedRendezvous: <_MultiThreadedRendezvous of RPC that terminated with:
  	status = StatusCode.CANCELLED
  	details = "Multiplexer hanging up"
  	debug_error_string = "UNKNOWN:Error received from peer ipv6:%5B::1%5D:34345 {created_time:"2023-06-28T16:04:20.451977815+00:00", grpc_status:1, grpc_message:"Multiplexer hanging up"}"
  >
  
    warnings.warn(pytest.PytestUnhandledThreadExceptionWarning(msg))

apache_beam/examples/cookbook/custom_ptransform_it_test.py::CustomPTransformIT::test_custom_ptransform_output_files_on_small_input
  <https://ci-beam.apache.org/job/beam_PostCommit_Python_Examples_Flink/ws/src/build/gradleenv/2022703442/lib/python3.8/site-packages/_pytest/threadexception.py>:73: PytestUnhandledThreadExceptionWarning: Exception in thread read_grpc_client_inputs
  
  Traceback (most recent call last):
    File "/usr/lib/python3.8/threading.py", line 932, in _bootstrap_inner
      self.run()
    File "/usr/lib/python3.8/threading.py", line 870, in run
      self._target(*self._args, **self._kwargs)
    File "<https://ci-beam.apache.org/job/beam_PostCommit_Python_Examples_Flink/ws/src/sdks/python/apache_beam/runners/worker/data_plane.py",> line 669, in <lambda>
      target=lambda: self._read_inputs(elements_iterator),
    File "<https://ci-beam.apache.org/job/beam_PostCommit_Python_Examples_Flink/ws/src/sdks/python/apache_beam/runners/worker/data_plane.py",> line 652, in _read_inputs
      for elements in elements_iterator:
    File "<https://ci-beam.apache.org/job/beam_PostCommit_Python_Examples_Flink/ws/src/build/gradleenv/2022703442/lib/python3.8/site-packages/grpc/_channel.py",> line 475, in __next__
      return self._next()
    File "<https://ci-beam.apache.org/job/beam_PostCommit_Python_Examples_Flink/ws/src/build/gradleenv/2022703442/lib/python3.8/site-packages/grpc/_channel.py",> line 881, in _next
      raise self
  grpc._channel._MultiThreadedRendezvous: <_MultiThreadedRendezvous of RPC that terminated with:
  	status = StatusCode.CANCELLED
  	details = "Multiplexer hanging up"
  	debug_error_string = "UNKNOWN:Error received from peer ipv6:%5B::1%5D:37255 {grpc_message:"Multiplexer hanging up", grpc_status:1, created_time:"2023-06-28T16:05:03.676449232+00:00"}"
  >
  
    warnings.warn(pytest.PytestUnhandledThreadExceptionWarning(msg))

apache_beam/examples/cookbook/filters_test.py::FiltersTest::test_filters_output_bigquery_matcher
  <https://ci-beam.apache.org/job/beam_PostCommit_Python_Examples_Flink/ws/src/build/gradleenv/2022703442/lib/python3.8/site-packages/_pytest/threadexception.py>:73: PytestUnhandledThreadExceptionWarning: Exception in thread read_grpc_client_inputs
  
  Traceback (most recent call last):
    File "/usr/lib/python3.8/threading.py", line 932, in _bootstrap_inner
      self.run()
    File "/usr/lib/python3.8/threading.py", line 870, in run
      self._target(*self._args, **self._kwargs)
    File "<https://ci-beam.apache.org/job/beam_PostCommit_Python_Examples_Flink/ws/src/sdks/python/apache_beam/runners/worker/data_plane.py",> line 669, in <lambda>
      target=lambda: self._read_inputs(elements_iterator),
    File "<https://ci-beam.apache.org/job/beam_PostCommit_Python_Examples_Flink/ws/src/sdks/python/apache_beam/runners/worker/data_plane.py",> line 652, in _read_inputs
      for elements in elements_iterator:
    File "<https://ci-beam.apache.org/job/beam_PostCommit_Python_Examples_Flink/ws/src/build/gradleenv/2022703442/lib/python3.8/site-packages/grpc/_channel.py",> line 475, in __next__
      return self._next()
    File "<https://ci-beam.apache.org/job/beam_PostCommit_Python_Examples_Flink/ws/src/build/gradleenv/2022703442/lib/python3.8/site-packages/grpc/_channel.py",> line 881, in _next
      raise self
  grpc._channel._MultiThreadedRendezvous: <_MultiThreadedRendezvous of RPC that terminated with:
  	status = StatusCode.CANCELLED
  	details = "Multiplexer hanging up"
  	debug_error_string = "UNKNOWN:Error received from peer ipv6:%5B::1%5D:37261 {created_time:"2023-06-28T16:05:52.966860742+00:00", grpc_status:1, grpc_message:"Multiplexer hanging up"}"
  >
  
    warnings.warn(pytest.PytestUnhandledThreadExceptionWarning(msg))

apache_beam/examples/cookbook/group_with_coder_test.py::GroupWithCoderTest::test_basics_with_type_check
  <https://ci-beam.apache.org/job/beam_PostCommit_Python_Examples_Flink/ws/src/build/gradleenv/2022703442/lib/python3.8/site-packages/_pytest/threadexception.py>:73: PytestUnhandledThreadExceptionWarning: Exception in thread read_grpc_client_inputs
  
  Traceback (most recent call last):
    File "/usr/lib/python3.8/threading.py", line 932, in _bootstrap_inner
      self.run()
    File "/usr/lib/python3.8/threading.py", line 870, in run
      self._target(*self._args, **self._kwargs)
    File "<https://ci-beam.apache.org/job/beam_PostCommit_Python_Examples_Flink/ws/src/sdks/python/apache_beam/runners/worker/data_plane.py",> line 669, in <lambda>
      target=lambda: self._read_inputs(elements_iterator),
    File "<https://ci-beam.apache.org/job/beam_PostCommit_Python_Examples_Flink/ws/src/sdks/python/apache_beam/runners/worker/data_plane.py",> line 652, in _read_inputs
      for elements in elements_iterator:
    File "<https://ci-beam.apache.org/job/beam_PostCommit_Python_Examples_Flink/ws/src/build/gradleenv/2022703442/lib/python3.8/site-packages/grpc/_channel.py",> line 475, in __next__
      return self._next()
    File "<https://ci-beam.apache.org/job/beam_PostCommit_Python_Examples_Flink/ws/src/build/gradleenv/2022703442/lib/python3.8/site-packages/grpc/_channel.py",> line 881, in _next
      raise self
  grpc._channel._MultiThreadedRendezvous: <_MultiThreadedRendezvous of RPC that terminated with:
  	status = StatusCode.CANCELLED
  	details = "Multiplexer hanging up"
  	debug_error_string = "UNKNOWN:Error received from peer ipv6:%5B::1%5D:43429 {created_time:"2023-06-28T16:06:23.01911862+00:00", grpc_status:1, grpc_message:"Multiplexer hanging up"}"
  >
  
    warnings.warn(pytest.PytestUnhandledThreadExceptionWarning(msg))

apache_beam/examples/cookbook/group_with_coder_test.py::GroupWithCoderTest::test_basics_without_type_check
  <https://ci-beam.apache.org/job/beam_PostCommit_Python_Examples_Flink/ws/src/build/gradleenv/2022703442/lib/python3.8/site-packages/_pytest/threadexception.py>:73: PytestUnhandledThreadExceptionWarning: Exception in thread read_grpc_client_inputs
  
  Traceback (most recent call last):
    File "/usr/lib/python3.8/threading.py", line 932, in _bootstrap_inner
      self.run()
    File "/usr/lib/python3.8/threading.py", line 870, in run
      self._target(*self._args, **self._kwargs)
    File "<https://ci-beam.apache.org/job/beam_PostCommit_Python_Examples_Flink/ws/src/sdks/python/apache_beam/runners/worker/data_plane.py",> line 669, in <lambda>
      target=lambda: self._read_inputs(elements_iterator),
    File "<https://ci-beam.apache.org/job/beam_PostCommit_Python_Examples_Flink/ws/src/sdks/python/apache_beam/runners/worker/data_plane.py",> line 652, in _read_inputs
      for elements in elements_iterator:
    File "<https://ci-beam.apache.org/job/beam_PostCommit_Python_Examples_Flink/ws/src/build/gradleenv/2022703442/lib/python3.8/site-packages/grpc/_channel.py",> line 475, in __next__
      return self._next()
    File "<https://ci-beam.apache.org/job/beam_PostCommit_Python_Examples_Flink/ws/src/build/gradleenv/2022703442/lib/python3.8/site-packages/grpc/_channel.py",> line 881, in _next
      raise self
  grpc._channel._MultiThreadedRendezvous: <_MultiThreadedRendezvous of RPC that terminated with:
  	status = StatusCode.CANCELLED
  	details = "Multiplexer hanging up"
  	debug_error_string = "UNKNOWN:Error received from peer ipv6:%5B::1%5D:46391 {created_time:"2023-06-28T16:06:39.788920114+00:00", grpc_status:1, grpc_message:"Multiplexer hanging up"}"
  >
  
    warnings.warn(pytest.PytestUnhandledThreadExceptionWarning(msg))

apache_beam/examples/dataframe/flight_delays_it_test.py: 43 warnings
  <https://ci-beam.apache.org/job/beam_PostCommit_Python_Examples_Flink/ws/src/sdks/python/apache_beam/examples/dataframe/flight_delays.py>:47: FutureWarning: The default value of numeric_only in DataFrame.mean is deprecated. In a future version, it will default to False. In addition, specifying 'numeric_only=None' is deprecated. Select only valid columns or specify the value of numeric_only to silence this warning.
    return airline_df[at_top_airports].mean()

apache_beam/examples/dataframe/flight_delays_it_test.py::FlightDelaysTest::test_flight_delays
apache_beam/examples/dataframe/wordcount_test.py::WordCountTest::test_basics
  <https://ci-beam.apache.org/job/beam_PostCommit_Python_Examples_Flink/ws/src/sdks/python/apache_beam/io/fileio.py>:593: BeamDeprecationWarning: options is deprecated since First stable release. References to <pipeline>.options will not be supported
    p.options.view_as(GoogleCloudOptions).temp_location or

-- Docs: https://docs.pytest.org/en/stable/how-to/capture-warnings.html
- generated xml file: <https://ci-beam.apache.org/job/beam_PostCommit_Python_Examples_Flink/ws/src/sdks/python/pytest_postCommitExamples-flink-py38.xml> -
=========================== short test summary info ============================
FAILED apache_beam/examples/complete/juliaset/juliaset/juliaset_test.py::JuliaSetTest::test_output_file_format - Failed: Timeout >600.0s [while running 'WriteToText/Write/WriteImpl/PreFinalize']
= 1 failed, 18 passed, 10 skipped, 6953 deselected, 136 warnings in 1090.52s (0:18:10) =

> Task :sdks:python:test-suites:portable:py38:flinkExamples FAILED

FAILURE: Build completed with 2 failures.

1: Task failed with an exception.
-----------
* Where:
Script '<https://ci-beam.apache.org/job/beam_PostCommit_Python_Examples_Flink/ws/src/sdks/python/test-suites/portable/common.gradle'> line: 245

* What went wrong:
Execution failed for task ':sdks:python:test-suites:portable:py311:flinkExamples'.
> Process 'command 'sh'' finished with non-zero exit value 1

* Try:
> Run with --stacktrace option to get the stack trace.
> Run with --info or --debug option to get more log output.
==============================================================================

2: Task failed with an exception.
-----------
* Where:
Script '<https://ci-beam.apache.org/job/beam_PostCommit_Python_Examples_Flink/ws/src/sdks/python/test-suites/portable/common.gradle'> line: 245

* What went wrong:
Execution failed for task ':sdks:python:test-suites:portable:py38:flinkExamples'.
> Process 'command 'sh'' finished with non-zero exit value 1

* Try:
> Run with --stacktrace option to get the stack trace.
> Run with --info or --debug option to get more log output.
==============================================================================

* Get more help at https://help.gradle.org

Deprecated Gradle features were used in this build, making it incompatible with Gradle 8.0.

You can use '--warning-mode all' to show the individual deprecation warnings and determine if they come from your own scripts or plugins.

See https://docs.gradle.org/7.5.1/userguide/command_line_interface.html#sec:command_line_warnings

BUILD FAILED in 29m 41s
137 actionable tasks: 110 executed, 25 from cache, 2 up-to-date

Publishing build scan...
https://ge.apache.org/s/wcpiarxgzo6dy

Build step 'Invoke Gradle script' changed build result to FAILURE
Build step 'Invoke Gradle script' marked build as failure

---------------------------------------------------------------------
To unsubscribe, e-mail: builds-unsubscribe@beam.apache.org
For additional commands, e-mail: builds-help@beam.apache.org


Jenkins build is back to normal : beam_PostCommit_Python_Examples_Flink #2020

Posted by Apache Jenkins Server <je...@builds.apache.org>.
See <https://ci-beam.apache.org/job/beam_PostCommit_Python_Examples_Flink/2020/display/redirect>


---------------------------------------------------------------------
To unsubscribe, e-mail: builds-unsubscribe@beam.apache.org
For additional commands, e-mail: builds-help@beam.apache.org