You are viewing a plain text version of this content. The canonical link for it is here.
Posted to yarn-dev@hadoop.apache.org by Apache Jenkins Server <je...@builds.apache.org> on 2015/03/10 09:41:41 UTC

Failed: YARN-3305 PreCommit Build #6900

Jira: https://issues.apache.org/jira/browse/YARN-3305
Build: https://builds.apache.org/job/PreCommit-YARN-Build/6900/

###################################################################################
########################## LAST 60 LINES OF THE CONSOLE ###########################
[...truncated 3590 lines...]
  against trunk revision 7711049.

    {color:green}+1 @author{color}.  The patch does not contain any @author tags.

    {color:green}+1 tests included{color}.  The patch appears to include 1 new or modified test files.

    {color:green}+1 javac{color}.  The applied patch does not increase the total number of javac compiler warnings.

    {color:green}+1 javadoc{color}.  There were no new javadoc warning messages.

    {color:green}+1 eclipse:eclipse{color}.  The patch built with eclipse:eclipse.

    {color:red}-1 findbugs{color}.  The patch appears to introduce 5 new Findbugs (version 2.0.3) warnings.

    {color:green}+1 release audit{color}.  The applied patch does not increase the total number of release audit warnings.

    {color:red}-1 core tests{color}.  The patch failed these unit tests in hadoop-yarn-project/hadoop-yarn/hadoop-yarn-server/hadoop-yarn-server-resourcemanager:

                  org.apache.hadoop.yarn.server.resourcemanager.scheduler.capacity.TestCapacitySchedulerNodeLabelUpdate
                  org.apache.hadoop.yarn.server.resourcemanager.scheduler.capacity.TestLeafQueue
                  org.apache.hadoop.yarn.server.resourcemanager.scheduler.capacity.TestApplicationLimits

Test results: https://builds.apache.org/job/PreCommit-YARN-Build/6900//testReport/
Findbugs warnings: https://builds.apache.org/job/PreCommit-YARN-Build/6900//artifact/patchprocess/newPatchFindbugsWarningshadoop-yarn-server-resourcemanager.html
Console output: https://builds.apache.org/job/PreCommit-YARN-Build/6900//console

This message is automatically generated.


======================================================================
======================================================================
    Adding comment to Jira.
======================================================================
======================================================================


Comment added.
b4d897a8ec199241d727f2c1006557124f1892ec logged out


======================================================================
======================================================================
    Finished build.
======================================================================
======================================================================


Build step 'Execute shell' marked build as failure
Archiving artifacts
Sending artifact delta relative to PreCommit-YARN-Build #6896
Archived 15 artifacts
Archive block size is 32768
Received 50 blocks and 7455626 bytes
Compression is 18.0%
Took 2.4 sec
[description-setter] Could not determine description.
Recording test results
Email was triggered for: Failure
Sending email for trigger: Failure



###################################################################################
############################## FAILED TESTS (if any) ##############################
22 tests failed.
REGRESSION:  org.apache.hadoop.yarn.server.resourcemanager.scheduler.capacity.TestApplicationLimits.testHeadroom

Error Message:
null

Stack Trace:
java.lang.NullPointerException: null
	at org.apache.hadoop.yarn.server.resourcemanager.scheduler.common.fica.FiCaSchedulerApp.<init>(FiCaSchedulerApp.java:89)
	at org.apache.hadoop.yarn.server.resourcemanager.scheduler.capacity.TestApplicationLimits.testHeadroom(TestApplicationLimits.java:602)


REGRESSION:  org.apache.hadoop.yarn.server.resourcemanager.scheduler.capacity.TestCapacitySchedulerNodeLabelUpdate.testNodeUpdate

Error Message:
test timed out after 30000 milliseconds

Stack Trace:
java.lang.Exception: test timed out after 30000 milliseconds
	at java.net.Inet4AddressImpl.lookupAllHostAddr(Native Method)
	at java.net.InetAddress$1.lookupAllHostAddr(InetAddress.java:901)
	at java.net.InetAddress.getAddressesFromNameService(InetAddress.java:1293)
	at java.net.InetAddress.getAllByName0(InetAddress.java:1246)
	at java.net.InetAddress.getAllByName(InetAddress.java:1162)
	at java.net.InetAddress.getAllByName(InetAddress.java:1098)
	at java.net.InetAddress.getByName(InetAddress.java:1048)
	at org.apache.hadoop.net.NetUtils.normalizeHostName(NetUtils.java:563)
	at org.apache.hadoop.yarn.server.resourcemanager.NodesListManager.isValidNode(NodesListManager.java:147)
	at org.apache.hadoop.yarn.server.resourcemanager.ResourceTrackerService.nodeHeartbeat(ResourceTrackerService.java:367)
	at org.apache.hadoop.yarn.server.resourcemanager.MockNM.nodeHeartbeat(MockNM.java:178)
	at org.apache.hadoop.yarn.server.resourcemanager.MockNM.nodeHeartbeat(MockNM.java:136)
	at org.apache.hadoop.yarn.server.resourcemanager.MockRM.waitForState(MockRM.java:206)
	at org.apache.hadoop.yarn.server.resourcemanager.scheduler.capacity.TestCapacitySchedulerNodeLabelUpdate.testNodeUpdate(TestCapacitySchedulerNodeLabelUpdate.java:157)


REGRESSION:  org.apache.hadoop.yarn.server.resourcemanager.scheduler.capacity.TestLeafQueue.testHeadroomWithMaxCap

Error Message:
null

Stack Trace:
java.lang.NullPointerException: null
	at org.apache.hadoop.yarn.server.resourcemanager.scheduler.common.fica.FiCaSchedulerApp.<init>(FiCaSchedulerApp.java:89)
	at org.apache.hadoop.yarn.server.resourcemanager.scheduler.capacity.TestLeafQueue.testHeadroomWithMaxCap(TestLeafQueue.java:931)


REGRESSION:  org.apache.hadoop.yarn.server.resourcemanager.scheduler.capacity.TestLeafQueue.testLocalityConstraints

Error Message:
null

Stack Trace:
java.lang.NullPointerException: null
	at org.apache.hadoop.yarn.server.resourcemanager.scheduler.common.fica.FiCaSchedulerApp.<init>(FiCaSchedulerApp.java:89)
	at org.apache.hadoop.yarn.server.resourcemanager.scheduler.capacity.TestLeafQueue.testLocalityConstraints(TestLeafQueue.java:2154)


REGRESSION:  org.apache.hadoop.yarn.server.resourcemanager.scheduler.capacity.TestLeafQueue.testActivateApplicationByUpdatingClusterResource

Error Message:
null

Stack Trace:
java.lang.NullPointerException: null
	at org.apache.hadoop.yarn.server.resourcemanager.scheduler.common.fica.FiCaSchedulerApp.<init>(FiCaSchedulerApp.java:89)
	at org.apache.hadoop.yarn.server.resourcemanager.scheduler.capacity.TestLeafQueue.testActivateApplicationByUpdatingClusterResource(TestLeafQueue.java:2075)


REGRESSION:  org.apache.hadoop.yarn.server.resourcemanager.scheduler.capacity.TestLeafQueue.testStolenReservedContainer

Error Message:
null

Stack Trace:
java.lang.NullPointerException: null
	at org.apache.hadoop.yarn.server.resourcemanager.scheduler.common.fica.FiCaSchedulerApp.<init>(FiCaSchedulerApp.java:89)
	at org.apache.hadoop.yarn.server.resourcemanager.scheduler.capacity.TestLeafQueue.testStolenReservedContainer(TestLeafQueue.java:1353)


REGRESSION:  org.apache.hadoop.yarn.server.resourcemanager.scheduler.capacity.TestLeafQueue.testComputeUserLimitAndSetHeadroom

Error Message:
null

Stack Trace:
java.lang.NullPointerException: null
	at org.apache.hadoop.yarn.server.resourcemanager.scheduler.common.fica.FiCaSchedulerApp.<init>(FiCaSchedulerApp.java:89)
	at org.apache.hadoop.yarn.server.resourcemanager.scheduler.capacity.TestLeafQueue.testComputeUserLimitAndSetHeadroom(TestLeafQueue.java:709)


REGRESSION:  org.apache.hadoop.yarn.server.resourcemanager.scheduler.capacity.TestLeafQueue.testAllocateContainerOnNodeWithoutOffSwitchSpecified

Error Message:
null

Stack Trace:
java.lang.NullPointerException: null
	at org.apache.hadoop.yarn.server.resourcemanager.scheduler.common.fica.FiCaSchedulerApp.<init>(FiCaSchedulerApp.java:89)
	at org.apache.hadoop.yarn.server.resourcemanager.scheduler.capacity.TestLeafQueue.testAllocateContainerOnNodeWithoutOffSwitchSpecified(TestLeafQueue.java:2417)


REGRESSION:  org.apache.hadoop.yarn.server.resourcemanager.scheduler.capacity.TestLeafQueue.testUserQueueAcl

Error Message:
null

Stack Trace:
java.lang.NullPointerException: null
	at org.apache.hadoop.yarn.server.resourcemanager.scheduler.common.fica.FiCaSchedulerApp.<init>(FiCaSchedulerApp.java:89)
	at org.apache.hadoop.yarn.server.resourcemanager.scheduler.capacity.TestLeafQueue.testUserQueueAcl(TestLeafQueue.java:372)


REGRESSION:  org.apache.hadoop.yarn.server.resourcemanager.scheduler.capacity.TestLeafQueue.testSingleQueueWithMultipleUsers

Error Message:
null

Stack Trace:
java.lang.NullPointerException: null
	at org.apache.hadoop.yarn.server.resourcemanager.scheduler.common.fica.FiCaSchedulerApp.<init>(FiCaSchedulerApp.java:89)
	at org.apache.hadoop.yarn.server.resourcemanager.scheduler.capacity.TestLeafQueue.testSingleQueueWithMultipleUsers(TestLeafQueue.java:1047)


REGRESSION:  org.apache.hadoop.yarn.server.resourcemanager.scheduler.capacity.TestLeafQueue.testLocalityScheduling

Error Message:
null

Stack Trace:
java.lang.NullPointerException: null
	at org.apache.hadoop.yarn.server.resourcemanager.scheduler.common.fica.FiCaSchedulerApp.<init>(FiCaSchedulerApp.java:89)
	at org.apache.hadoop.yarn.server.resourcemanager.scheduler.capacity.TestLeafQueue.testLocalityScheduling(TestLeafQueue.java:1599)


REGRESSION:  org.apache.hadoop.yarn.server.resourcemanager.scheduler.capacity.TestLeafQueue.testSchedulingConstraints

Error Message:
null

Stack Trace:
java.lang.NullPointerException: null
	at org.apache.hadoop.yarn.server.resourcemanager.scheduler.common.fica.FiCaSchedulerApp.<init>(FiCaSchedulerApp.java:89)
	at org.apache.hadoop.yarn.server.resourcemanager.scheduler.capacity.TestLeafQueue.testSchedulingConstraints(TestLeafQueue.java:1884)


REGRESSION:  org.apache.hadoop.yarn.server.resourcemanager.scheduler.capacity.TestLeafQueue.testActivateApplicationAfterQueueRefresh

Error Message:
null

Stack Trace:
java.lang.NullPointerException: null
	at org.apache.hadoop.yarn.server.resourcemanager.scheduler.common.fica.FiCaSchedulerApp.<init>(FiCaSchedulerApp.java:89)
	at org.apache.hadoop.yarn.server.resourcemanager.scheduler.capacity.TestLeafQueue.testActivateApplicationAfterQueueRefresh(TestLeafQueue.java:1994)


REGRESSION:  org.apache.hadoop.yarn.server.resourcemanager.scheduler.capacity.TestLeafQueue.testReservationExchange

Error Message:
null

Stack Trace:
java.lang.NullPointerException: null
	at org.apache.hadoop.yarn.server.resourcemanager.scheduler.common.fica.FiCaSchedulerApp.<init>(FiCaSchedulerApp.java:89)
	at org.apache.hadoop.yarn.server.resourcemanager.scheduler.capacity.TestLeafQueue.testReservationExchange(TestLeafQueue.java:1464)


REGRESSION:  org.apache.hadoop.yarn.server.resourcemanager.scheduler.capacity.TestLeafQueue.testUserLimits

Error Message:
null

Stack Trace:
java.lang.NullPointerException: null
	at org.apache.hadoop.yarn.server.resourcemanager.scheduler.common.fica.FiCaSchedulerApp.<init>(FiCaSchedulerApp.java:89)
	at org.apache.hadoop.yarn.server.resourcemanager.scheduler.capacity.TestLeafQueue.testUserLimits(TestLeafQueue.java:593)


REGRESSION:  org.apache.hadoop.yarn.server.resourcemanager.scheduler.capacity.TestLeafQueue.testUserHeadroomMultiApp

Error Message:
null

Stack Trace:
java.lang.NullPointerException: null
	at org.apache.hadoop.yarn.server.resourcemanager.scheduler.common.fica.FiCaSchedulerApp.<init>(FiCaSchedulerApp.java:89)
	at org.apache.hadoop.yarn.server.resourcemanager.scheduler.capacity.TestLeafQueue.testUserHeadroomMultiApp(TestLeafQueue.java:841)


REGRESSION:  org.apache.hadoop.yarn.server.resourcemanager.scheduler.capacity.TestLeafQueue.testAppAttemptMetrics

Error Message:
null

Stack Trace:
java.lang.NullPointerException: null
	at org.apache.hadoop.yarn.server.resourcemanager.scheduler.common.fica.FiCaSchedulerApp.<init>(FiCaSchedulerApp.java:89)
	at org.apache.hadoop.yarn.server.resourcemanager.scheduler.capacity.CapacityScheduler.addApplicationAttempt(CapacityScheduler.java:762)
	at org.apache.hadoop.yarn.server.resourcemanager.scheduler.capacity.CapacityScheduler.handle(CapacityScheduler.java:1176)
	at org.apache.hadoop.yarn.server.resourcemanager.scheduler.capacity.TestLeafQueue.testAppAttemptMetrics(TestLeafQueue.java:404)


REGRESSION:  org.apache.hadoop.yarn.server.resourcemanager.scheduler.capacity.TestLeafQueue.testApplicationPriorityScheduling

Error Message:
null

Stack Trace:
java.lang.NullPointerException: null
	at org.apache.hadoop.yarn.server.resourcemanager.scheduler.common.fica.FiCaSchedulerApp.<init>(FiCaSchedulerApp.java:89)
	at org.apache.hadoop.yarn.server.resourcemanager.scheduler.capacity.TestLeafQueue.testApplicationPriorityScheduling(TestLeafQueue.java:1748)


REGRESSION:  org.apache.hadoop.yarn.server.resourcemanager.scheduler.capacity.TestLeafQueue.testSingleQueueOneUserMetrics

Error Message:
null

Stack Trace:
java.lang.NullPointerException: null
	at org.apache.hadoop.yarn.server.resourcemanager.scheduler.common.fica.FiCaSchedulerApp.<init>(FiCaSchedulerApp.java:89)
	at org.apache.hadoop.yarn.server.resourcemanager.scheduler.capacity.TestLeafQueue.testSingleQueueOneUserMetrics(TestLeafQueue.java:321)


REGRESSION:  org.apache.hadoop.yarn.server.resourcemanager.scheduler.capacity.TestLeafQueue.testConcurrentAccess

Error Message:
null

Stack Trace:
java.lang.NullPointerException: null
	at org.apache.hadoop.yarn.server.resourcemanager.scheduler.common.fica.FiCaSchedulerApp.<init>(FiCaSchedulerApp.java:89)
	at org.apache.hadoop.yarn.server.resourcemanager.scheduler.capacity.TestLeafQueue.createListOfApps(TestLeafQueue.java:2530)
	at org.apache.hadoop.yarn.server.resourcemanager.scheduler.capacity.TestLeafQueue.testConcurrentAccess(TestLeafQueue.java:2467)


REGRESSION:  org.apache.hadoop.yarn.server.resourcemanager.scheduler.capacity.TestLeafQueue.testSingleQueueWithOneUser

Error Message:
null

Stack Trace:
java.lang.NullPointerException: null
	at org.apache.hadoop.yarn.server.resourcemanager.scheduler.common.fica.FiCaSchedulerApp.<init>(FiCaSchedulerApp.java:89)
	at org.apache.hadoop.yarn.server.resourcemanager.scheduler.capacity.TestLeafQueue.testSingleQueueWithOneUser(TestLeafQueue.java:453)


REGRESSION:  org.apache.hadoop.yarn.server.resourcemanager.scheduler.capacity.TestLeafQueue.testReservation

Error Message:
null

Stack Trace:
java.lang.NullPointerException: null
	at org.apache.hadoop.yarn.server.resourcemanager.scheduler.common.fica.FiCaSchedulerApp.<init>(FiCaSchedulerApp.java:89)
	at org.apache.hadoop.yarn.server.resourcemanager.scheduler.capacity.TestLeafQueue.testReservation(TestLeafQueue.java:1240)



Failed: YARN-1884 PreCommit Build #6905

Posted by Apache Jenkins Server <je...@builds.apache.org>.
Jira: https://issues.apache.org/jira/browse/YARN-1884
Build: https://builds.apache.org/job/PreCommit-YARN-Build/6905/

###################################################################################
########################## LAST 60 LINES OF THE CONSOLE ###########################
[...truncated 9411 lines...]
                  org.apache.hadoop.yarn.applications.distributedshell.TestDistributedShell
                  org.apache.hadoop.yarn.applications.unmanagedamlauncher.TestUnmanagedAMLauncher
                  org.apache.hadoop.yarn.client.api.impl.TestAHSClient
                  org.apache.hadoop.yarn.client.TestApplicationClientProtocolOnHA
                  org.apache.hadoop.yarn.client.cli.TestYarnCLI
                  org.apache.hadoop.yarn.client.api.impl.TestYarnClient
                  org.apache.hadoop.yarn.server.resourcemanager.applicationsmanager.TestAMRestart
                  org.apache.hadoop.yarn.server.resourcemanager.scheduler.fair.TestAllocationFileLoaderService
                  org.apache.hadoop.yarn.server.resourcemanager.webapp.TestRMWebServicesNodes

                                      The test build failed in hadoop-yarn-project/hadoop-yarn/hadoop-yarn-server/hadoop-yarn-server-web-proxy hadoop-yarn-project/hadoop-yarn/hadoop-yarn-server/hadoop-yarn-server-tests hadoop-yarn-project/hadoop-yarn/hadoop-yarn-server/hadoop-yarn-server-sharedcachemanager hadoop-yarn-project/hadoop-yarn/hadoop-yarn-server/hadoop-yarn-server-applicationhistoryservice 

Test results: https://builds.apache.org/job/PreCommit-YARN-Build/6905//testReport/
Findbugs warnings: https://builds.apache.org/job/PreCommit-YARN-Build/6905//artifact/patchprocess/newPatchFindbugsWarningshadoop-yarn-server-resourcemanager.html
Console output: https://builds.apache.org/job/PreCommit-YARN-Build/6905//console

This message is automatically generated.


======================================================================
======================================================================
    Adding comment to Jira.
======================================================================
======================================================================


Comment added.
caf05ab06cd8694198f2b6ae0e3676ac9ea1f9b5 logged out


======================================================================
======================================================================
    Finished build.
======================================================================
======================================================================


Build step 'Execute shell' marked build as failure
Archiving artifacts
Sending artifact delta relative to PreCommit-YARN-Build #6896
ERROR: Failed to archive {patchprocess/testrun_hadoop-mapreduce-client-nativetask.txt=patchprocess/testrun_hadoop-mapreduce-client-nativetask.txt, patchprocess/patchFindBugsOutputhadoop-mapreduce-client-hs.txt=patchprocess/patchFindBugsOutputhadoop-mapreduce-client-hs.txt, patchprocess/newPatchFindbugsWarningshadoop-yarn-server-common.html=patchprocess/newPatchFindbugsWarningshadoop-yarn-server-common.html, patchprocess/patchFindbugsWarningshadoop-yarn-registry.xml=patchprocess/patchFindbugsWarningshadoop-yarn-registry.xml, patchprocess/patchFindbugsWarningshadoop-mapreduce-client-shuffle.xml=patchprocess/patchFindbugsWarningshadoop-mapreduce-client-shuffle.xml, patchprocess/patchFindbugsWarningshadoop-mapreduce-client-hs.xml=patchprocess/patchFindbugsWarningshadoop-mapreduce-client-hs.xml, patchprocess/newPatchFindbugsWarningshadoop-yarn-common.xml=patchprocess/newPatchFindbugsWarningshadoop-yarn-common.xml, patchprocess/newPatchFindbugsWarningshadoop-yarn-client.html=patchprocess/newPatchFindbugsWarningshadoop-yarn-client.html, patchprocess/testrun_hadoop-yarn-server-common.txt=patchprocess/testrun_hadoop-yarn-server-common.txt, patchprocess/patchFindbugsWarningshadoop-yarn-server-web-proxy.xml=patchprocess/patchFindbugsWarningshadoop-yarn-server-web-proxy.xml, patchprocess/newPatchFindbugsWarningshadoop-mapreduce-client-jobclient.xml=patchprocess/newPatchFindbugsWarningshadoop-mapreduce-client-jobclient.xml, patchprocess/newPatchFindbugsWarningshadoop-yarn-server-resourcemanager.html=patchprocess/newPatchFindbugsWarningshadoop-yarn-server-resourcemanager.html, patchprocess/testrun_hadoop-yarn-server-web-proxy.txt=patchprocess/testrun_hadoop-yarn-server-web-proxy.txt, patchprocess/patchFindbugsWarningshadoop-mapreduce-client-common.xml=patchprocess/patchFindbugsWarningshadoop-mapreduce-client-common.xml, patchprocess/patchFindBugsOutputhadoop-mapreduce-client-shuffle.txt=patchprocess/patchFindBugsOutputhadoop-mapreduce-client-shuffle.txt, patchprocess/newPatchFindbugsWarningshadoop-yarn-api.html=patchprocess/newPatchFindbugsWarningshadoop-yarn-api.html, patchprocess/patchFindBugsOutputhadoop-yarn-api.txt=patchprocess/patchFindBugsOutputhadoop-yarn-api.txt, patchprocess/newPatchFindbugsWarningshadoop-yarn-api.xml=patchprocess/newPatchFindbugsWarningshadoop-yarn-api.xml, patchprocess/patchFindbugsWarningshadoop-yarn-server-tests.xml=patchprocess/patchFindbugsWarningshadoop-yarn-server-tests.xml, patchprocess/testrun_hadoop-mapreduce-client-shuffle.txt=patchprocess/testrun_hadoop-mapreduce-client-shuffle.txt, patchprocess/patchFindbugsWarningshadoop-mapreduce-client-app.xml=patchprocess/patchFindbugsWarningshadoop-mapreduce-client-app.xml, patchprocess/filteredTrunkJavacWarnings.txt=patchprocess/filteredTrunkJavacWarnings.txt, patchprocess/patchFindBugsOutputhadoop-yarn-common.txt=patchprocess/patchFindBugsOutputhadoop-yarn-common.txt, patchprocess/patchJavacWarnings.txt=patchprocess/patchJavacWarnings.txt, patchprocess/patchFindbugsWarningshadoop-yarn-server-nodemanager.xml=patchprocess/patchFindbugsWarningshadoop-yarn-server-nodemanager.xml, patchprocess/patchFindBugsOutputhadoop-mapreduce-client-common.txt=patchprocess/patchFindBugsOutputhadoop-mapreduce-client-common.txt, patchprocess/newPatchFindbugsWarningshadoop-yarn-server-resourcemanager.xml=patchprocess/newPatchFindbugsWarningshadoop-yarn-server-resourcemanager.xml, patchprocess/newPatchFindbugsWarningshadoop-mapreduce-client-hs.html=patchprocess/newPatchFindbugsWarningshadoop-mapreduce-client-hs.html, patchprocess/newPatchFindbugsWarningshadoop-mapreduce-client-core.html=patchprocess/newPatchFindbugsWarningshadoop-mapreduce-client-core.html, patchprocess/diffJavadocWarnings.txt=patchprocess/diffJavadocWarnings.txt, patchprocess/patchFindbugsWarningshadoop-mapreduce-client-core.xml=patchprocess/patchFindbugsWarningshadoop-mapreduce-client-core.xml, patchprocess/testrun_hadoop-mapreduce-client-jobclient.txt=patchprocess/testrun_hadoop-mapreduce-client-jobclient.txt, patchprocess/patchFindbugsWarningshadoop-yarn-server-applicationhistoryservice.xml=patchprocess/patchFindbugsWarningshadoop-yarn-server-applicationhistoryservice.xml, patchprocess/testrun_hadoop-yarn-server-nodemanager.txt=patchprocess/testrun_hadoop-yarn-server-nodemanager.txt, patchprocess/newPatchFindbugsWarningshadoop-yarn-server-tests.html=patchprocess/newPatchFindbugsWarningshadoop-yarn-server-tests.html, patchprocess/newPatchFindbugsWarningshadoop-mapreduce-client-hs-plugins.xml=patchprocess/newPatchFindbugsWarningshadoop-mapreduce-client-hs-plugins.xml, patchprocess/patchReleaseAuditWarnings.txt=patchprocess/patchReleaseAuditWarnings.txt, patchprocess/newPatchFindbugsWarningshadoop-yarn-applications-distributedshell.xml=patchprocess/newPatchFindbugsWarningshadoop-yarn-applications-distributedshell.xml, patchprocess/testrun_hadoop-yarn-applications-distributedshell.txt=patchprocess/testrun_hadoop-yarn-applications-distributedshell.txt, patchprocess/patchFindBugsOutputhadoop-mapreduce-client-hs-plugins.txt=patchprocess/patchFindBugsOutputhadoop-mapreduce-client-hs-plugins.txt, patchprocess/newPatchFindbugsWarningshadoop-yarn-server-applicationhistoryservice.xml=patchprocess/newPatchFindbugsWarningshadoop-yarn-server-applicationhistoryservice.xml, patchprocess/patchEclipseOutput.txt=patchprocess/patchEclipseOutput.txt, patchprocess/patchFindBugsOutputhadoop-yarn-server-sharedcachemanager.txt=patchprocess/patchFindBugsOutputhadoop-yarn-server-sharedcachemanager.txt, patchprocess/newPatchFindbugsWarningshadoop-yarn-server-applicationhistoryservice.html=patchprocess/newPatchFindbugsWarningshadoop-yarn-server-applicationhistoryservice.html, patchprocess/patchFindbugsWarningshadoop-yarn-server-common.xml=patchprocess/patchFindbugsWarningshadoop-yarn-server-common.xml, patchprocess/newPatchFindbugsWarningshadoop-yarn-server-nodemanager.xml=patchprocess/newPatchFindbugsWarningshadoop-yarn-server-nodemanager.xml, patchprocess/patchFindBugsOutputhadoop-mapreduce-client-app.txt=patchprocess/patchFindBugsOutputhadoop-mapreduce-client-app.txt, patchprocess/newPatchFindbugsWarningshadoop-mapreduce-client-jobclient.html=patchprocess/newPatchFindbugsWarningshadoop-mapreduce-client-jobclient.html, patchprocess/newPatchFindbugsWarningshadoop-yarn-registry.xml=patchprocess/newPatchFindbugsWarningshadoop-yarn-registry.xml, patchprocess/patchFindBugsOutputhadoop-yarn-server-tests.txt=patchprocess/patchFindBugsOutputhadoop-yarn-server-tests.txt, patchprocess/newPatchFindbugsWarningshadoop-yarn-server-web-proxy.xml=patchprocess/newPatchFindbugsWarningshadoop-yarn-server-web-proxy.xml, patchprocess/testrun_hadoop-yarn-registry.txt=patchprocess/testrun_hadoop-yarn-registry.txt, patchprocess/patchFindbugsWarningshadoop-mapreduce-client-nativetask.xml=patchprocess/patchFindbugsWarningshadoop-mapreduce-client-nativetask.xml, patchprocess/patchJavadocWarnings.txt=patchprocess/patchJavadocWarnings.txt, patchprocess/newPatchFindbugsWarningshadoop-yarn-server-tests.xml=patchprocess/newPatchFindbugsWarningshadoop-yarn-server-tests.xml, patchprocess/newPatchFindbugsWarningshadoop-mapreduce-client-shuffle.html=patchprocess/newPatchFindbugsWarningshadoop-mapreduce-client-shuffle.html, patchprocess/newPatchFindbugsWarningshadoop-mapreduce-client-common.xml=patchprocess/newPatchFindbugsWarningshadoop-mapreduce-client-common.xml, patchprocess/testrun_hadoop-yarn-server-applicationhistoryservice.txt=patchprocess/testrun_hadoop-yarn-server-applicationhistoryservice.txt, patchprocess/newPatchFindbugsWarningshadoop-mapreduce-client-core.xml=patchprocess/newPatchFindbugsWarningshadoop-mapreduce-client-core.xml, patchprocess/testrun_hadoop-mapreduce-client-hs-plugins.txt=patchprocess/testrun_hadoop-mapreduce-client-hs-plugins.txt, patchprocess/patchFindBugsOutputhadoop-yarn-server-nodemanager.txt=patchprocess/patchFindBugsOutputhadoop-yarn-server-nodemanager.txt, patchprocess/patchFindBugsOutputhadoop-mapreduce-client-core.txt=patchprocess/patchFindBugsOutputhadoop-mapreduce-client-core.txt, patchprocess/patchFindbugsWarningshadoop-yarn-api.xml=patchprocess/patchFindbugsWarningshadoop-yarn-api.xml, patchprocess/patchFindbugsWarningshadoop-yarn-server-sharedcachemanager.xml=patchprocess/patchFindbugsWarningshadoop-yarn-server-sharedcachemanager.xml, patchprocess/patchFindbugsWarningshadoop-mapreduce-client-jobclient.xml=patchprocess/patchFindbugsWarningshadoop-mapreduce-client-jobclient.xml, patchprocess/testrun_hadoop-yarn-api.txt=patchprocess/testrun_hadoop-yarn-api.txt, patchprocess/newPatchFindbugsWarningshadoop-yarn-applications-distributedshell.html=patchprocess/newPatchFindbugsWarningshadoop-yarn-applications-distributedshell.html, patchprocess/testrun_hadoop-yarn-server-tests.txt=patchprocess/testrun_hadoop-yarn-server-tests.txt, patchprocess/patchFindBugsOutputhadoop-yarn-server-applicationhistoryservice.txt=patchprocess/patchFindBugsOutputhadoop-yarn-server-applicationhistoryservice.txt, patchprocess/patchFindBugsOutputhadoop-yarn-client.txt=patchprocess/patchFindBugsOutputhadoop-yarn-client.txt, patchprocess/patchFindBugsOutputhadoop-mapreduce-client-jobclient.txt=patchprocess/patchFindBugsOutputhadoop-mapreduce-client-jobclient.txt, patchprocess/patchFindbugsWarningshadoop-yarn-applications-distributedshell.xml=patchprocess/patchFindbugsWarningshadoop-yarn-applications-distributedshell.xml, patchprocess/patchFindBugsOutputhadoop-yarn-applications-distributedshell.txt=patchprocess/patchFindBugsOutputhadoop-yarn-applications-distributedshell.txt, patchprocess/newPatchFindbugsWarningshadoop-mapreduce-client-app.html=patchprocess/newPatchFindbugsWarningshadoop-mapreduce-client-app.html, patchprocess/patchFindbugsWarningshadoop-yarn-applications-unmanaged-am-launcher.xml=patchprocess/patchFindbugsWarningshadoop-yarn-applications-unmanaged-am-launcher.xml, patchprocess/patchFindBugsOutputhadoop-yarn-registry.txt=patchprocess/patchFindBugsOutputhadoop-yarn-registry.txt, patchprocess/testrun_hadoop-yarn-server-resourcemanager.txt=patchprocess/testrun_hadoop-yarn-server-resourcemanager.txt, patchprocess/patchReleaseAuditOutput.txt=patchprocess/patchReleaseAuditOutput.txt, patchprocess/patchFindbugsWarningshadoop-mapreduce-client-hs-plugins.xml=patchprocess/patchFindbugsWarningshadoop-mapreduce-client-hs-plugins.xml, patchprocess/newPatchFindbugsWarningshadoop-yarn-server-sharedcachemanager.html=patchprocess/newPatchFindbugsWarningshadoop-yarn-server-sharedcachemanager.html, patchprocess/testrun_hadoop-yarn-common.txt=patchprocess/testrun_hadoop-yarn-common.txt, patchprocess/newPatchFindbugsWarningshadoop-mapreduce-client-nativetask.html=patchprocess/newPatchFindbugsWarningshadoop-mapreduce-client-nativetask.html, patchprocess/newPatchFindbugsWarningshadoop-mapreduce-client-shuffle.xml=patchprocess/newPatchFindbugsWarningshadoop-mapreduce-client-shuffle.xml, patchprocess/patchFindBugsOutputhadoop-yarn-server-web-proxy.txt=patchprocess/patchFindBugsOutputhadoop-yarn-server-web-proxy.txt, patchprocess/newPatchFindbugsWarningshadoop-yarn-applications-unmanaged-am-launcher.xml=patchprocess/newPatchFindbugsWarningshadoop-yarn-applications-unmanaged-am-launcher.xml, patchprocess/newPatchFindbugsWarningshadoop-yarn-client.xml=patchprocess/newPatchFindbugsWarningshadoop-yarn-client.xml, patchprocess/testrun_hadoop-yarn-client.txt=patchprocess/testrun_hadoop-yarn-client.txt, patchprocess/testrun_hadoop-mapreduce-client-app.txt=patchprocess/testrun_hadoop-mapreduce-client-app.txt, patchprocess/testrun_hadoop-mapreduce-client-core.txt=patchprocess/testrun_hadoop-mapreduce-client-core.txt, patchprocess/patchFindBugsOutputhadoop-yarn-server-common.txt=patchprocess/patchFindBugsOutputhadoop-yarn-server-common.txt, patchprocess/testrun_hadoop-yarn-server-sharedcachemanager.txt=patchprocess/testrun_hadoop-yarn-server-sharedcachemanager.txt, patchprocess/trunkJavadocWarnings.txt=patchprocess/trunkJavadocWarnings.txt, patchprocess/patchFindbugsWarningshadoop-yarn-common.xml=patchprocess/patchFindbugsWarningshadoop-yarn-common.xml, patchprocess/newPatchFindbugsWarningshadoop-yarn-server-nodemanager.html=patchprocess/newPatchFindbugsWarningshadoop-yarn-server-nodemanager.html, patchprocess/patchFindBugsOutputhadoop-mapreduce-client-nativetask.txt=patchprocess/patchFindBugsOutputhadoop-mapreduce-client-nativetask.txt, patchprocess/newPatchFindbugsWarningshadoop-mapreduce-client-app.xml=patchprocess/newPatchFindbugsWarningshadoop-mapreduce-client-app.xml, patchprocess/newPatchFindbugsWarningshadoop-yarn-applications-unmanaged-am-launcher.html=patchprocess/newPatchFindbugsWarningshadoop-yarn-applications-unmanaged-am-launcher.html, patchprocess/newPatchFindbugsWarningshadoop-mapreduce-client-common.html=patchprocess/newPatchFindbugsWarningshadoop-mapreduce-client-common.html, patchprocess/newPatchFindbugsWarningshadoop-mapreduce-client-hs-plugins.html=patchprocess/newPatchFindbugsWarningshadoop-mapreduce-client-hs-plugins.html, patchprocess/newPatchFindbugsWarningshadoop-yarn-server-web-proxy.html=patchprocess/newPatchFindbugsWarningshadoop-yarn-server-web-proxy.html, patchprocess/newPatchFindbugsWarningshadoop-mapreduce-client-nativetask.xml=patchprocess/newPatchFindbugsWarningshadoop-mapreduce-client-nativetask.xml, patchprocess/newPatchFindbugsWarningshadoop-mapreduce-client-hs.xml=patchprocess/newPatchFindbugsWarningshadoop-mapreduce-client-hs.xml, patchprocess/patchFindBugsOutputhadoop-yarn-applications-unmanaged-am-launcher.txt=patchprocess/patchFindBugsOutputhadoop-yarn-applications-unmanaged-am-launcher.txt, patchprocess/patchFindBugsOutputhadoop-yarn-server-resourcemanager.txt=patchprocess/patchFindBugsOutputhadoop-yarn-server-resourcemanager.txt, patchprocess/newPatchFindbugsWarningshadoop-yarn-registry.html=patchprocess/newPatchFindbugsWarningshadoop-yarn-registry.html, patchprocess/trunkJavacWarnings.txt=patchprocess/trunkJavacWarnings.txt, patchprocess/testrun_hadoop-yarn-applications-unmanaged-am-launcher.txt=patchprocess/testrun_hadoop-yarn-applications-unmanaged-am-launcher.txt, patchprocess/patchFindbugsWarningshadoop-yarn-client.xml=patchprocess/patchFindbugsWarningshadoop-yarn-client.xml, patchprocess/filteredPatchJavacWarnings.txt=patchprocess/filteredPatchJavacWarnings.txt, patchprocess/patchFindbugsWarningshadoop-yarn-server-resourcemanager.xml=patchprocess/patchFindbugsWarningshadoop-yarn-server-resourcemanager.xml, patchprocess/newPatchFindbugsWarningshadoop-yarn-common.html=patchprocess/newPatchFindbugsWarningshadoop-yarn-common.html, patchprocess/testrun_hadoop-mapreduce-client-common.txt=patchprocess/testrun_hadoop-mapreduce-client-common.txt, patchprocess/testrun_hadoop-mapreduce-client-hs.txt=patchprocess/testrun_hadoop-mapreduce-client-hs.txt, patchprocess/newPatchFindbugsWarningshadoop-yarn-server-common.xml=patchprocess/newPatchFindbugsWarningshadoop-yarn-server-common.xml, patchprocess/newPatchFindbugsWarningshadoop-yarn-server-sharedcachemanager.xml=patchprocess/newPatchFindbugsWarningshadoop-yarn-server-sharedcachemanager.xml} due to internal error; falling back to full archiving
java.lang.IllegalStateException: checksum mismatch after transfer (5941776703879538464 vs. 589440107); /x1/jenkins/jenkins-home/jobs/PreCommit-YARN-Build/builds/2015-03-10_20-48-30/archive/patchprocess/testrun_hadoop-yarn-common.txt may be corrupted
	at jsync.protocol.FileSequenceReader.read(FileSequenceReader.java:45)
	at com.cloudbees.jenkins.plugins.jsync.archiver.JSyncArtifactManager.remoteSync(JSyncArtifactManager.java:145)
	at com.cloudbees.jenkins.plugins.jsync.archiver.JSyncArtifactManager.archive(JSyncArtifactManager.java:68)
	at hudson.tasks.ArtifactArchiver.perform(ArtifactArchiver.java:140)
	at hudson.tasks.BuildStepMonitor$1.perform(BuildStepMonitor.java:20)
	at hudson.model.AbstractBuild$AbstractBuildExecution.perform(AbstractBuild.java:756)
	at hudson.model.AbstractBuild$AbstractBuildExecution.performAllBuildSteps(AbstractBuild.java:720)
	at hudson.model.Build$BuildExecution.post2(Build.java:182)
	at hudson.model.AbstractBuild$AbstractBuildExecution.post(AbstractBuild.java:669)
	at hudson.model.Run.execute(Run.java:1731)
	at hudson.model.FreeStyleBuild.run(FreeStyleBuild.java:43)
	at hudson.model.ResourceController.execute(ResourceController.java:88)
	at hudson.model.Executor.run(Executor.java:232)
Description set: MAPREDUCE-4815
Recording test results
Email was triggered for: Failure
Sending email for trigger: Failure



###################################################################################
############################## FAILED TESTS (if any) ##############################
137 tests failed.
FAILED:  org.apache.hadoop.mapred.TestLineRecordReader.testBzip2SplitEndsAtCR

Error Message:
unexpected test data at /home/jenkins/jenkins-slave/workspace/PreCommit-YARN-Build%402/hadoop-mapreduce-project/hadoop-mapreduce-client/hadoop-mapreduce-client-core/target/test-classes/blockEndingInCR.txt.bz2

Stack Trace:
java.lang.AssertionError: unexpected test data at /home/jenkins/jenkins-slave/workspace/PreCommit-YARN-Build%402/hadoop-mapreduce-project/hadoop-mapreduce-client/hadoop-mapreduce-client-core/target/test-classes/blockEndingInCR.txt.bz2
	at org.junit.Assert.fail(Assert.java:88)
	at org.junit.Assert.assertTrue(Assert.java:41)
	at org.apache.hadoop.mapred.TestLineRecordReader.testSplitRecords(TestLineRecordReader.java:55)
	at org.apache.hadoop.mapred.TestLineRecordReader.testBzip2SplitEndsAtCR(TestLineRecordReader.java:98)


FAILED:  org.apache.hadoop.mapred.TestLineRecordReader.testStripBOM

Error Message:
File /home/jenkins/jenkins-slave/workspace/PreCommit-YARN-Build%402/hadoop-mapreduce-project/hadoop-mapreduce-client/hadoop-mapreduce-client-core/target/test-classes/testBOM.txt does not exist

Stack Trace:
java.io.FileNotFoundException: File /home/jenkins/jenkins-slave/workspace/PreCommit-YARN-Build%402/hadoop-mapreduce-project/hadoop-mapreduce-client/hadoop-mapreduce-client-core/target/test-classes/testBOM.txt does not exist
	at org.apache.hadoop.fs.RawLocalFileSystem.deprecatedGetFileStatus(RawLocalFileSystem.java:612)
	at org.apache.hadoop.fs.RawLocalFileSystem.getFileLinkStatusInternal(RawLocalFileSystem.java:821)
	at org.apache.hadoop.fs.RawLocalFileSystem.getFileStatus(RawLocalFileSystem.java:602)
	at org.apache.hadoop.fs.FilterFileSystem.getFileStatus(FilterFileSystem.java:421)
	at org.apache.hadoop.fs.ChecksumFileSystem$ChecksumFSInputChecker.<init>(ChecksumFileSystem.java:140)
	at org.apache.hadoop.fs.ChecksumFileSystem.open(ChecksumFileSystem.java:341)
	at org.apache.hadoop.fs.FileSystem.open(FileSystem.java:767)
	at org.apache.hadoop.mapred.LineRecordReader.<init>(LineRecordReader.java:108)
	at org.apache.hadoop.mapred.LineRecordReader.<init>(LineRecordReader.java:93)
	at org.apache.hadoop.mapred.TestLineRecordReader.testStripBOM(TestLineRecordReader.java:235)


FAILED:  org.apache.hadoop.mapred.TestLineRecordReader.testBzip2SplitEndsAtCRThenLF

Error Message:
unexpected test data at /home/jenkins/jenkins-slave/workspace/PreCommit-YARN-Build%402/hadoop-mapreduce-project/hadoop-mapreduce-client/hadoop-mapreduce-client-core/target/test-classes/blockEndingInCRThenLF.txt.bz2

Stack Trace:
java.lang.AssertionError: unexpected test data at /home/jenkins/jenkins-slave/workspace/PreCommit-YARN-Build%402/hadoop-mapreduce-project/hadoop-mapreduce-client/hadoop-mapreduce-client-core/target/test-classes/blockEndingInCRThenLF.txt.bz2
	at org.junit.Assert.fail(Assert.java:88)
	at org.junit.Assert.assertTrue(Assert.java:41)
	at org.apache.hadoop.mapred.TestLineRecordReader.testSplitRecords(TestLineRecordReader.java:55)
	at org.apache.hadoop.mapred.TestLineRecordReader.testBzip2SplitEndsAtCRThenLF(TestLineRecordReader.java:106)


FAILED:  org.apache.hadoop.mapred.TestLineRecordReader.testRecordSpanningMultipleSplits

Error Message:
/home/jenkins/jenkins-slave/workspace/PreCommit-YARN-Build%402/hadoop-mapreduce-project/hadoop-mapreduce-client/hadoop-mapreduce-client-core/target/test-classes/recordSpanningMultipleSplits.txt (No such file or directory)

Stack Trace:
java.io.FileNotFoundException: /home/jenkins/jenkins-slave/workspace/PreCommit-YARN-Build%402/hadoop-mapreduce-project/hadoop-mapreduce-client/hadoop-mapreduce-client-core/target/test-classes/recordSpanningMultipleSplits.txt (No such file or directory)
	at java.io.FileInputStream.open(Native Method)
	at java.io.FileInputStream.<init>(FileInputStream.java:146)
	at java.io.FileInputStream.<init>(FileInputStream.java:101)
	at org.apache.hadoop.mapred.TestLineRecordReader.readRecordsDirectly(TestLineRecordReader.java:165)
	at org.apache.hadoop.mapred.TestLineRecordReader.checkRecordSpanningMultipleSplits(TestLineRecordReader.java:185)
	at org.apache.hadoop.mapred.TestLineRecordReader.testRecordSpanningMultipleSplits(TestLineRecordReader.java:204)


FAILED:  org.apache.hadoop.mapred.TestLineRecordReader.testMultipleClose

Error Message:
File /home/jenkins/jenkins-slave/workspace/PreCommit-YARN-Build%402/hadoop-mapreduce-project/hadoop-mapreduce-client/hadoop-mapreduce-client-core/target/test-classes/recordSpanningMultipleSplits.txt.bz2 does not exist

Stack Trace:
java.io.FileNotFoundException: File /home/jenkins/jenkins-slave/workspace/PreCommit-YARN-Build%402/hadoop-mapreduce-project/hadoop-mapreduce-client/hadoop-mapreduce-client-core/target/test-classes/recordSpanningMultipleSplits.txt.bz2 does not exist
	at org.apache.hadoop.fs.RawLocalFileSystem.deprecatedGetFileStatus(RawLocalFileSystem.java:612)
	at org.apache.hadoop.fs.RawLocalFileSystem.getFileLinkStatusInternal(RawLocalFileSystem.java:821)
	at org.apache.hadoop.fs.RawLocalFileSystem.getFileStatus(RawLocalFileSystem.java:602)
	at org.apache.hadoop.fs.FilterFileSystem.getFileStatus(FilterFileSystem.java:421)
	at org.apache.hadoop.fs.ChecksumFileSystem$ChecksumFSInputChecker.<init>(ChecksumFileSystem.java:140)
	at org.apache.hadoop.fs.ChecksumFileSystem.open(ChecksumFileSystem.java:341)
	at org.apache.hadoop.fs.FileSystem.open(FileSystem.java:767)
	at org.apache.hadoop.mapred.LineRecordReader.<init>(LineRecordReader.java:108)
	at org.apache.hadoop.mapred.LineRecordReader.<init>(LineRecordReader.java:93)
	at org.apache.hadoop.mapred.TestLineRecordReader.testMultipleClose(TestLineRecordReader.java:270)


FAILED:  org.apache.hadoop.mapred.TestLineRecordReader.testBzip2SplitStartAtBlockMarker

Error Message:
unexpected test data at /home/jenkins/jenkins-slave/workspace/PreCommit-YARN-Build%402/hadoop-mapreduce-project/hadoop-mapreduce-client/hadoop-mapreduce-client-core/target/test-classes/blockEndingInCR.txt.bz2

Stack Trace:
java.lang.AssertionError: unexpected test data at /home/jenkins/jenkins-slave/workspace/PreCommit-YARN-Build%402/hadoop-mapreduce-project/hadoop-mapreduce-client/hadoop-mapreduce-client-core/target/test-classes/blockEndingInCR.txt.bz2
	at org.junit.Assert.fail(Assert.java:88)
	at org.junit.Assert.assertTrue(Assert.java:41)
	at org.apache.hadoop.mapred.TestLineRecordReader.testSplitRecords(TestLineRecordReader.java:55)
	at org.apache.hadoop.mapred.TestLineRecordReader.testBzip2SplitStartAtBlockMarker(TestLineRecordReader.java:118)


FAILED:  org.apache.hadoop.mapred.TestLineRecordReader.testRecordSpanningMultipleSplitsCompressed

Error Message:
/home/jenkins/jenkins-slave/workspace/PreCommit-YARN-Build%402/hadoop-mapreduce-project/hadoop-mapreduce-client/hadoop-mapreduce-client-core/target/test-classes/recordSpanningMultipleSplits.txt.bz2 (No such file or directory)

Stack Trace:
java.io.FileNotFoundException: /home/jenkins/jenkins-slave/workspace/PreCommit-YARN-Build%402/hadoop-mapreduce-project/hadoop-mapreduce-client/hadoop-mapreduce-client-core/target/test-classes/recordSpanningMultipleSplits.txt.bz2 (No such file or directory)
	at java.io.FileInputStream.open(Native Method)
	at java.io.FileInputStream.<init>(FileInputStream.java:146)
	at java.io.FileInputStream.<init>(FileInputStream.java:101)
	at org.apache.hadoop.mapred.TestLineRecordReader.readRecordsDirectly(TestLineRecordReader.java:165)
	at org.apache.hadoop.mapred.TestLineRecordReader.checkRecordSpanningMultipleSplits(TestLineRecordReader.java:185)
	at org.apache.hadoop.mapred.TestLineRecordReader.testRecordSpanningMultipleSplitsCompressed(TestLineRecordReader.java:214)


FAILED:  org.apache.hadoop.mapreduce.lib.input.TestLineRecordReader.testBzip2SplitEndsAtCR

Error Message:
unexpected test data at /home/jenkins/jenkins-slave/workspace/PreCommit-YARN-Build%402/hadoop-mapreduce-project/hadoop-mapreduce-client/hadoop-mapreduce-client-core/target/test-classes/blockEndingInCR.txt.bz2

Stack Trace:
java.lang.AssertionError: unexpected test data at /home/jenkins/jenkins-slave/workspace/PreCommit-YARN-Build%402/hadoop-mapreduce-project/hadoop-mapreduce-client/hadoop-mapreduce-client-core/target/test-classes/blockEndingInCR.txt.bz2
	at org.junit.Assert.fail(Assert.java:88)
	at org.junit.Assert.assertTrue(Assert.java:41)
	at org.apache.hadoop.mapreduce.lib.input.TestLineRecordReader.testSplitRecords(TestLineRecordReader.java:56)
	at org.apache.hadoop.mapreduce.lib.input.TestLineRecordReader.testBzip2SplitEndsAtCR(TestLineRecordReader.java:102)


FAILED:  org.apache.hadoop.mapreduce.lib.input.TestLineRecordReader.testStripBOM

Error Message:
File /home/jenkins/jenkins-slave/workspace/PreCommit-YARN-Build%402/hadoop-mapreduce-project/hadoop-mapreduce-client/hadoop-mapreduce-client-core/target/test-classes/testBOM.txt does not exist

Stack Trace:
java.io.FileNotFoundException: File /home/jenkins/jenkins-slave/workspace/PreCommit-YARN-Build%402/hadoop-mapreduce-project/hadoop-mapreduce-client/hadoop-mapreduce-client-core/target/test-classes/testBOM.txt does not exist
	at org.apache.hadoop.fs.RawLocalFileSystem.deprecatedGetFileStatus(RawLocalFileSystem.java:612)
	at org.apache.hadoop.fs.RawLocalFileSystem.getFileLinkStatusInternal(RawLocalFileSystem.java:821)
	at org.apache.hadoop.fs.RawLocalFileSystem.getFileStatus(RawLocalFileSystem.java:602)
	at org.apache.hadoop.fs.FilterFileSystem.getFileStatus(FilterFileSystem.java:421)
	at org.apache.hadoop.fs.ChecksumFileSystem$ChecksumFSInputChecker.<init>(ChecksumFileSystem.java:140)
	at org.apache.hadoop.fs.ChecksumFileSystem.open(ChecksumFileSystem.java:341)
	at org.apache.hadoop.fs.FileSystem.open(FileSystem.java:767)
	at org.apache.hadoop.mapreduce.lib.input.LineRecordReader.initialize(LineRecordReader.java:85)
	at org.apache.hadoop.mapreduce.lib.input.TestLineRecordReader.testStripBOM(TestLineRecordReader.java:222)


FAILED:  org.apache.hadoop.mapreduce.lib.input.TestLineRecordReader.testBzip2SplitEndsAtCRThenLF

Error Message:
unexpected test data at /home/jenkins/jenkins-slave/workspace/PreCommit-YARN-Build%402/hadoop-mapreduce-project/hadoop-mapreduce-client/hadoop-mapreduce-client-core/target/test-classes/blockEndingInCRThenLF.txt.bz2

Stack Trace:
java.lang.AssertionError: unexpected test data at /home/jenkins/jenkins-slave/workspace/PreCommit-YARN-Build%402/hadoop-mapreduce-project/hadoop-mapreduce-client/hadoop-mapreduce-client-core/target/test-classes/blockEndingInCRThenLF.txt.bz2
	at org.junit.Assert.fail(Assert.java:88)
	at org.junit.Assert.assertTrue(Assert.java:41)
	at org.apache.hadoop.mapreduce.lib.input.TestLineRecordReader.testSplitRecords(TestLineRecordReader.java:56)
	at org.apache.hadoop.mapreduce.lib.input.TestLineRecordReader.testBzip2SplitEndsAtCRThenLF(TestLineRecordReader.java:110)


FAILED:  org.apache.hadoop.mapreduce.lib.input.TestLineRecordReader.testRecordSpanningMultipleSplits

Error Message:
/home/jenkins/jenkins-slave/workspace/PreCommit-YARN-Build%402/hadoop-mapreduce-project/hadoop-mapreduce-client/hadoop-mapreduce-client-core/target/test-classes/recordSpanningMultipleSplits.txt (No such file or directory)

Stack Trace:
java.io.FileNotFoundException: /home/jenkins/jenkins-slave/workspace/PreCommit-YARN-Build%402/hadoop-mapreduce-project/hadoop-mapreduce-client/hadoop-mapreduce-client-core/target/test-classes/recordSpanningMultipleSplits.txt (No such file or directory)
	at java.io.FileInputStream.open(Native Method)
	at java.io.FileInputStream.<init>(FileInputStream.java:146)
	at java.io.FileInputStream.<init>(FileInputStream.java:101)
	at org.apache.hadoop.mapreduce.lib.input.TestLineRecordReader.readRecordsDirectly(TestLineRecordReader.java:147)
	at org.apache.hadoop.mapreduce.lib.input.TestLineRecordReader.checkRecordSpanningMultipleSplits(TestLineRecordReader.java:167)
	at org.apache.hadoop.mapreduce.lib.input.TestLineRecordReader.testRecordSpanningMultipleSplits(TestLineRecordReader.java:186)


FAILED:  org.apache.hadoop.mapreduce.lib.input.TestLineRecordReader.testMultipleClose

Error Message:
File /home/jenkins/jenkins-slave/workspace/PreCommit-YARN-Build%402/hadoop-mapreduce-project/hadoop-mapreduce-client/hadoop-mapreduce-client-core/target/test-classes/recordSpanningMultipleSplits.txt.bz2 does not exist

Stack Trace:
java.io.FileNotFoundException: File /home/jenkins/jenkins-slave/workspace/PreCommit-YARN-Build%402/hadoop-mapreduce-project/hadoop-mapreduce-client/hadoop-mapreduce-client-core/target/test-classes/recordSpanningMultipleSplits.txt.bz2 does not exist
	at org.apache.hadoop.fs.RawLocalFileSystem.deprecatedGetFileStatus(RawLocalFileSystem.java:612)
	at org.apache.hadoop.fs.RawLocalFileSystem.getFileLinkStatusInternal(RawLocalFileSystem.java:821)
	at org.apache.hadoop.fs.RawLocalFileSystem.getFileStatus(RawLocalFileSystem.java:602)
	at org.apache.hadoop.fs.FilterFileSystem.getFileStatus(FilterFileSystem.java:421)
	at org.apache.hadoop.fs.ChecksumFileSystem$ChecksumFSInputChecker.<init>(ChecksumFileSystem.java:140)
	at org.apache.hadoop.fs.ChecksumFileSystem.open(ChecksumFileSystem.java:341)
	at org.apache.hadoop.fs.FileSystem.open(FileSystem.java:767)
	at org.apache.hadoop.mapreduce.lib.input.LineRecordReader.initialize(LineRecordReader.java:85)
	at org.apache.hadoop.mapreduce.lib.input.TestLineRecordReader.testMultipleClose(TestLineRecordReader.java:257)


FAILED:  org.apache.hadoop.mapreduce.lib.input.TestLineRecordReader.testRecordSpanningMultipleSplitsCompressed

Error Message:
/home/jenkins/jenkins-slave/workspace/PreCommit-YARN-Build%402/hadoop-mapreduce-project/hadoop-mapreduce-client/hadoop-mapreduce-client-core/target/test-classes/recordSpanningMultipleSplits.txt.bz2 (No such file or directory)

Stack Trace:
java.io.FileNotFoundException: /home/jenkins/jenkins-slave/workspace/PreCommit-YARN-Build%402/hadoop-mapreduce-project/hadoop-mapreduce-client/hadoop-mapreduce-client-core/target/test-classes/recordSpanningMultipleSplits.txt.bz2 (No such file or directory)
	at java.io.FileInputStream.open(Native Method)
	at java.io.FileInputStream.<init>(FileInputStream.java:146)
	at java.io.FileInputStream.<init>(FileInputStream.java:101)
	at org.apache.hadoop.mapreduce.lib.input.TestLineRecordReader.readRecordsDirectly(TestLineRecordReader.java:147)
	at org.apache.hadoop.mapreduce.lib.input.TestLineRecordReader.checkRecordSpanningMultipleSplits(TestLineRecordReader.java:167)
	at org.apache.hadoop.mapreduce.lib.input.TestLineRecordReader.testRecordSpanningMultipleSplitsCompressed(TestLineRecordReader.java:197)


FAILED:  org.apache.hadoop.mapreduce.v2.hs.TestJobHistoryEntities.testCopmletedJobReportWithZeroTasks[0]

Error Message:
Could not load history file /home/jenkins/jenkins-slave/workspace/PreCommit-YARN-Build%402/hadoop-mapreduce-project/hadoop-mapreduce-client/hadoop-mapreduce-client-hs/target/test-classes/job_1416424547277_0002-1416424775281-root-TeraGen-1416424785433-2-0-SUCCEEDED-default-1416424779349.jhist

Stack Trace:
org.apache.hadoop.yarn.exceptions.YarnRuntimeException: Could not load history file /home/jenkins/jenkins-slave/workspace/PreCommit-YARN-Build%402/hadoop-mapreduce-project/hadoop-mapreduce-client/hadoop-mapreduce-client-hs/target/test-classes/job_1416424547277_0002-1416424775281-root-TeraGen-1416424785433-2-0-SUCCEEDED-default-1416424779349.jhist
	at org.apache.hadoop.fs.RawLocalFileSystem.deprecatedGetFileStatus(RawLocalFileSystem.java:612)
	at org.apache.hadoop.fs.RawLocalFileSystem.getFileLinkStatusInternal(RawLocalFileSystem.java:821)
	at org.apache.hadoop.fs.RawLocalFileSystem.getFileStatus(RawLocalFileSystem.java:602)
	at org.apache.hadoop.fs.FilterFileSystem.getFileStatus(FilterFileSystem.java:421)
	at org.apache.hadoop.fs.ChecksumFileSystem$ChecksumFSInputChecker.<init>(ChecksumFileSystem.java:140)
	at org.apache.hadoop.fs.ChecksumFileSystem.open(ChecksumFileSystem.java:341)
	at org.apache.hadoop.fs.FileSystem.open(FileSystem.java:767)
	at org.apache.hadoop.mapreduce.jobhistory.JobHistoryParser.<init>(JobHistoryParser.java:86)
	at org.apache.hadoop.mapreduce.v2.hs.CompletedJob.loadFullHistoryData(CompletedJob.java:348)
	at org.apache.hadoop.mapreduce.v2.hs.CompletedJob.<init>(CompletedJob.java:104)
	at org.apache.hadoop.mapreduce.v2.hs.TestJobHistoryEntities.testCopmletedJobReportWithZeroTasks(TestJobHistoryEntities.java:118)


FAILED:  org.apache.hadoop.mapreduce.v2.hs.TestJobHistoryEntities.testGetTaskAttemptCompletionEvent[0]

Error Message:
Could not load history file /home/jenkins/jenkins-slave/workspace/PreCommit-YARN-Build%402/hadoop-mapreduce-project/hadoop-mapreduce-client/hadoop-mapreduce-client-hs/target/test-classes/job_1329348432655_0001-1329348443227-user-Sleep+job-1329348468601-10-1-SUCCEEDED-default.jhist

Stack Trace:
org.apache.hadoop.yarn.exceptions.YarnRuntimeException: Could not load history file /home/jenkins/jenkins-slave/workspace/PreCommit-YARN-Build%402/hadoop-mapreduce-project/hadoop-mapreduce-client/hadoop-mapreduce-client-hs/target/test-classes/job_1329348432655_0001-1329348443227-user-Sleep+job-1329348468601-10-1-SUCCEEDED-default.jhist
	at org.apache.hadoop.fs.RawLocalFileSystem.deprecatedGetFileStatus(RawLocalFileSystem.java:612)
	at org.apache.hadoop.fs.RawLocalFileSystem.getFileLinkStatusInternal(RawLocalFileSystem.java:821)
	at org.apache.hadoop.fs.RawLocalFileSystem.getFileStatus(RawLocalFileSystem.java:602)
	at org.apache.hadoop.fs.FilterFileSystem.getFileStatus(FilterFileSystem.java:421)
	at org.apache.hadoop.fs.ChecksumFileSystem$ChecksumFSInputChecker.<init>(ChecksumFileSystem.java:140)
	at org.apache.hadoop.fs.ChecksumFileSystem.open(ChecksumFileSystem.java:341)
	at org.apache.hadoop.fs.FileSystem.open(FileSystem.java:767)
	at org.apache.hadoop.mapreduce.jobhistory.JobHistoryParser.<init>(JobHistoryParser.java:86)
	at org.apache.hadoop.mapreduce.v2.hs.CompletedJob.loadFullHistoryData(CompletedJob.java:348)
	at org.apache.hadoop.mapreduce.v2.hs.CompletedJob.<init>(CompletedJob.java:104)
	at org.apache.hadoop.mapreduce.v2.hs.TestJobHistoryEntities.testGetTaskAttemptCompletionEvent(TestJobHistoryEntities.java:201)


FAILED:  org.apache.hadoop.mapreduce.v2.hs.TestJobHistoryEntities.testCompletedTaskAttempt[0]

Error Message:
Could not load history file /home/jenkins/jenkins-slave/workspace/PreCommit-YARN-Build%402/hadoop-mapreduce-project/hadoop-mapreduce-client/hadoop-mapreduce-client-hs/target/test-classes/job_1329348432655_0001-1329348443227-user-Sleep+job-1329348468601-10-1-SUCCEEDED-default.jhist

Stack Trace:
org.apache.hadoop.yarn.exceptions.YarnRuntimeException: Could not load history file /home/jenkins/jenkins-slave/workspace/PreCommit-YARN-Build%402/hadoop-mapreduce-project/hadoop-mapreduce-client/hadoop-mapreduce-client-hs/target/test-classes/job_1329348432655_0001-1329348443227-user-Sleep+job-1329348468601-10-1-SUCCEEDED-default.jhist
	at org.apache.hadoop.fs.RawLocalFileSystem.deprecatedGetFileStatus(RawLocalFileSystem.java:612)
	at org.apache.hadoop.fs.RawLocalFileSystem.getFileLinkStatusInternal(RawLocalFileSystem.java:821)
	at org.apache.hadoop.fs.RawLocalFileSystem.getFileStatus(RawLocalFileSystem.java:602)
	at org.apache.hadoop.fs.FilterFileSystem.getFileStatus(FilterFileSystem.java:421)
	at org.apache.hadoop.fs.ChecksumFileSystem$ChecksumFSInputChecker.<init>(ChecksumFileSystem.java:140)
	at org.apache.hadoop.fs.ChecksumFileSystem.open(ChecksumFileSystem.java:341)
	at org.apache.hadoop.fs.FileSystem.open(FileSystem.java:767)
	at org.apache.hadoop.mapreduce.jobhistory.JobHistoryParser.<init>(JobHistoryParser.java:86)
	at org.apache.hadoop.mapreduce.v2.hs.CompletedJob.loadFullHistoryData(CompletedJob.java:348)
	at org.apache.hadoop.mapreduce.v2.hs.CompletedJob.<init>(CompletedJob.java:104)
	at org.apache.hadoop.mapreduce.v2.hs.TestJobHistoryEntities.testCompletedTaskAttempt(TestJobHistoryEntities.java:162)


FAILED:  org.apache.hadoop.mapreduce.v2.hs.TestJobHistoryEntities.testCompletedJob[0]

Error Message:
Could not load history file /home/jenkins/jenkins-slave/workspace/PreCommit-YARN-Build%402/hadoop-mapreduce-project/hadoop-mapreduce-client/hadoop-mapreduce-client-hs/target/test-classes/job_1329348432655_0001-1329348443227-user-Sleep+job-1329348468601-10-1-SUCCEEDED-default.jhist

Stack Trace:
org.apache.hadoop.yarn.exceptions.YarnRuntimeException: Could not load history file /home/jenkins/jenkins-slave/workspace/PreCommit-YARN-Build%402/hadoop-mapreduce-project/hadoop-mapreduce-client/hadoop-mapreduce-client-hs/target/test-classes/job_1329348432655_0001-1329348443227-user-Sleep+job-1329348468601-10-1-SUCCEEDED-default.jhist
	at org.apache.hadoop.fs.RawLocalFileSystem.deprecatedGetFileStatus(RawLocalFileSystem.java:612)
	at org.apache.hadoop.fs.RawLocalFileSystem.getFileLinkStatusInternal(RawLocalFileSystem.java:821)
	at org.apache.hadoop.fs.RawLocalFileSystem.getFileStatus(RawLocalFileSystem.java:602)
	at org.apache.hadoop.fs.FilterFileSystem.getFileStatus(FilterFileSystem.java:421)
	at org.apache.hadoop.fs.ChecksumFileSystem$ChecksumFSInputChecker.<init>(ChecksumFileSystem.java:140)
	at org.apache.hadoop.fs.ChecksumFileSystem.open(ChecksumFileSystem.java:341)
	at org.apache.hadoop.fs.FileSystem.open(FileSystem.java:767)
	at org.apache.hadoop.mapreduce.jobhistory.JobHistoryParser.<init>(JobHistoryParser.java:86)
	at org.apache.hadoop.mapreduce.v2.hs.CompletedJob.loadFullHistoryData(CompletedJob.java:348)
	at org.apache.hadoop.mapreduce.v2.hs.CompletedJob.<init>(CompletedJob.java:104)
	at org.apache.hadoop.mapreduce.v2.hs.TestJobHistoryEntities.testCompletedJob(TestJobHistoryEntities.java:94)


FAILED:  org.apache.hadoop.mapreduce.v2.hs.TestJobHistoryEntities.testCompletedTask[0]

Error Message:
Could not load history file /home/jenkins/jenkins-slave/workspace/PreCommit-YARN-Build%402/hadoop-mapreduce-project/hadoop-mapreduce-client/hadoop-mapreduce-client-hs/target/test-classes/job_1329348432655_0001-1329348443227-user-Sleep+job-1329348468601-10-1-SUCCEEDED-default.jhist

Stack Trace:
org.apache.hadoop.yarn.exceptions.YarnRuntimeException: Could not load history file /home/jenkins/jenkins-slave/workspace/PreCommit-YARN-Build%402/hadoop-mapreduce-project/hadoop-mapreduce-client/hadoop-mapreduce-client-hs/target/test-classes/job_1329348432655_0001-1329348443227-user-Sleep+job-1329348468601-10-1-SUCCEEDED-default.jhist
	at org.apache.hadoop.fs.RawLocalFileSystem.deprecatedGetFileStatus(RawLocalFileSystem.java:612)
	at org.apache.hadoop.fs.RawLocalFileSystem.getFileLinkStatusInternal(RawLocalFileSystem.java:821)
	at org.apache.hadoop.fs.RawLocalFileSystem.getFileStatus(RawLocalFileSystem.java:602)
	at org.apache.hadoop.fs.FilterFileSystem.getFileStatus(FilterFileSystem.java:421)
	at org.apache.hadoop.fs.ChecksumFileSystem$ChecksumFSInputChecker.<init>(ChecksumFileSystem.java:140)
	at org.apache.hadoop.fs.ChecksumFileSystem.open(ChecksumFileSystem.java:341)
	at org.apache.hadoop.fs.FileSystem.open(FileSystem.java:767)
	at org.apache.hadoop.mapreduce.jobhistory.JobHistoryParser.<init>(JobHistoryParser.java:86)
	at org.apache.hadoop.mapreduce.v2.hs.CompletedJob.loadFullHistoryData(CompletedJob.java:348)
	at org.apache.hadoop.mapreduce.v2.hs.CompletedJob.<init>(CompletedJob.java:104)
	at org.apache.hadoop.mapreduce.v2.hs.TestJobHistoryEntities.testCompletedTask(TestJobHistoryEntities.java:133)


FAILED:  org.apache.hadoop.mapreduce.v2.hs.TestJobHistoryEntities.testCopmletedJobReportWithZeroTasks[1]

Error Message:
Could not load history file /home/jenkins/jenkins-slave/workspace/PreCommit-YARN-Build%402/hadoop-mapreduce-project/hadoop-mapreduce-client/hadoop-mapreduce-client-hs/target/test-classes/job_1416424547277_0002-1416424775281-root-TeraGen-1416424785433-2-0-SUCCEEDED-default-1416424779349.jhist

Stack Trace:
org.apache.hadoop.yarn.exceptions.YarnRuntimeException: Could not load history file /home/jenkins/jenkins-slave/workspace/PreCommit-YARN-Build%402/hadoop-mapreduce-project/hadoop-mapreduce-client/hadoop-mapreduce-client-hs/target/test-classes/job_1416424547277_0002-1416424775281-root-TeraGen-1416424785433-2-0-SUCCEEDED-default-1416424779349.jhist
	at org.apache.hadoop.fs.RawLocalFileSystem.deprecatedGetFileStatus(RawLocalFileSystem.java:612)
	at org.apache.hadoop.fs.RawLocalFileSystem.getFileLinkStatusInternal(RawLocalFileSystem.java:821)
	at org.apache.hadoop.fs.RawLocalFileSystem.getFileStatus(RawLocalFileSystem.java:602)
	at org.apache.hadoop.fs.FilterFileSystem.getFileStatus(FilterFileSystem.java:421)
	at org.apache.hadoop.fs.ChecksumFileSystem$ChecksumFSInputChecker.<init>(ChecksumFileSystem.java:140)
	at org.apache.hadoop.fs.ChecksumFileSystem.open(ChecksumFileSystem.java:341)
	at org.apache.hadoop.fs.FileSystem.open(FileSystem.java:767)
	at org.apache.hadoop.mapreduce.jobhistory.JobHistoryParser.<init>(JobHistoryParser.java:86)
	at org.apache.hadoop.mapreduce.v2.hs.CompletedJob.loadFullHistoryData(CompletedJob.java:348)
	at org.apache.hadoop.mapreduce.v2.hs.CompletedJob.<init>(CompletedJob.java:104)
	at org.apache.hadoop.mapreduce.v2.hs.TestJobHistoryEntities.testCopmletedJobReportWithZeroTasks(TestJobHistoryEntities.java:118)


FAILED:  org.apache.hadoop.mapreduce.v2.hs.TestJobHistoryEntities.testGetTaskAttemptCompletionEvent[1]

Error Message:
Could not load history file /home/jenkins/jenkins-slave/workspace/PreCommit-YARN-Build%402/hadoop-mapreduce-project/hadoop-mapreduce-client/hadoop-mapreduce-client-hs/target/test-classes/job_1329348432655_0001-1329348443227-user-Sleep+job-1329348468601-10-1-SUCCEEDED-default.jhist

Stack Trace:
org.apache.hadoop.yarn.exceptions.YarnRuntimeException: Could not load history file /home/jenkins/jenkins-slave/workspace/PreCommit-YARN-Build%402/hadoop-mapreduce-project/hadoop-mapreduce-client/hadoop-mapreduce-client-hs/target/test-classes/job_1329348432655_0001-1329348443227-user-Sleep+job-1329348468601-10-1-SUCCEEDED-default.jhist
	at org.apache.hadoop.fs.RawLocalFileSystem.deprecatedGetFileStatus(RawLocalFileSystem.java:612)
	at org.apache.hadoop.fs.RawLocalFileSystem.getFileLinkStatusInternal(RawLocalFileSystem.java:821)
	at org.apache.hadoop.fs.RawLocalFileSystem.getFileStatus(RawLocalFileSystem.java:602)
	at org.apache.hadoop.fs.FilterFileSystem.getFileStatus(FilterFileSystem.java:421)
	at org.apache.hadoop.fs.ChecksumFileSystem$ChecksumFSInputChecker.<init>(ChecksumFileSystem.java:140)
	at org.apache.hadoop.fs.ChecksumFileSystem.open(ChecksumFileSystem.java:341)
	at org.apache.hadoop.fs.FileSystem.open(FileSystem.java:767)
	at org.apache.hadoop.mapreduce.jobhistory.JobHistoryParser.<init>(JobHistoryParser.java:86)
	at org.apache.hadoop.mapreduce.v2.hs.CompletedJob.loadFullHistoryData(CompletedJob.java:348)
	at org.apache.hadoop.mapreduce.v2.hs.CompletedJob.<init>(CompletedJob.java:104)
	at org.apache.hadoop.mapreduce.v2.hs.TestJobHistoryEntities.testGetTaskAttemptCompletionEvent(TestJobHistoryEntities.java:201)


FAILED:  org.apache.hadoop.mapreduce.v2.hs.TestJobHistoryEntities.testCompletedTaskAttempt[1]

Error Message:
Could not load history file /home/jenkins/jenkins-slave/workspace/PreCommit-YARN-Build%402/hadoop-mapreduce-project/hadoop-mapreduce-client/hadoop-mapreduce-client-hs/target/test-classes/job_1329348432655_0001-1329348443227-user-Sleep+job-1329348468601-10-1-SUCCEEDED-default.jhist

Stack Trace:
org.apache.hadoop.yarn.exceptions.YarnRuntimeException: Could not load history file /home/jenkins/jenkins-slave/workspace/PreCommit-YARN-Build%402/hadoop-mapreduce-project/hadoop-mapreduce-client/hadoop-mapreduce-client-hs/target/test-classes/job_1329348432655_0001-1329348443227-user-Sleep+job-1329348468601-10-1-SUCCEEDED-default.jhist
	at org.apache.hadoop.fs.RawLocalFileSystem.deprecatedGetFileStatus(RawLocalFileSystem.java:612)
	at org.apache.hadoop.fs.RawLocalFileSystem.getFileLinkStatusInternal(RawLocalFileSystem.java:821)
	at org.apache.hadoop.fs.RawLocalFileSystem.getFileStatus(RawLocalFileSystem.java:602)
	at org.apache.hadoop.fs.FilterFileSystem.getFileStatus(FilterFileSystem.java:421)
	at org.apache.hadoop.fs.ChecksumFileSystem$ChecksumFSInputChecker.<init>(ChecksumFileSystem.java:140)
	at org.apache.hadoop.fs.ChecksumFileSystem.open(ChecksumFileSystem.java:341)
	at org.apache.hadoop.fs.FileSystem.open(FileSystem.java:767)
	at org.apache.hadoop.mapreduce.jobhistory.JobHistoryParser.<init>(JobHistoryParser.java:86)
	at org.apache.hadoop.mapreduce.v2.hs.CompletedJob.loadFullHistoryData(CompletedJob.java:348)
	at org.apache.hadoop.mapreduce.v2.hs.CompletedJob.<init>(CompletedJob.java:104)
	at org.apache.hadoop.mapreduce.v2.hs.TestJobHistoryEntities.testCompletedTaskAttempt(TestJobHistoryEntities.java:162)


FAILED:  org.apache.hadoop.mapreduce.v2.hs.TestJobHistoryEntities.testCompletedJob[1]

Error Message:
Could not load history file /home/jenkins/jenkins-slave/workspace/PreCommit-YARN-Build%402/hadoop-mapreduce-project/hadoop-mapreduce-client/hadoop-mapreduce-client-hs/target/test-classes/job_1329348432655_0001-1329348443227-user-Sleep+job-1329348468601-10-1-SUCCEEDED-default.jhist

Stack Trace:
org.apache.hadoop.yarn.exceptions.YarnRuntimeException: Could not load history file /home/jenkins/jenkins-slave/workspace/PreCommit-YARN-Build%402/hadoop-mapreduce-project/hadoop-mapreduce-client/hadoop-mapreduce-client-hs/target/test-classes/job_1329348432655_0001-1329348443227-user-Sleep+job-1329348468601-10-1-SUCCEEDED-default.jhist
	at org.apache.hadoop.fs.RawLocalFileSystem.deprecatedGetFileStatus(RawLocalFileSystem.java:612)
	at org.apache.hadoop.fs.RawLocalFileSystem.getFileLinkStatusInternal(RawLocalFileSystem.java:821)
	at org.apache.hadoop.fs.RawLocalFileSystem.getFileStatus(RawLocalFileSystem.java:602)
	at org.apache.hadoop.fs.FilterFileSystem.getFileStatus(FilterFileSystem.java:421)
	at org.apache.hadoop.fs.ChecksumFileSystem$ChecksumFSInputChecker.<init>(ChecksumFileSystem.java:140)
	at org.apache.hadoop.fs.ChecksumFileSystem.open(ChecksumFileSystem.java:341)
	at org.apache.hadoop.fs.FileSystem.open(FileSystem.java:767)
	at org.apache.hadoop.mapreduce.jobhistory.JobHistoryParser.<init>(JobHistoryParser.java:86)
	at org.apache.hadoop.mapreduce.v2.hs.CompletedJob.loadFullHistoryData(CompletedJob.java:348)
	at org.apache.hadoop.mapreduce.v2.hs.CompletedJob.<init>(CompletedJob.java:104)
	at org.apache.hadoop.mapreduce.v2.hs.TestJobHistoryEntities.testCompletedJob(TestJobHistoryEntities.java:94)


FAILED:  org.apache.hadoop.mapreduce.v2.hs.TestJobHistoryEntities.testCompletedTask[1]

Error Message:
Could not load history file /home/jenkins/jenkins-slave/workspace/PreCommit-YARN-Build%402/hadoop-mapreduce-project/hadoop-mapreduce-client/hadoop-mapreduce-client-hs/target/test-classes/job_1329348432655_0001-1329348443227-user-Sleep+job-1329348468601-10-1-SUCCEEDED-default.jhist

Stack Trace:
org.apache.hadoop.yarn.exceptions.YarnRuntimeException: Could not load history file /home/jenkins/jenkins-slave/workspace/PreCommit-YARN-Build%402/hadoop-mapreduce-project/hadoop-mapreduce-client/hadoop-mapreduce-client-hs/target/test-classes/job_1329348432655_0001-1329348443227-user-Sleep+job-1329348468601-10-1-SUCCEEDED-default.jhist
	at org.apache.hadoop.fs.RawLocalFileSystem.deprecatedGetFileStatus(RawLocalFileSystem.java:612)
	at org.apache.hadoop.fs.RawLocalFileSystem.getFileLinkStatusInternal(RawLocalFileSystem.java:821)
	at org.apache.hadoop.fs.RawLocalFileSystem.getFileStatus(RawLocalFileSystem.java:602)
	at org.apache.hadoop.fs.FilterFileSystem.getFileStatus(FilterFileSystem.java:421)
	at org.apache.hadoop.fs.ChecksumFileSystem$ChecksumFSInputChecker.<init>(ChecksumFileSystem.java:140)
	at org.apache.hadoop.fs.ChecksumFileSystem.open(ChecksumFileSystem.java:341)
	at org.apache.hadoop.fs.FileSystem.open(FileSystem.java:767)
	at org.apache.hadoop.mapreduce.jobhistory.JobHistoryParser.<init>(JobHistoryParser.java:86)
	at org.apache.hadoop.mapreduce.v2.hs.CompletedJob.loadFullHistoryData(CompletedJob.java:348)
	at org.apache.hadoop.mapreduce.v2.hs.CompletedJob.<init>(CompletedJob.java:104)
	at org.apache.hadoop.mapreduce.v2.hs.TestJobHistoryEntities.testCompletedTask(TestJobHistoryEntities.java:133)


FAILED:  org.apache.hadoop.mapreduce.v2.hs.TestJobHistoryParsing.testTaskAttemptUnsuccessfulCompletionWithoutCounters203

Error Message:
File /home/jenkins/jenkins-slave/workspace/PreCommit-YARN-Build%402/hadoop-mapreduce-project/hadoop-mapreduce-client/hadoop-mapreduce-client-hs/target/test-classes/job_2.0.3-alpha-FAILED.jhist does not exist

Stack Trace:
java.io.FileNotFoundException: File /home/jenkins/jenkins-slave/workspace/PreCommit-YARN-Build%402/hadoop-mapreduce-project/hadoop-mapreduce-client/hadoop-mapreduce-client-hs/target/test-classes/job_2.0.3-alpha-FAILED.jhist does not exist
	at org.apache.hadoop.fs.RawLocalFileSystem.deprecatedGetFileStatus(RawLocalFileSystem.java:612)
	at org.apache.hadoop.fs.RawLocalFileSystem.getFileLinkStatusInternal(RawLocalFileSystem.java:821)
	at org.apache.hadoop.fs.RawLocalFileSystem.getFileStatus(RawLocalFileSystem.java:602)
	at org.apache.hadoop.fs.FilterFileSystem.getFileStatus(FilterFileSystem.java:421)
	at org.apache.hadoop.fs.ChecksumFileSystem$ChecksumFSInputChecker.<init>(ChecksumFileSystem.java:140)
	at org.apache.hadoop.fs.ChecksumFileSystem.open(ChecksumFileSystem.java:341)
	at org.apache.hadoop.fs.FileSystem.open(FileSystem.java:767)
	at org.apache.hadoop.mapreduce.jobhistory.JobHistoryParser.<init>(JobHistoryParser.java:86)
	at org.apache.hadoop.mapreduce.v2.hs.TestJobHistoryParsing.testTaskAttemptUnsuccessfulCompletionWithoutCounters203(TestJobHistoryParsing.java:904)


FAILED:  org.apache.hadoop.mapreduce.v2.hs.TestJobHistoryParsing.testTaskAttemptUnsuccessfulCompletionWithoutCounters240

Error Message:
File /home/jenkins/jenkins-slave/workspace/PreCommit-YARN-Build%402/hadoop-mapreduce-project/hadoop-mapreduce-client/hadoop-mapreduce-client-hs/target/test-classes/job_2.4.0-FAILED.jhist does not exist

Stack Trace:
java.io.FileNotFoundException: File /home/jenkins/jenkins-slave/workspace/PreCommit-YARN-Build%402/hadoop-mapreduce-project/hadoop-mapreduce-client/hadoop-mapreduce-client-hs/target/test-classes/job_2.4.0-FAILED.jhist does not exist
	at org.apache.hadoop.fs.RawLocalFileSystem.deprecatedGetFileStatus(RawLocalFileSystem.java:612)
	at org.apache.hadoop.fs.RawLocalFileSystem.getFileLinkStatusInternal(RawLocalFileSystem.java:821)
	at org.apache.hadoop.fs.RawLocalFileSystem.getFileStatus(RawLocalFileSystem.java:602)
	at org.apache.hadoop.fs.FilterFileSystem.getFileStatus(FilterFileSystem.java:421)
	at org.apache.hadoop.fs.ChecksumFileSystem$ChecksumFSInputChecker.<init>(ChecksumFileSystem.java:140)
	at org.apache.hadoop.fs.ChecksumFileSystem.open(ChecksumFileSystem.java:341)
	at org.apache.hadoop.fs.FileSystem.open(FileSystem.java:767)
	at org.apache.hadoop.mapreduce.jobhistory.JobHistoryParser.<init>(JobHistoryParser.java:86)
	at org.apache.hadoop.mapreduce.v2.hs.TestJobHistoryParsing.testTaskAttemptUnsuccessfulCompletionWithoutCounters240(TestJobHistoryParsing.java:922)


FAILED:  org.apache.hadoop.mapreduce.v2.hs.TestJobHistoryParsing.testScanningOldDirs

Error Message:
java.util.zip.ZipException: invalid stored block lengths

Stack Trace:
java.lang.RuntimeException: java.util.zip.ZipException: invalid stored block lengths
	at java.util.zip.InflaterInputStream.read(InflaterInputStream.java:164)
	at java.util.zip.InflaterInputStream.read(InflaterInputStream.java:122)
	at java.io.FilterInputStream.read(FilterInputStream.java:83)
	at org.apache.xerces.impl.XMLEntityManager$RewindableInputStream.read(Unknown Source)
	at org.apache.xerces.impl.XMLEntityManager.setupCurrentEntity(Unknown Source)
	at org.apache.xerces.impl.XMLVersionDetector.determineDocVersion(Unknown Source)
	at org.apache.xerces.parsers.XML11Configuration.parse(Unknown Source)
	at org.apache.xerces.parsers.XML11Configuration.parse(Unknown Source)
	at org.apache.xerces.parsers.XMLParser.parse(Unknown Source)
	at org.apache.xerces.parsers.DOMParser.parse(Unknown Source)
	at org.apache.xerces.jaxp.DocumentBuilderImpl.parse(Unknown Source)
	at javax.xml.parsers.DocumentBuilder.parse(DocumentBuilder.java:150)
	at org.apache.hadoop.conf.Configuration.parse(Configuration.java:2499)
	at org.apache.hadoop.conf.Configuration.parse(Configuration.java:2487)
	at org.apache.hadoop.conf.Configuration.loadResource(Configuration.java:2558)
	at org.apache.hadoop.conf.Configuration.loadResources(Configuration.java:2511)
	at org.apache.hadoop.conf.Configuration.getProps(Configuration.java:2424)
	at org.apache.hadoop.conf.Configuration.set(Configuration.java:1160)
	at org.apache.hadoop.conf.Configuration.set(Configuration.java:1132)
	at org.apache.hadoop.conf.Configuration.setClass(Configuration.java:2289)
	at org.apache.hadoop.mapreduce.v2.hs.TestJobHistoryParsing.testScanningOldDirs(TestJobHistoryParsing.java:588)


FAILED:  org.apache.hadoop.mapreduce.v2.hs.TestJobHistoryParsing.testFailedJobHistoryWithoutDiagnostics

Error Message:
java.util.zip.ZipException: invalid stored block lengths

Stack Trace:
java.lang.RuntimeException: java.util.zip.ZipException: invalid stored block lengths
	at java.util.zip.InflaterInputStream.read(InflaterInputStream.java:164)
	at java.util.zip.InflaterInputStream.read(InflaterInputStream.java:122)
	at java.io.FilterInputStream.read(FilterInputStream.java:83)
	at org.apache.xerces.impl.XMLEntityManager$RewindableInputStream.read(Unknown Source)
	at org.apache.xerces.impl.XMLEntityManager.setupCurrentEntity(Unknown Source)
	at org.apache.xerces.impl.XMLVersionDetector.determineDocVersion(Unknown Source)
	at org.apache.xerces.parsers.XML11Configuration.parse(Unknown Source)
	at org.apache.xerces.parsers.XML11Configuration.parse(Unknown Source)
	at org.apache.xerces.parsers.XMLParser.parse(Unknown Source)
	at org.apache.xerces.parsers.DOMParser.parse(Unknown Source)
	at org.apache.xerces.jaxp.DocumentBuilderImpl.parse(Unknown Source)
	at javax.xml.parsers.DocumentBuilder.parse(DocumentBuilder.java:150)
	at org.apache.hadoop.conf.Configuration.parse(Configuration.java:2499)
	at org.apache.hadoop.conf.Configuration.parse(Configuration.java:2487)
	at org.apache.hadoop.conf.Configuration.loadResource(Configuration.java:2558)
	at org.apache.hadoop.conf.Configuration.loadResources(Configuration.java:2511)
	at org.apache.hadoop.conf.Configuration.getProps(Configuration.java:2424)
	at org.apache.hadoop.conf.Configuration.get(Configuration.java:1249)
	at org.apache.hadoop.fs.FileSystem.getDefaultUri(FileSystem.java:178)
	at org.apache.hadoop.fs.FileSystem.get(FileSystem.java:359)
	at org.apache.hadoop.fs.FileSystem.getLocal(FileSystem.java:342)
	at org.apache.hadoop.mapreduce.v2.hs.TestJobHistoryParsing.testFailedJobHistoryWithoutDiagnostics(TestJobHistoryParsing.java:882)


FAILED:  org.apache.hadoop.mapreduce.v2.hs.TestJobHistoryParsing.testHistoryParsingForFailedAttempts

Error Message:
java.util.zip.ZipException: invalid stored block lengths

Stack Trace:
java.lang.RuntimeException: java.util.zip.ZipException: invalid stored block lengths
	at java.util.zip.InflaterInputStream.read(InflaterInputStream.java:164)
	at java.util.zip.InflaterInputStream.read(InflaterInputStream.java:122)
	at java.io.FilterInputStream.read(FilterInputStream.java:83)
	at org.apache.xerces.impl.XMLEntityManager$RewindableInputStream.read(Unknown Source)
	at org.apache.xerces.impl.XMLEntityManager.setupCurrentEntity(Unknown Source)
	at org.apache.xerces.impl.XMLVersionDetector.determineDocVersion(Unknown Source)
	at org.apache.xerces.parsers.XML11Configuration.parse(Unknown Source)
	at org.apache.xerces.parsers.XML11Configuration.parse(Unknown Source)
	at org.apache.xerces.parsers.XMLParser.parse(Unknown Source)
	at org.apache.xerces.parsers.DOMParser.parse(Unknown Source)
	at org.apache.xerces.jaxp.DocumentBuilderImpl.parse(Unknown Source)
	at javax.xml.parsers.DocumentBuilder.parse(DocumentBuilder.java:150)
	at org.apache.hadoop.conf.Configuration.parse(Configuration.java:2499)
	at org.apache.hadoop.conf.Configuration.parse(Configuration.java:2487)
	at org.apache.hadoop.conf.Configuration.loadResource(Configuration.java:2558)
	at org.apache.hadoop.conf.Configuration.loadResources(Configuration.java:2511)
	at org.apache.hadoop.conf.Configuration.getProps(Configuration.java:2424)
	at org.apache.hadoop.conf.Configuration.set(Configuration.java:1160)
	at org.apache.hadoop.conf.Configuration.set(Configuration.java:1132)
	at org.apache.hadoop.conf.Configuration.setClass(Configuration.java:2289)
	at org.apache.hadoop.mapreduce.v2.hs.TestJobHistoryParsing.testHistoryParsingForFailedAttempts(TestJobHistoryParsing.java:401)


FAILED:  org.apache.hadoop.mapreduce.v2.hs.TestJobHistoryParsing.testCountersForFailedTask

Error Message:
java.util.zip.ZipException: invalid stored block lengths

Stack Trace:
java.lang.RuntimeException: java.util.zip.ZipException: invalid stored block lengths
	at java.util.zip.InflaterInputStream.read(InflaterInputStream.java:164)
	at java.util.zip.InflaterInputStream.read(InflaterInputStream.java:122)
	at java.io.FilterInputStream.read(FilterInputStream.java:83)
	at org.apache.xerces.impl.XMLEntityManager$RewindableInputStream.read(Unknown Source)
	at org.apache.xerces.impl.XMLEntityManager.setupCurrentEntity(Unknown Source)
	at org.apache.xerces.impl.XMLVersionDetector.determineDocVersion(Unknown Source)
	at org.apache.xerces.parsers.XML11Configuration.parse(Unknown Source)
	at org.apache.xerces.parsers.XML11Configuration.parse(Unknown Source)
	at org.apache.xerces.parsers.XMLParser.parse(Unknown Source)
	at org.apache.xerces.parsers.DOMParser.parse(Unknown Source)
	at org.apache.xerces.jaxp.DocumentBuilderImpl.parse(Unknown Source)
	at javax.xml.parsers.DocumentBuilder.parse(DocumentBuilder.java:150)
	at org.apache.hadoop.conf.Configuration.parse(Configuration.java:2499)
	at org.apache.hadoop.conf.Configuration.parse(Configuration.java:2487)
	at org.apache.hadoop.conf.Configuration.loadResource(Configuration.java:2558)
	at org.apache.hadoop.conf.Configuration.loadResources(Configuration.java:2511)
	at org.apache.hadoop.conf.Configuration.getProps(Configuration.java:2424)
	at org.apache.hadoop.conf.Configuration.set(Configuration.java:1160)
	at org.apache.hadoop.conf.Configuration.set(Configuration.java:1132)
	at org.apache.hadoop.conf.Configuration.setClass(Configuration.java:2289)
	at org.apache.hadoop.mapreduce.v2.hs.TestJobHistoryParsing.testCountersForFailedTask(TestJobHistoryParsing.java:466)


FAILED:  org.apache.hadoop.mapreduce.v2.hs.TestJobHistoryParsing.testTaskAttemptUnsuccessfulCompletionWithoutCounters0239

Error Message:
java.util.zip.ZipException: invalid stored block lengths

Stack Trace:
java.lang.RuntimeException: java.util.zip.ZipException: invalid stored block lengths
	at java.util.zip.InflaterInputStream.read(InflaterInputStream.java:164)
	at java.util.zip.InflaterInputStream.read(InflaterInputStream.java:122)
	at java.io.FilterInputStream.read(FilterInputStream.java:83)
	at org.apache.xerces.impl.XMLEntityManager$RewindableInputStream.read(Unknown Source)
	at org.apache.xerces.impl.XMLEntityManager.setupCurrentEntity(Unknown Source)
	at org.apache.xerces.impl.XMLVersionDetector.determineDocVersion(Unknown Source)
	at org.apache.xerces.parsers.XML11Configuration.parse(Unknown Source)
	at org.apache.xerces.parsers.XML11Configuration.parse(Unknown Source)
	at org.apache.xerces.parsers.XMLParser.parse(Unknown Source)
	at org.apache.xerces.parsers.DOMParser.parse(Unknown Source)
	at org.apache.xerces.jaxp.DocumentBuilderImpl.parse(Unknown Source)
	at javax.xml.parsers.DocumentBuilder.parse(DocumentBuilder.java:150)
	at org.apache.hadoop.conf.Configuration.parse(Configuration.java:2499)
	at org.apache.hadoop.conf.Configuration.parse(Configuration.java:2487)
	at org.apache.hadoop.conf.Configuration.loadResource(Configuration.java:2558)
	at org.apache.hadoop.conf.Configuration.loadResources(Configuration.java:2511)
	at org.apache.hadoop.conf.Configuration.getProps(Configuration.java:2424)
	at org.apache.hadoop.conf.Configuration.get(Configuration.java:1249)
	at org.apache.hadoop.fs.FileSystem.getDefaultUri(FileSystem.java:178)
	at org.apache.hadoop.fs.FileSystem.get(FileSystem.java:359)
	at org.apache.hadoop.fs.FileSystem.getLocal(FileSystem.java:342)
	at org.apache.hadoop.mapreduce.v2.hs.TestJobHistoryParsing.testTaskAttemptUnsuccessfulCompletionWithoutCounters0239(TestJobHistoryParsing.java:940)


FAILED:  org.apache.hadoop.mapreduce.v2.hs.TestJobHistoryParsing.testHistoryParsing

Error Message:
java.util.zip.ZipException: invalid stored block lengths

Stack Trace:
java.lang.RuntimeException: java.util.zip.ZipException: invalid stored block lengths
	at java.util.zip.InflaterInputStream.read(InflaterInputStream.java:164)
	at java.util.zip.InflaterInputStream.read(InflaterInputStream.java:122)
	at java.io.FilterInputStream.read(FilterInputStream.java:83)
	at org.apache.xerces.impl.XMLEntityManager$RewindableInputStream.read(Unknown Source)
	at org.apache.xerces.impl.XMLEntityManager.setupCurrentEntity(Unknown Source)
	at org.apache.xerces.impl.XMLVersionDetector.determineDocVersion(Unknown Source)
	at org.apache.xerces.parsers.XML11Configuration.parse(Unknown Source)
	at org.apache.xerces.parsers.XML11Configuration.parse(Unknown Source)
	at org.apache.xerces.parsers.XMLParser.parse(Unknown Source)
	at org.apache.xerces.parsers.DOMParser.parse(Unknown Source)
	at org.apache.xerces.jaxp.DocumentBuilderImpl.parse(Unknown Source)
	at javax.xml.parsers.DocumentBuilder.parse(DocumentBuilder.java:150)
	at org.apache.hadoop.conf.Configuration.parse(Configuration.java:2499)
	at org.apache.hadoop.conf.Configuration.parse(Configuration.java:2487)
	at org.apache.hadoop.conf.Configuration.loadResource(Configuration.java:2558)
	at org.apache.hadoop.conf.Configuration.loadResources(Configuration.java:2511)
	at org.apache.hadoop.conf.Configuration.getProps(Configuration.java:2424)
	at org.apache.hadoop.conf.Configuration.set(Configuration.java:1160)
	at org.apache.hadoop.conf.Configuration.set(Configuration.java:1132)
	at org.apache.hadoop.mapreduce.v2.hs.TestJobHistoryParsing.checkHistoryParsing(TestJobHistoryParsing.java:158)
	at org.apache.hadoop.mapreduce.v2.hs.TestJobHistoryParsing.testHistoryParsing(TestJobHistoryParsing.java:130)


FAILED:  org.apache.hadoop.mapreduce.v2.hs.webapp.TestHSWebApp.testJobCounterView

Error Message:
org/apache/hadoop/mapreduce/v2/api/records/JobState

Stack Trace:
java.lang.NoClassDefFoundError: org/apache/hadoop/mapreduce/v2/api/records/JobState
	at java.net.URLClassLoader$1.run(URLClassLoader.java:366)
	at java.net.URLClassLoader$1.run(URLClassLoader.java:355)
	at java.security.AccessController.doPrivileged(Native Method)
	at java.net.URLClassLoader.findClass(URLClassLoader.java:354)
	at java.lang.ClassLoader.loadClass(ClassLoader.java:425)
	at sun.misc.Launcher$AppClassLoader.loadClass(Launcher.java:308)
	at java.lang.ClassLoader.loadClass(ClassLoader.java:358)
	at org.apache.hadoop.mapreduce.v2.app.MockJobs.<clinit>(MockJobs.java:76)
	at org.apache.hadoop.mapreduce.v2.app.MockAppContext.<init>(MockAppContext.java:67)
	at org.apache.hadoop.mapreduce.v2.app.MockAppContext.<init>(MockAppContext.java:60)
	at org.apache.hadoop.mapreduce.v2.hs.webapp.TestHSWebApp.testJobCounterView(TestHSWebApp.java:126)


FAILED:  org.apache.hadoop.mapreduce.v2.hs.webapp.TestHSWebApp.testJobView

Error Message:
Could not initialize class org.apache.hadoop.mapreduce.v2.app.MockJobs

Stack Trace:
java.lang.NoClassDefFoundError: Could not initialize class org.apache.hadoop.mapreduce.v2.app.MockJobs
	at org.apache.hadoop.mapreduce.v2.app.MockAppContext.<init>(MockAppContext.java:67)
	at org.apache.hadoop.mapreduce.v2.app.MockAppContext.<init>(MockAppContext.java:60)
	at org.apache.hadoop.mapreduce.v2.hs.webapp.TestHSWebApp.testJobView(TestHSWebApp.java:69)


FAILED:  org.apache.hadoop.mapreduce.v2.hs.webapp.TestHSWebApp.testAppControllerIndex

Error Message:
Could not initialize class org.apache.hadoop.mapreduce.v2.app.MockJobs

Stack Trace:
java.lang.NoClassDefFoundError: Could not initialize class org.apache.hadoop.mapreduce.v2.app.MockJobs
	at org.apache.hadoop.mapreduce.v2.app.MockAppContext.<init>(MockAppContext.java:67)
	at org.apache.hadoop.mapreduce.v2.app.MockAppContext.<init>(MockAppContext.java:60)
	at org.apache.hadoop.mapreduce.v2.hs.webapp.TestHSWebApp.testAppControllerIndex(TestHSWebApp.java:60)


FAILED:  org.apache.hadoop.mapreduce.v2.hs.webapp.TestHSWebApp.testLogsView1

Error Message:
Could not initialize class org.apache.hadoop.mapreduce.v2.app.MockJobs

Stack Trace:
java.lang.NoClassDefFoundError: Could not initialize class org.apache.hadoop.mapreduce.v2.app.MockJobs
	at org.apache.hadoop.mapreduce.v2.app.MockAppContext.<init>(MockAppContext.java:67)
	at org.apache.hadoop.mapreduce.v2.app.MockAppContext.<init>(MockAppContext.java:60)
	at org.apache.hadoop.mapreduce.v2.hs.webapp.TestHSWebApp.testLogsView1(TestHSWebApp.java:149)


FAILED:  org.apache.hadoop.mapreduce.v2.hs.webapp.TestHSWebApp.testLogsView2

Error Message:
Could not initialize class org.apache.hadoop.mapreduce.v2.app.MockJobs

Stack Trace:
java.lang.NoClassDefFoundError: Could not initialize class org.apache.hadoop.mapreduce.v2.app.MockJobs
	at org.apache.hadoop.mapreduce.v2.app.MockAppContext.<init>(MockAppContext.java:67)
	at org.apache.hadoop.mapreduce.v2.app.MockAppContext.<init>(MockAppContext.java:60)
	at org.apache.hadoop.mapreduce.v2.hs.webapp.TestHSWebApp.testLogsView2(TestHSWebApp.java:161)


FAILED:  org.apache.hadoop.mapreduce.v2.hs.webapp.TestHSWebApp.testAboutView

Error Message:
Could not initialize class org.apache.hadoop.mapreduce.v2.app.MockJobs

Stack Trace:
java.lang.NoClassDefFoundError: Could not initialize class org.apache.hadoop.mapreduce.v2.app.MockJobs
	at org.apache.hadoop.mapreduce.v2.app.MockAppContext.<init>(MockAppContext.java:67)
	at org.apache.hadoop.mapreduce.v2.app.MockAppContext.<init>(MockAppContext.java:60)
	at org.apache.hadoop.mapreduce.v2.hs.webapp.TestHSWebApp.testAboutView(TestHSWebApp.java:120)


FAILED:  org.apache.hadoop.mapreduce.v2.hs.webapp.TestHSWebApp.testJobCounterViewForKilledJob

Error Message:
Could not initialize class org.apache.hadoop.mapreduce.v2.app.MockJobs

Stack Trace:
java.lang.NoClassDefFoundError: Could not initialize class org.apache.hadoop.mapreduce.v2.app.MockJobs
	at org.apache.hadoop.mapreduce.v2.app.MockAppContext.<init>(MockAppContext.java:67)
	at org.apache.hadoop.mapreduce.v2.hs.webapp.TestHSWebApp.testJobCounterViewForKilledJob(TestHSWebApp.java:134)


FAILED:  org.apache.hadoop.mapreduce.v2.hs.webapp.TestHSWebApp.testAttemptsView

Error Message:
Could not initialize class org.apache.hadoop.mapreduce.v2.app.MockJobs

Stack Trace:
java.lang.NoClassDefFoundError: Could not initialize class org.apache.hadoop.mapreduce.v2.app.MockJobs
	at org.apache.hadoop.mapreduce.v2.app.MockAppContext.<init>(MockAppContext.java:67)
	at org.apache.hadoop.mapreduce.v2.app.MockAppContext.<init>(MockAppContext.java:60)
	at org.apache.hadoop.mapreduce.v2.hs.webapp.TestHSWebApp.testAttemptsView(TestHSWebApp.java:106)


FAILED:  org.apache.hadoop.mapreduce.v2.hs.webapp.TestHSWebApp.testAttemptsWithJobView

Error Message:
Could not initialize class org.apache.hadoop.mapreduce.v2.app.MockJobs

Stack Trace:
java.lang.NoClassDefFoundError: Could not initialize class org.apache.hadoop.mapreduce.v2.app.MockJobs
	at org.apache.hadoop.mapreduce.v2.app.MockAppContext.<init>(MockAppContext.java:67)
	at org.apache.hadoop.mapreduce.v2.app.MockAppContext.<init>(MockAppContext.java:60)
	at org.apache.hadoop.mapreduce.v2.hs.webapp.TestHSWebApp.testAttemptsWithJobView(TestHSWebApp.java:94)


FAILED:  org.apache.hadoop.mapreduce.v2.hs.webapp.TestHSWebApp.testConfView

Error Message:
Could not initialize class org.apache.hadoop.mapreduce.v2.app.MockJobs

Stack Trace:
java.lang.NoClassDefFoundError: Could not initialize class org.apache.hadoop.mapreduce.v2.app.MockJobs
	at org.apache.hadoop.mapreduce.v2.app.MockAppContext.<init>(MockAppContext.java:67)
	at org.apache.hadoop.mapreduce.v2.app.MockAppContext.<init>(MockAppContext.java:60)
	at org.apache.hadoop.mapreduce.v2.hs.webapp.TestHSWebApp.testConfView(TestHSWebApp.java:114)


FAILED:  org.apache.hadoop.mapreduce.v2.hs.webapp.TestHSWebApp.testTaskView

Error Message:
Could not initialize class org.apache.hadoop.mapreduce.v2.app.MockJobs

Stack Trace:
java.lang.NoClassDefFoundError: Could not initialize class org.apache.hadoop.mapreduce.v2.app.MockJobs
	at org.apache.hadoop.mapreduce.v2.app.MockAppContext.<init>(MockAppContext.java:67)
	at org.apache.hadoop.mapreduce.v2.app.MockAppContext.<init>(MockAppContext.java:60)
	at org.apache.hadoop.mapreduce.v2.hs.webapp.TestHSWebApp.testTaskView(TestHSWebApp.java:86)


FAILED:  org.apache.hadoop.mapreduce.v2.hs.webapp.TestHSWebApp.testLogsViewBadStartEnd

Error Message:
Could not initialize class org.apache.hadoop.mapreduce.v2.app.MockJobs

Stack Trace:
java.lang.NoClassDefFoundError: Could not initialize class org.apache.hadoop.mapreduce.v2.app.MockJobs
	at org.apache.hadoop.mapreduce.v2.app.MockAppContext.<init>(MockAppContext.java:67)
	at org.apache.hadoop.mapreduce.v2.app.MockAppContext.<init>(MockAppContext.java:60)
	at org.apache.hadoop.mapreduce.v2.hs.webapp.TestHSWebApp.testLogsViewBadStartEnd(TestHSWebApp.java:218)


FAILED:  org.apache.hadoop.mapreduce.v2.hs.webapp.TestHSWebApp.testTasksView

Error Message:
Could not initialize class org.apache.hadoop.mapreduce.v2.app.MockJobs

Stack Trace:
java.lang.NoClassDefFoundError: Could not initialize class org.apache.hadoop.mapreduce.v2.app.MockJobs
	at org.apache.hadoop.mapreduce.v2.app.MockAppContext.<init>(MockAppContext.java:67)
	at org.apache.hadoop.mapreduce.v2.app.MockAppContext.<init>(MockAppContext.java:60)
	at org.apache.hadoop.mapreduce.v2.hs.webapp.TestHSWebApp.testTasksView(TestHSWebApp.java:77)


FAILED:  org.apache.hadoop.mapreduce.v2.hs.webapp.TestHSWebApp.testSingleCounterView

Error Message:
Could not initialize class org.apache.hadoop.mapreduce.v2.app.MockJobs

Stack Trace:
java.lang.NoClassDefFoundError: Could not initialize class org.apache.hadoop.mapreduce.v2.app.MockJobs
	at org.apache.hadoop.mapreduce.v2.app.MockAppContext.<init>(MockAppContext.java:67)
	at org.apache.hadoop.mapreduce.v2.app.MockAppContext.<init>(MockAppContext.java:60)
	at org.apache.hadoop.mapreduce.v2.hs.webapp.TestHSWebApp.testSingleCounterView(TestHSWebApp.java:142)


FAILED:  org.apache.hadoop.mapreduce.v2.hs.webapp.TestHSWebApp.testLogsViewSingle

Error Message:
Could not initialize class org.apache.hadoop.mapreduce.v2.app.MockJobs

Stack Trace:
java.lang.NoClassDefFoundError: Could not initialize class org.apache.hadoop.mapreduce.v2.app.MockJobs
	at org.apache.hadoop.mapreduce.v2.app.MockAppContext.<init>(MockAppContext.java:67)
	at org.apache.hadoop.mapreduce.v2.app.MockAppContext.<init>(MockAppContext.java:60)
	at org.apache.hadoop.mapreduce.v2.hs.webapp.TestHSWebApp.testLogsViewSingle(TestHSWebApp.java:183)


FAILED:  org.apache.hadoop.mapreduce.v2.hs.webapp.TestHsWebServicesJobs.testJobCountersXML

Error Message:
org/apache/hadoop/mapreduce/v2/app/MockJobs

Stack Trace:
java.lang.NoClassDefFoundError: org/apache/hadoop/mapreduce/v2/app/MockJobs
	at java.net.URLClassLoader$1.run(URLClassLoader.java:366)
	at java.net.URLClassLoader$1.run(URLClassLoader.java:355)
	at java.security.AccessController.doPrivileged(Native Method)
	at java.net.URLClassLoader.findClass(URLClassLoader.java:354)
	at java.lang.ClassLoader.loadClass(ClassLoader.java:425)
	at sun.misc.Launcher$AppClassLoader.loadClass(Launcher.java:308)
	at java.lang.ClassLoader.loadClass(ClassLoader.java:358)
	at org.apache.hadoop.mapreduce.v2.app.MockAppContext.<init>(MockAppContext.java:38)
	at org.apache.hadoop.mapreduce.v2.hs.MockHistoryContext.<init>(MockHistoryContext.java:73)
	at org.apache.hadoop.mapreduce.v2.hs.webapp.TestHsWebServicesJobs$1.configureServlets(TestHsWebServicesJobs.java:89)
	at com.google.inject.servlet.ServletModule.configure(ServletModule.java:53)
	at com.google.inject.AbstractModule.configure(AbstractModule.java:59)
	at com.google.inject.spi.Elements$RecordingBinder.install(Elements.java:223)
	at com.google.inject.spi.Elements.getElements(Elements.java:101)
	at com.google.inject.internal.InjectorShell$Builder.build(InjectorShell.java:133)
	at com.google.inject.internal.InternalInjectorCreator.build(InternalInjectorCreator.java:103)
	at com.google.inject.Guice.createInjector(Guice.java:95)
	at com.google.inject.Guice.createInjector(Guice.java:72)
	at com.google.inject.Guice.createInjector(Guice.java:62)
	at org.apache.hadoop.mapreduce.v2.hs.webapp.TestHsWebServicesJobs.<init>(TestHsWebServicesJobs.java:85)


FAILED:  org.apache.hadoop.mapreduce.v2.hs.webapp.TestHsWebServicesJobs.testJobAttemptsXML

Error Message:
java.net.BindException: Address already in use

Stack Trace:
com.sun.jersey.test.framework.spi.container.TestContainerException: java.net.BindException: Address already in use
	at sun.nio.ch.Net.bind0(Native Method)
	at sun.nio.ch.Net.bind(Net.java:444)
	at sun.nio.ch.Net.bind(Net.java:436)
	at sun.nio.ch.ServerSocketChannelImpl.bind(ServerSocketChannelImpl.java:214)
	at sun.nio.ch.ServerSocketAdaptor.bind(ServerSocketAdaptor.java:74)
	at org.glassfish.grizzly.nio.transport.TCPNIOTransport.bind(TCPNIOTransport.java:413)
	at org.glassfish.grizzly.nio.transport.TCPNIOTransport.bind(TCPNIOTransport.java:384)
	at org.glassfish.grizzly.nio.transport.TCPNIOTransport.bind(TCPNIOTransport.java:375)
	at org.glassfish.grizzly.http.server.NetworkListener.start(NetworkListener.java:549)
	at org.glassfish.grizzly.http.server.HttpServer.start(HttpServer.java:255)
	at com.sun.jersey.api.container.grizzly2.GrizzlyServerFactory.createHttpServer(GrizzlyServerFactory.java:326)
	at com.sun.jersey.api.container.grizzly2.GrizzlyServerFactory.createHttpServer(GrizzlyServerFactory.java:343)
	at com.sun.jersey.test.framework.spi.container.grizzly2.web.GrizzlyWebTestContainerFactory$GrizzlyWebTestContainer.instantiateGrizzlyWebServer(GrizzlyWebTestContainerFactory.java:219)
	at com.sun.jersey.test.framework.spi.container.grizzly2.web.GrizzlyWebTestContainerFactory$GrizzlyWebTestContainer.<init>(GrizzlyWebTestContainerFactory.java:129)
	at com.sun.jersey.test.framework.spi.container.grizzly2.web.GrizzlyWebTestContainerFactory$GrizzlyWebTestContainer.<init>(GrizzlyWebTestContainerFactory.java:86)
	at com.sun.jersey.test.framework.spi.container.grizzly2.web.GrizzlyWebTestContainerFactory.create(GrizzlyWebTestContainerFactory.java:79)
	at com.sun.jersey.test.framework.JerseyTest.getContainer(JerseyTest.java:342)
	at com.sun.jersey.test.framework.JerseyTest.<init>(JerseyTest.java:217)
	at org.apache.hadoop.mapreduce.v2.hs.webapp.TestHsWebServicesJobs.<init>(TestHsWebServicesJobs.java:121)


FAILED:  org.apache.hadoop.mapreduce.v2.hs.webapp.TestHsWebServicesJobs.testJobsXML

Error Message:
java.net.BindException: Address already in use

Stack Trace:
com.sun.jersey.test.framework.spi.container.TestContainerException: java.net.BindException: Address already in use
	at sun.nio.ch.Net.bind0(Native Method)
	at sun.nio.ch.Net.bind(Net.java:444)
	at sun.nio.ch.Net.bind(Net.java:436)
	at sun.nio.ch.ServerSocketChannelImpl.bind(ServerSocketChannelImpl.java:214)
	at sun.nio.ch.ServerSocketAdaptor.bind(ServerSocketAdaptor.java:74)
	at org.glassfish.grizzly.nio.transport.TCPNIOTransport.bind(TCPNIOTransport.java:413)
	at org.glassfish.grizzly.nio.transport.TCPNIOTransport.bind(TCPNIOTransport.java:384)
	at org.glassfish.grizzly.nio.transport.TCPNIOTransport.bind(TCPNIOTransport.java:375)
	at org.glassfish.grizzly.http.server.NetworkListener.start(NetworkListener.java:549)
	at org.glassfish.grizzly.http.server.HttpServer.start(HttpServer.java:255)
	at com.sun.jersey.api.container.grizzly2.GrizzlyServerFactory.createHttpServer(GrizzlyServerFactory.java:326)
	at com.sun.jersey.api.container.grizzly2.GrizzlyServerFactory.createHttpServer(GrizzlyServerFactory.java:343)
	at com.sun.jersey.test.framework.spi.container.grizzly2.web.GrizzlyWebTestContainerFactory$GrizzlyWebTestContainer.instantiateGrizzlyWebServer(GrizzlyWebTestContainerFactory.java:219)
	at com.sun.jersey.test.framework.spi.container.grizzly2.web.GrizzlyWebTestContainerFactory$GrizzlyWebTestContainer.<init>(GrizzlyWebTestContainerFactory.java:129)
	at com.sun.jersey.test.framework.spi.container.grizzly2.web.GrizzlyWebTestContainerFactory$GrizzlyWebTestContainer.<init>(GrizzlyWebTestContainerFactory.java:86)
	at com.sun.jersey.test.framework.spi.container.grizzly2.web.GrizzlyWebTestContainerFactory.create(GrizzlyWebTestContainerFactory.java:79)
	at com.sun.jersey.test.framework.JerseyTest.getContainer(JerseyTest.java:342)
	at com.sun.jersey.test.framework.JerseyTest.<init>(JerseyTest.java:217)
	at org.apache.hadoop.mapreduce.v2.hs.webapp.TestHsWebServicesJobs.<init>(TestHsWebServicesJobs.java:121)


FAILED:  org.apache.hadoop.mapreduce.v2.hs.webapp.TestHsWebServicesJobs.testJobsDefault

Error Message:
java.net.BindException: Address already in use

Stack Trace:
com.sun.jersey.test.framework.spi.container.TestContainerException: java.net.BindException: Address already in use
	at sun.nio.ch.Net.bind0(Native Method)
	at sun.nio.ch.Net.bind(Net.java:444)
	at sun.nio.ch.Net.bind(Net.java:436)
	at sun.nio.ch.ServerSocketChannelImpl.bind(ServerSocketChannelImpl.java:214)
	at sun.nio.ch.ServerSocketAdaptor.bind(ServerSocketAdaptor.java:74)
	at org.glassfish.grizzly.nio.transport.TCPNIOTransport.bind(TCPNIOTransport.java:413)
	at org.glassfish.grizzly.nio.transport.TCPNIOTransport.bind(TCPNIOTransport.java:384)
	at org.glassfish.grizzly.nio.transport.TCPNIOTransport.bind(TCPNIOTransport.java:375)
	at org.glassfish.grizzly.http.server.NetworkListener.start(NetworkListener.java:549)
	at org.glassfish.grizzly.http.server.HttpServer.start(HttpServer.java:255)
	at com.sun.jersey.api.container.grizzly2.GrizzlyServerFactory.createHttpServer(GrizzlyServerFactory.java:326)
	at com.sun.jersey.api.container.grizzly2.GrizzlyServerFactory.createHttpServer(GrizzlyServerFactory.java:343)
	at com.sun.jersey.test.framework.spi.container.grizzly2.web.GrizzlyWebTestContainerFactory$GrizzlyWebTestContainer.instantiateGrizzlyWebServer(GrizzlyWebTestContainerFactory.java:219)
	at com.sun.jersey.test.framework.spi.container.grizzly2.web.GrizzlyWebTestContainerFactory$GrizzlyWebTestContainer.<init>(GrizzlyWebTestContainerFactory.java:129)
	at com.sun.jersey.test.framework.spi.container.grizzly2.web.GrizzlyWebTestContainerFactory$GrizzlyWebTestContainer.<init>(GrizzlyWebTestContainerFactory.java:86)
	at com.sun.jersey.test.framework.spi.container.grizzly2.web.GrizzlyWebTestContainerFactory.create(GrizzlyWebTestContainerFactory.java:79)
	at com.sun.jersey.test.framework.JerseyTest.getContainer(JerseyTest.java:342)
	at com.sun.jersey.test.framework.JerseyTest.<init>(JerseyTest.java:217)
	at org.apache.hadoop.mapreduce.v2.hs.webapp.TestHsWebServicesJobs.<init>(TestHsWebServicesJobs.java:121)


FAILED:  org.apache.hadoop.mapreduce.v2.hs.webapp.TestHsWebServicesJobs.testJobsSlash

Error Message:
java.net.BindException: Address already in use

Stack Trace:
com.sun.jersey.test.framework.spi.container.TestContainerException: java.net.BindException: Address already in use
	at sun.nio.ch.Net.bind0(Native Method)
	at sun.nio.ch.Net.bind(Net.java:444)
	at sun.nio.ch.Net.bind(Net.java:436)
	at sun.nio.ch.ServerSocketChannelImpl.bind(ServerSocketChannelImpl.java:214)
	at sun.nio.ch.ServerSocketAdaptor.bind(ServerSocketAdaptor.java:74)
	at org.glassfish.grizzly.nio.transport.TCPNIOTransport.bind(TCPNIOTransport.java:413)
	at org.glassfish.grizzly.nio.transport.TCPNIOTransport.bind(TCPNIOTransport.java:384)
	at org.glassfish.grizzly.nio.transport.TCPNIOTransport.bind(TCPNIOTransport.java:375)
	at org.glassfish.grizzly.http.server.NetworkListener.start(NetworkListener.java:549)
	at org.glassfish.grizzly.http.server.HttpServer.start(HttpServer.java:255)
	at com.sun.jersey.api.container.grizzly2.GrizzlyServerFactory.createHttpServer(GrizzlyServerFactory.java:326)
	at com.sun.jersey.api.container.grizzly2.GrizzlyServerFactory.createHttpServer(GrizzlyServerFactory.java:343)
	at com.sun.jersey.test.framework.spi.container.grizzly2.web.GrizzlyWebTestContainerFactory$GrizzlyWebTestContainer.instantiateGrizzlyWebServer(GrizzlyWebTestContainerFactory.java:219)
	at com.sun.jersey.test.framework.spi.container.grizzly2.web.GrizzlyWebTestContainerFactory$GrizzlyWebTestContainer.<init>(GrizzlyWebTestContainerFactory.java:129)
	at com.sun.jersey.test.framework.spi.container.grizzly2.web.GrizzlyWebTestContainerFactory$GrizzlyWebTestContainer.<init>(GrizzlyWebTestContainerFactory.java:86)
	at com.sun.jersey.test.framework.spi.container.grizzly2.web.GrizzlyWebTestContainerFactory.create(GrizzlyWebTestContainerFactory.java:79)
	at com.sun.jersey.test.framework.JerseyTest.getContainer(JerseyTest.java:342)
	at com.sun.jersey.test.framework.JerseyTest.<init>(JerseyTest.java:217)
	at org.apache.hadoop.mapreduce.v2.hs.webapp.TestHsWebServicesJobs.<init>(TestHsWebServicesJobs.java:121)


FAILED:  org.apache.hadoop.mapreduce.v2.hs.webapp.TestHsWebServicesJobs.testJobId

Error Message:
java.net.BindException: Address already in use

Stack Trace:
com.sun.jersey.test.framework.spi.container.TestContainerException: java.net.BindException: Address already in use
	at sun.nio.ch.Net.bind0(Native Method)
	at sun.nio.ch.Net.bind(Net.java:444)
	at sun.nio.ch.Net.bind(Net.java:436)
	at sun.nio.ch.ServerSocketChannelImpl.bind(ServerSocketChannelImpl.java:214)
	at sun.nio.ch.ServerSocketAdaptor.bind(ServerSocketAdaptor.java:74)
	at org.glassfish.grizzly.nio.transport.TCPNIOTransport.bind(TCPNIOTransport.java:413)
	at org.glassfish.grizzly.nio.transport.TCPNIOTransport.bind(TCPNIOTransport.java:384)
	at org.glassfish.grizzly.nio.transport.TCPNIOTransport.bind(TCPNIOTransport.java:375)
	at org.glassfish.grizzly.http.server.NetworkListener.start(NetworkListener.java:549)
	at org.glassfish.grizzly.http.server.HttpServer.start(HttpServer.java:255)
	at com.sun.jersey.api.container.grizzly2.GrizzlyServerFactory.createHttpServer(GrizzlyServerFactory.java:326)
	at com.sun.jersey.api.container.grizzly2.GrizzlyServerFactory.createHttpServer(GrizzlyServerFactory.java:343)
	at com.sun.jersey.test.framework.spi.container.grizzly2.web.GrizzlyWebTestContainerFactory$GrizzlyWebTestContainer.instantiateGrizzlyWebServer(GrizzlyWebTestContainerFactory.java:219)
	at com.sun.jersey.test.framework.spi.container.grizzly2.web.GrizzlyWebTestContainerFactory$GrizzlyWebTestContainer.<init>(GrizzlyWebTestContainerFactory.java:129)
	at com.sun.jersey.test.framework.spi.container.grizzly2.web.GrizzlyWebTestContainerFactory$GrizzlyWebTestContainer.<init>(GrizzlyWebTestContainerFactory.java:86)
	at com.sun.jersey.test.framework.spi.container.grizzly2.web.GrizzlyWebTestContainerFactory.create(GrizzlyWebTestContainerFactory.java:79)
	at com.sun.jersey.test.framework.JerseyTest.getContainer(JerseyTest.java:342)
	at com.sun.jersey.test.framework.JerseyTest.<init>(JerseyTest.java:217)
	at org.apache.hadoop.mapreduce.v2.hs.webapp.TestHsWebServicesJobs.<init>(TestHsWebServicesJobs.java:121)


FAILED:  org.apache.hadoop.mapreduce.v2.hs.webapp.TestHsWebServicesJobs.testJobs

Error Message:
java.net.BindException: Address already in use

Stack Trace:
com.sun.jersey.test.framework.spi.container.TestContainerException: java.net.BindException: Address already in use
	at sun.nio.ch.Net.bind0(Native Method)
	at sun.nio.ch.Net.bind(Net.java:444)
	at sun.nio.ch.Net.bind(Net.java:436)
	at sun.nio.ch.ServerSocketChannelImpl.bind(ServerSocketChannelImpl.java:214)
	at sun.nio.ch.ServerSocketAdaptor.bind(ServerSocketAdaptor.java:74)
	at org.glassfish.grizzly.nio.transport.TCPNIOTransport.bind(TCPNIOTransport.java:413)
	at org.glassfish.grizzly.nio.transport.TCPNIOTransport.bind(TCPNIOTransport.java:384)
	at org.glassfish.grizzly.nio.transport.TCPNIOTransport.bind(TCPNIOTransport.java:375)
	at org.glassfish.grizzly.http.server.NetworkListener.start(NetworkListener.java:549)
	at org.glassfish.grizzly.http.server.HttpServer.start(HttpServer.java:255)
	at com.sun.jersey.api.container.grizzly2.GrizzlyServerFactory.createHttpServer(GrizzlyServerFactory.java:326)
	at com.sun.jersey.api.container.grizzly2.GrizzlyServerFactory.createHttpServer(GrizzlyServerFactory.java:343)
	at com.sun.jersey.test.framework.spi.container.grizzly2.web.GrizzlyWebTestContainerFactory$GrizzlyWebTestContainer.instantiateGrizzlyWebServer(GrizzlyWebTestContainerFactory.java:219)
	at com.sun.jersey.test.framework.spi.container.grizzly2.web.GrizzlyWebTestContainerFactory$GrizzlyWebTestContainer.<init>(GrizzlyWebTestContainerFactory.java:129)
	at com.sun.jersey.test.framework.spi.container.grizzly2.web.GrizzlyWebTestContainerFactory$GrizzlyWebTestContainer.<init>(GrizzlyWebTestContainerFactory.java:86)
	at com.sun.jersey.test.framework.spi.container.grizzly2.web.GrizzlyWebTestContainerFactory.create(GrizzlyWebTestContainerFactory.java:79)
	at com.sun.jersey.test.framework.JerseyTest.getContainer(JerseyTest.java:342)
	at com.sun.jersey.test.framework.JerseyTest.<init>(JerseyTest.java:217)
	at org.apache.hadoop.mapreduce.v2.hs.webapp.TestHsWebServicesJobs.<init>(TestHsWebServicesJobs.java:121)


FAILED:  org.apache.hadoop.mapreduce.v2.hs.webapp.TestHsWebServicesJobs.testJobIdXML

Error Message:
java.net.BindException: Address already in use

Stack Trace:
com.sun.jersey.test.framework.spi.container.TestContainerException: java.net.BindException: Address already in use
	at sun.nio.ch.Net.bind0(Native Method)
	at sun.nio.ch.Net.bind(Net.java:444)
	at sun.nio.ch.Net.bind(Net.java:436)
	at sun.nio.ch.ServerSocketChannelImpl.bind(ServerSocketChannelImpl.java:214)
	at sun.nio.ch.ServerSocketAdaptor.bind(ServerSocketAdaptor.java:74)
	at org.glassfish.grizzly.nio.transport.TCPNIOTransport.bind(TCPNIOTransport.java:413)
	at org.glassfish.grizzly.nio.transport.TCPNIOTransport.bind(TCPNIOTransport.java:384)
	at org.glassfish.grizzly.nio.transport.TCPNIOTransport.bind(TCPNIOTransport.java:375)
	at org.glassfish.grizzly.http.server.NetworkListener.start(NetworkListener.java:549)
	at org.glassfish.grizzly.http.server.HttpServer.start(HttpServer.java:255)
	at com.sun.jersey.api.container.grizzly2.GrizzlyServerFactory.createHttpServer(GrizzlyServerFactory.java:326)
	at com.sun.jersey.api.container.grizzly2.GrizzlyServerFactory.createHttpServer(GrizzlyServerFactory.java:343)
	at com.sun.jersey.test.framework.spi.container.grizzly2.web.GrizzlyWebTestContainerFactory$GrizzlyWebTestContainer.instantiateGrizzlyWebServer(GrizzlyWebTestContainerFactory.java:219)
	at com.sun.jersey.test.framework.spi.container.grizzly2.web.GrizzlyWebTestContainerFactory$GrizzlyWebTestContainer.<init>(GrizzlyWebTestContainerFactory.java:129)
	at com.sun.jersey.test.framework.spi.container.grizzly2.web.GrizzlyWebTestContainerFactory$GrizzlyWebTestContainer.<init>(GrizzlyWebTestContainerFactory.java:86)
	at com.sun.jersey.test.framework.spi.container.grizzly2.web.GrizzlyWebTestContainerFactory.create(GrizzlyWebTestContainerFactory.java:79)
	at com.sun.jersey.test.framework.JerseyTest.getContainer(JerseyTest.java:342)
	at com.sun.jersey.test.framework.JerseyTest.<init>(JerseyTest.java:217)
	at org.apache.hadoop.mapreduce.v2.hs.webapp.TestHsWebServicesJobs.<init>(TestHsWebServicesJobs.java:121)


FAILED:  org.apache.hadoop.mapreduce.v2.hs.webapp.TestHsWebServicesJobs.testJobIdInvalidXML

Error Message:
java.net.BindException: Address already in use

Stack Trace:
com.sun.jersey.test.framework.spi.container.TestContainerException: java.net.BindException: Address already in use
	at sun.nio.ch.Net.bind0(Native Method)
	at sun.nio.ch.Net.bind(Net.java:444)
	at sun.nio.ch.Net.bind(Net.java:436)
	at sun.nio.ch.ServerSocketChannelImpl.bind(ServerSocketChannelImpl.java:214)
	at sun.nio.ch.ServerSocketAdaptor.bind(ServerSocketAdaptor.java:74)
	at org.glassfish.grizzly.nio.transport.TCPNIOTransport.bind(TCPNIOTransport.java:413)
	at org.glassfish.grizzly.nio.transport.TCPNIOTransport.bind(TCPNIOTransport.java:384)
	at org.glassfish.grizzly.nio.transport.TCPNIOTransport.bind(TCPNIOTransport.java:375)
	at org.glassfish.grizzly.http.server.NetworkListener.start(NetworkListener.java:549)
	at org.glassfish.grizzly.http.server.HttpServer.start(HttpServer.java:255)
	at com.sun.jersey.api.container.grizzly2.GrizzlyServerFactory.createHttpServer(GrizzlyServerFactory.java:326)
	at com.sun.jersey.api.container.grizzly2.GrizzlyServerFactory.createHttpServer(GrizzlyServerFactory.java:343)
	at com.sun.jersey.test.framework.spi.container.grizzly2.web.GrizzlyWebTestContainerFactory$GrizzlyWebTestContainer.instantiateGrizzlyWebServer(GrizzlyWebTestContainerFactory.java:219)
	at com.sun.jersey.test.framework.spi.container.grizzly2.web.GrizzlyWebTestContainerFactory$GrizzlyWebTestContainer.<init>(GrizzlyWebTestContainerFactory.java:129)
	at com.sun.jersey.test.framework.spi.container.grizzly2.web.GrizzlyWebTestContainerFactory$GrizzlyWebTestContainer.<init>(GrizzlyWebTestContainerFactory.java:86)
	at com.sun.jersey.test.framework.spi.container.grizzly2.web.GrizzlyWebTestContainerFactory.create(GrizzlyWebTestContainerFactory.java:79)
	at com.sun.jersey.test.framework.JerseyTest.getContainer(JerseyTest.java:342)
	at com.sun.jersey.test.framework.JerseyTest.<init>(JerseyTest.java:217)
	at org.apache.hadoop.mapreduce.v2.hs.webapp.TestHsWebServicesJobs.<init>(TestHsWebServicesJobs.java:121)


FAILED:  org.apache.hadoop.mapreduce.v2.hs.webapp.TestHsWebServicesJobs.testJobIdInvalidBogus

Error Message:
java.net.BindException: Address already in use

Stack Trace:
com.sun.jersey.test.framework.spi.container.TestContainerException: java.net.BindException: Address already in use
	at sun.nio.ch.Net.bind0(Native Method)
	at sun.nio.ch.Net.bind(Net.java:444)
	at sun.nio.ch.Net.bind(Net.java:436)
	at sun.nio.ch.ServerSocketChannelImpl.bind(ServerSocketChannelImpl.java:214)
	at sun.nio.ch.ServerSocketAdaptor.bind(ServerSocketAdaptor.java:74)
	at org.glassfish.grizzly.nio.transport.TCPNIOTransport.bind(TCPNIOTransport.java:413)
	at org.glassfish.grizzly.nio.transport.TCPNIOTransport.bind(TCPNIOTransport.java:384)
	at org.glassfish.grizzly.nio.transport.TCPNIOTransport.bind(TCPNIOTransport.java:375)
	at org.glassfish.grizzly.http.server.NetworkListener.start(NetworkListener.java:549)
	at org.glassfish.grizzly.http.server.HttpServer.start(HttpServer.java:255)
	at com.sun.jersey.api.container.grizzly2.GrizzlyServerFactory.createHttpServer(GrizzlyServerFactory.java:326)
	at com.sun.jersey.api.container.grizzly2.GrizzlyServerFactory.createHttpServer(GrizzlyServerFactory.java:343)
	at com.sun.jersey.test.framework.spi.container.grizzly2.web.GrizzlyWebTestContainerFactory$GrizzlyWebTestContainer.instantiateGrizzlyWebServer(GrizzlyWebTestContainerFactory.java:219)
	at com.sun.jersey.test.framework.spi.container.grizzly2.web.GrizzlyWebTestContainerFactory$GrizzlyWebTestContainer.<init>(GrizzlyWebTestContainerFactory.java:129)
	at com.sun.jersey.test.framework.spi.container.grizzly2.web.GrizzlyWebTestContainerFactory$GrizzlyWebTestContainer.<init>(GrizzlyWebTestContainerFactory.java:86)
	at com.sun.jersey.test.framework.spi.container.grizzly2.web.GrizzlyWebTestContainerFactory.create(GrizzlyWebTestContainerFactory.java:79)
	at com.sun.jersey.test.framework.JerseyTest.getContainer(JerseyTest.java:342)
	at com.sun.jersey.test.framework.JerseyTest.<init>(JerseyTest.java:217)
	at org.apache.hadoop.mapreduce.v2.hs.webapp.TestHsWebServicesJobs.<init>(TestHsWebServicesJobs.java:121)


FAILED:  org.apache.hadoop.mapreduce.v2.hs.webapp.TestHsWebServicesJobs.testJobAttemptsSlash

Error Message:
java.net.BindException: Address already in use

Stack Trace:
com.sun.jersey.test.framework.spi.container.TestContainerException: java.net.BindException: Address already in use
	at sun.nio.ch.Net.bind0(Native Method)
	at sun.nio.ch.Net.bind(Net.java:444)
	at sun.nio.ch.Net.bind(Net.java:436)
	at sun.nio.ch.ServerSocketChannelImpl.bind(ServerSocketChannelImpl.java:214)
	at sun.nio.ch.ServerSocketAdaptor.bind(ServerSocketAdaptor.java:74)
	at org.glassfish.grizzly.nio.transport.TCPNIOTransport.bind(TCPNIOTransport.java:413)
	at org.glassfish.grizzly.nio.transport.TCPNIOTransport.bind(TCPNIOTransport.java:384)
	at org.glassfish.grizzly.nio.transport.TCPNIOTransport.bind(TCPNIOTransport.java:375)
	at org.glassfish.grizzly.http.server.NetworkListener.start(NetworkListener.java:549)
	at org.glassfish.grizzly.http.server.HttpServer.start(HttpServer.java:255)
	at com.sun.jersey.api.container.grizzly2.GrizzlyServerFactory.createHttpServer(GrizzlyServerFactory.java:326)
	at com.sun.jersey.api.container.grizzly2.GrizzlyServerFactory.createHttpServer(GrizzlyServerFactory.java:343)
	at com.sun.jersey.test.framework.spi.container.grizzly2.web.GrizzlyWebTestContainerFactory$GrizzlyWebTestContainer.instantiateGrizzlyWebServer(GrizzlyWebTestContainerFactory.java:219)
	at com.sun.jersey.test.framework.spi.container.grizzly2.web.GrizzlyWebTestContainerFactory$GrizzlyWebTestContainer.<init>(GrizzlyWebTestContainerFactory.java:129)
	at com.sun.jersey.test.framework.spi.container.grizzly2.web.GrizzlyWebTestContainerFactory$GrizzlyWebTestContainer.<init>(GrizzlyWebTestContainerFactory.java:86)
	at com.sun.jersey.test.framework.spi.container.grizzly2.web.GrizzlyWebTestContainerFactory.create(GrizzlyWebTestContainerFactory.java:79)
	at com.sun.jersey.test.framework.JerseyTest.getContainer(JerseyTest.java:342)
	at com.sun.jersey.test.framework.JerseyTest.<init>(JerseyTest.java:217)
	at org.apache.hadoop.mapreduce.v2.hs.webapp.TestHsWebServicesJobs.<init>(TestHsWebServicesJobs.java:121)


FAILED:  org.apache.hadoop.mapreduce.v2.hs.webapp.TestHsWebServicesJobs.testJobIdSlash

Error Message:
java.net.BindException: Address already in use

Stack Trace:
com.sun.jersey.test.framework.spi.container.TestContainerException: java.net.BindException: Address already in use
	at sun.nio.ch.Net.bind0(Native Method)
	at sun.nio.ch.Net.bind(Net.java:444)
	at sun.nio.ch.Net.bind(Net.java:436)
	at sun.nio.ch.ServerSocketChannelImpl.bind(ServerSocketChannelImpl.java:214)
	at sun.nio.ch.ServerSocketAdaptor.bind(ServerSocketAdaptor.java:74)
	at org.glassfish.grizzly.nio.transport.TCPNIOTransport.bind(TCPNIOTransport.java:413)
	at org.glassfish.grizzly.nio.transport.TCPNIOTransport.bind(TCPNIOTransport.java:384)
	at org.glassfish.grizzly.nio.transport.TCPNIOTransport.bind(TCPNIOTransport.java:375)
	at org.glassfish.grizzly.http.server.NetworkListener.start(NetworkListener.java:549)
	at org.glassfish.grizzly.http.server.HttpServer.start(HttpServer.java:255)
	at com.sun.jersey.api.container.grizzly2.GrizzlyServerFactory.createHttpServer(GrizzlyServerFactory.java:326)
	at com.sun.jersey.api.container.grizzly2.GrizzlyServerFactory.createHttpServer(GrizzlyServerFactory.java:343)
	at com.sun.jersey.test.framework.spi.container.grizzly2.web.GrizzlyWebTestContainerFactory$GrizzlyWebTestContainer.instantiateGrizzlyWebServer(GrizzlyWebTestContainerFactory.java:219)
	at com.sun.jersey.test.framework.spi.container.grizzly2.web.GrizzlyWebTestContainerFactory$GrizzlyWebTestContainer.<init>(GrizzlyWebTestContainerFactory.java:129)
	at com.sun.jersey.test.framework.spi.container.grizzly2.web.GrizzlyWebTestContainerFactory$GrizzlyWebTestContainer.<init>(GrizzlyWebTestContainerFactory.java:86)
	at com.sun.jersey.test.framework.spi.container.grizzly2.web.GrizzlyWebTestContainerFactory.create(GrizzlyWebTestContainerFactory.java:79)
	at com.sun.jersey.test.framework.JerseyTest.getContainer(JerseyTest.java:342)
	at com.sun.jersey.test.framework.JerseyTest.<init>(JerseyTest.java:217)
	at org.apache.hadoop.mapreduce.v2.hs.webapp.TestHsWebServicesJobs.<init>(TestHsWebServicesJobs.java:121)


FAILED:  org.apache.hadoop.mapreduce.v2.hs.webapp.TestHsWebServicesJobs.testJobCountersSlash

Error Message:
java.net.BindException: Address already in use

Stack Trace:
com.sun.jersey.test.framework.spi.container.TestContainerException: java.net.BindException: Address already in use
	at sun.nio.ch.Net.bind0(Native Method)
	at sun.nio.ch.Net.bind(Net.java:444)
	at sun.nio.ch.Net.bind(Net.java:436)
	at sun.nio.ch.ServerSocketChannelImpl.bind(ServerSocketChannelImpl.java:214)
	at sun.nio.ch.ServerSocketAdaptor.bind(ServerSocketAdaptor.java:74)
	at org.glassfish.grizzly.nio.transport.TCPNIOTransport.bind(TCPNIOTransport.java:413)
	at org.glassfish.grizzly.nio.transport.TCPNIOTransport.bind(TCPNIOTransport.java:384)
	at org.glassfish.grizzly.nio.transport.TCPNIOTransport.bind(TCPNIOTransport.java:375)
	at org.glassfish.grizzly.http.server.NetworkListener.start(NetworkListener.java:549)
	at org.glassfish.grizzly.http.server.HttpServer.start(HttpServer.java:255)
	at com.sun.jersey.api.container.grizzly2.GrizzlyServerFactory.createHttpServer(GrizzlyServerFactory.java:326)
	at com.sun.jersey.api.container.grizzly2.GrizzlyServerFactory.createHttpServer(GrizzlyServerFactory.java:343)
	at com.sun.jersey.test.framework.spi.container.grizzly2.web.GrizzlyWebTestContainerFactory$GrizzlyWebTestContainer.instantiateGrizzlyWebServer(GrizzlyWebTestContainerFactory.java:219)
	at com.sun.jersey.test.framework.spi.container.grizzly2.web.GrizzlyWebTestContainerFactory$GrizzlyWebTestContainer.<init>(GrizzlyWebTestContainerFactory.java:129)
	at com.sun.jersey.test.framework.spi.container.grizzly2.web.GrizzlyWebTestContainerFactory$GrizzlyWebTestContainer.<init>(GrizzlyWebTestContainerFactory.java:86)
	at com.sun.jersey.test.framework.spi.container.grizzly2.web.GrizzlyWebTestContainerFactory.create(GrizzlyWebTestContainerFactory.java:79)
	at com.sun.jersey.test.framework.JerseyTest.getContainer(JerseyTest.java:342)
	at com.sun.jersey.test.framework.JerseyTest.<init>(JerseyTest.java:217)
	at org.apache.hadoop.mapreduce.v2.hs.webapp.TestHsWebServicesJobs.<init>(TestHsWebServicesJobs.java:121)


FAILED:  org.apache.hadoop.mapreduce.v2.hs.webapp.TestHsWebServicesJobs.testJobCountersForKilledJob

Error Message:
java.net.BindException: Address already in use

Stack Trace:
com.sun.jersey.test.framework.spi.container.TestContainerException: java.net.BindException: Address already in use
	at sun.nio.ch.Net.bind0(Native Method)
	at sun.nio.ch.Net.bind(Net.java:444)
	at sun.nio.ch.Net.bind(Net.java:436)
	at sun.nio.ch.ServerSocketChannelImpl.bind(ServerSocketChannelImpl.java:214)
	at sun.nio.ch.ServerSocketAdaptor.bind(ServerSocketAdaptor.java:74)
	at org.glassfish.grizzly.nio.transport.TCPNIOTransport.bind(TCPNIOTransport.java:413)
	at org.glassfish.grizzly.nio.transport.TCPNIOTransport.bind(TCPNIOTransport.java:384)
	at org.glassfish.grizzly.nio.transport.TCPNIOTransport.bind(TCPNIOTransport.java:375)
	at org.glassfish.grizzly.http.server.NetworkListener.start(NetworkListener.java:549)
	at org.glassfish.grizzly.http.server.HttpServer.start(HttpServer.java:255)
	at com.sun.jersey.api.container.grizzly2.GrizzlyServerFactory.createHttpServer(GrizzlyServerFactory.java:326)
	at com.sun.jersey.api.container.grizzly2.GrizzlyServerFactory.createHttpServer(GrizzlyServerFactory.java:343)
	at com.sun.jersey.test.framework.spi.container.grizzly2.web.GrizzlyWebTestContainerFactory$GrizzlyWebTestContainer.instantiateGrizzlyWebServer(GrizzlyWebTestContainerFactory.java:219)
	at com.sun.jersey.test.framework.spi.container.grizzly2.web.GrizzlyWebTestContainerFactory$GrizzlyWebTestContainer.<init>(GrizzlyWebTestContainerFactory.java:129)
	at com.sun.jersey.test.framework.spi.container.grizzly2.web.GrizzlyWebTestContainerFactory$GrizzlyWebTestContainer.<init>(GrizzlyWebTestContainerFactory.java:86)
	at com.sun.jersey.test.framework.spi.container.grizzly2.web.GrizzlyWebTestContainerFactory.create(GrizzlyWebTestContainerFactory.java:79)
	at com.sun.jersey.test.framework.JerseyTest.getContainer(JerseyTest.java:342)
	at com.sun.jersey.test.framework.JerseyTest.<init>(JerseyTest.java:217)
	at org.apache.hadoop.mapreduce.v2.hs.webapp.TestHsWebServicesJobs.<init>(TestHsWebServicesJobs.java:121)


FAILED:  org.apache.hadoop.mapreduce.v2.hs.webapp.TestHsWebServicesJobs.testJobIdDefault

Error Message:
java.net.BindException: Address already in use

Stack Trace:
com.sun.jersey.test.framework.spi.container.TestContainerException: java.net.BindException: Address already in use
	at sun.nio.ch.Net.bind0(Native Method)
	at sun.nio.ch.Net.bind(Net.java:444)
	at sun.nio.ch.Net.bind(Net.java:436)
	at sun.nio.ch.ServerSocketChannelImpl.bind(ServerSocketChannelImpl.java:214)
	at sun.nio.ch.ServerSocketAdaptor.bind(ServerSocketAdaptor.java:74)
	at org.glassfish.grizzly.nio.transport.TCPNIOTransport.bind(TCPNIOTransport.java:413)
	at org.glassfish.grizzly.nio.transport.TCPNIOTransport.bind(TCPNIOTransport.java:384)
	at org.glassfish.grizzly.nio.transport.TCPNIOTransport.bind(TCPNIOTransport.java:375)
	at org.glassfish.grizzly.http.server.NetworkListener.start(NetworkListener.java:549)
	at org.glassfish.grizzly.http.server.HttpServer.start(HttpServer.java:255)
	at com.sun.jersey.api.container.grizzly2.GrizzlyServerFactory.createHttpServer(GrizzlyServerFactory.java:326)
	at com.sun.jersey.api.container.grizzly2.GrizzlyServerFactory.createHttpServer(GrizzlyServerFactory.java:343)
	at com.sun.jersey.test.framework.spi.container.grizzly2.web.GrizzlyWebTestContainerFactory$GrizzlyWebTestContainer.instantiateGrizzlyWebServer(GrizzlyWebTestContainerFactory.java:219)
	at com.sun.jersey.test.framework.spi.container.grizzly2.web.GrizzlyWebTestContainerFactory$GrizzlyWebTestContainer.<init>(GrizzlyWebTestContainerFactory.java:129)
	at com.sun.jersey.test.framework.spi.container.grizzly2.web.GrizzlyWebTestContainerFactory$GrizzlyWebTestContainer.<init>(GrizzlyWebTestContainerFactory.java:86)
	at com.sun.jersey.test.framework.spi.container.grizzly2.web.GrizzlyWebTestContainerFactory.create(GrizzlyWebTestContainerFactory.java:79)
	at com.sun.jersey.test.framework.JerseyTest.getContainer(JerseyTest.java:342)
	at com.sun.jersey.test.framework.JerseyTest.<init>(JerseyTest.java:217)
	at org.apache.hadoop.mapreduce.v2.hs.webapp.TestHsWebServicesJobs.<init>(TestHsWebServicesJobs.java:121)


FAILED:  org.apache.hadoop.mapreduce.v2.hs.webapp.TestHsWebServicesJobs.testJobCounters

Error Message:
java.net.BindException: Address already in use

Stack Trace:
com.sun.jersey.test.framework.spi.container.TestContainerException: java.net.BindException: Address already in use
	at sun.nio.ch.Net.bind0(Native Method)
	at sun.nio.ch.Net.bind(Net.java:444)
	at sun.nio.ch.Net.bind(Net.java:436)
	at sun.nio.ch.ServerSocketChannelImpl.bind(ServerSocketChannelImpl.java:214)
	at sun.nio.ch.ServerSocketAdaptor.bind(ServerSocketAdaptor.java:74)
	at org.glassfish.grizzly.nio.transport.TCPNIOTransport.bind(TCPNIOTransport.java:413)
	at org.glassfish.grizzly.nio.transport.TCPNIOTransport.bind(TCPNIOTransport.java:384)
	at org.glassfish.grizzly.nio.transport.TCPNIOTransport.bind(TCPNIOTransport.java:375)
	at org.glassfish.grizzly.http.server.NetworkListener.start(NetworkListener.java:549)
	at org.glassfish.grizzly.http.server.HttpServer.start(HttpServer.java:255)
	at com.sun.jersey.api.container.grizzly2.GrizzlyServerFactory.createHttpServer(GrizzlyServerFactory.java:326)
	at com.sun.jersey.api.container.grizzly2.GrizzlyServerFactory.createHttpServer(GrizzlyServerFactory.java:343)
	at com.sun.jersey.test.framework.spi.container.grizzly2.web.GrizzlyWebTestContainerFactory$GrizzlyWebTestContainer.instantiateGrizzlyWebServer(GrizzlyWebTestContainerFactory.java:219)
	at com.sun.jersey.test.framework.spi.container.grizzly2.web.GrizzlyWebTestContainerFactory$GrizzlyWebTestContainer.<init>(GrizzlyWebTestContainerFactory.java:129)
	at com.sun.jersey.test.framework.spi.container.grizzly2.web.GrizzlyWebTestContainerFactory$GrizzlyWebTestContainer.<init>(GrizzlyWebTestContainerFactory.java:86)
	at com.sun.jersey.test.framework.spi.container.grizzly2.web.GrizzlyWebTestContainerFactory.create(GrizzlyWebTestContainerFactory.java:79)
	at com.sun.jersey.test.framework.JerseyTest.getContainer(JerseyTest.java:342)
	at com.sun.jersey.test.framework.JerseyTest.<init>(JerseyTest.java:217)
	at org.apache.hadoop.mapreduce.v2.hs.webapp.TestHsWebServicesJobs.<init>(TestHsWebServicesJobs.java:121)


FAILED:  org.apache.hadoop.mapreduce.v2.hs.webapp.TestHsWebServicesJobs.testJobIdInvalid

Error Message:
java.net.BindException: Address already in use

Stack Trace:
com.sun.jersey.test.framework.spi.container.TestContainerException: java.net.BindException: Address already in use
	at sun.nio.ch.Net.bind0(Native Method)
	at sun.nio.ch.Net.bind(Net.java:444)
	at sun.nio.ch.Net.bind(Net.java:436)
	at sun.nio.ch.ServerSocketChannelImpl.bind(ServerSocketChannelImpl.java:214)
	at sun.nio.ch.ServerSocketAdaptor.bind(ServerSocketAdaptor.java:74)
	at org.glassfish.grizzly.nio.transport.TCPNIOTransport.bind(TCPNIOTransport.java:413)
	at org.glassfish.grizzly.nio.transport.TCPNIOTransport.bind(TCPNIOTransport.java:384)
	at org.glassfish.grizzly.nio.transport.TCPNIOTransport.bind(TCPNIOTransport.java:375)
	at org.glassfish.grizzly.http.server.NetworkListener.start(NetworkListener.java:549)
	at org.glassfish.grizzly.http.server.HttpServer.start(HttpServer.java:255)
	at com.sun.jersey.api.container.grizzly2.GrizzlyServerFactory.createHttpServer(GrizzlyServerFactory.java:326)
	at com.sun.jersey.api.container.grizzly2.GrizzlyServerFactory.createHttpServer(GrizzlyServerFactory.java:343)
	at com.sun.jersey.test.framework.spi.container.grizzly2.web.GrizzlyWebTestContainerFactory$GrizzlyWebTestContainer.instantiateGrizzlyWebServer(GrizzlyWebTestContainerFactory.java:219)
	at com.sun.jersey.test.framework.spi.container.grizzly2.web.GrizzlyWebTestContainerFactory$GrizzlyWebTestContainer.<init>(GrizzlyWebTestContainerFactory.java:129)
	at com.sun.jersey.test.framework.spi.container.grizzly2.web.GrizzlyWebTestContainerFactory$GrizzlyWebTestContainer.<init>(GrizzlyWebTestContainerFactory.java:86)
	at com.sun.jersey.test.framework.spi.container.grizzly2.web.GrizzlyWebTestContainerFactory.create(GrizzlyWebTestContainerFactory.java:79)
	at com.sun.jersey.test.framework.JerseyTest.getContainer(JerseyTest.java:342)
	at com.sun.jersey.test.framework.JerseyTest.<init>(JerseyTest.java:217)
	at org.apache.hadoop.mapreduce.v2.hs.webapp.TestHsWebServicesJobs.<init>(TestHsWebServicesJobs.java:121)


FAILED:  org.apache.hadoop.mapreduce.v2.hs.webapp.TestHsWebServicesJobs.testJobAttempts

Error Message:
java.net.BindException: Address already in use

Stack Trace:
com.sun.jersey.test.framework.spi.container.TestContainerException: java.net.BindException: Address already in use
	at sun.nio.ch.Net.bind0(Native Method)
	at sun.nio.ch.Net.bind(Net.java:444)
	at sun.nio.ch.Net.bind(Net.java:436)
	at sun.nio.ch.ServerSocketChannelImpl.bind(ServerSocketChannelImpl.java:214)
	at sun.nio.ch.ServerSocketAdaptor.bind(ServerSocketAdaptor.java:74)
	at org.glassfish.grizzly.nio.transport.TCPNIOTransport.bind(TCPNIOTransport.java:413)
	at org.glassfish.grizzly.nio.transport.TCPNIOTransport.bind(TCPNIOTransport.java:384)
	at org.glassfish.grizzly.nio.transport.TCPNIOTransport.bind(TCPNIOTransport.java:375)
	at org.glassfish.grizzly.http.server.NetworkListener.start(NetworkListener.java:549)
	at org.glassfish.grizzly.http.server.HttpServer.start(HttpServer.java:255)
	at com.sun.jersey.api.container.grizzly2.GrizzlyServerFactory.createHttpServer(GrizzlyServerFactory.java:326)
	at com.sun.jersey.api.container.grizzly2.GrizzlyServerFactory.createHttpServer(GrizzlyServerFactory.java:343)
	at com.sun.jersey.test.framework.spi.container.grizzly2.web.GrizzlyWebTestContainerFactory$GrizzlyWebTestContainer.instantiateGrizzlyWebServer(GrizzlyWebTestContainerFactory.java:219)
	at com.sun.jersey.test.framework.spi.container.grizzly2.web.GrizzlyWebTestContainerFactory$GrizzlyWebTestContainer.<init>(GrizzlyWebTestContainerFactory.java:129)
	at com.sun.jersey.test.framework.spi.container.grizzly2.web.GrizzlyWebTestContainerFactory$GrizzlyWebTestContainer.<init>(GrizzlyWebTestContainerFactory.java:86)
	at com.sun.jersey.test.framework.spi.container.grizzly2.web.GrizzlyWebTestContainerFactory.create(GrizzlyWebTestContainerFactory.java:79)
	at com.sun.jersey.test.framework.JerseyTest.getContainer(JerseyTest.java:342)
	at com.sun.jersey.test.framework.JerseyTest.<init>(JerseyTest.java:217)
	at org.apache.hadoop.mapreduce.v2.hs.webapp.TestHsWebServicesJobs.<init>(TestHsWebServicesJobs.java:121)


FAILED:  org.apache.hadoop.mapreduce.v2.hs.webapp.TestHsWebServicesJobs.testJobIdInvalidDefault

Error Message:
java.net.BindException: Address already in use

Stack Trace:
com.sun.jersey.test.framework.spi.container.TestContainerException: java.net.BindException: Address already in use
	at sun.nio.ch.Net.bind0(Native Method)
	at sun.nio.ch.Net.bind(Net.java:444)
	at sun.nio.ch.Net.bind(Net.java:436)
	at sun.nio.ch.ServerSocketChannelImpl.bind(ServerSocketChannelImpl.java:214)
	at sun.nio.ch.ServerSocketAdaptor.bind(ServerSocketAdaptor.java:74)
	at org.glassfish.grizzly.nio.transport.TCPNIOTransport.bind(TCPNIOTransport.java:413)
	at org.glassfish.grizzly.nio.transport.TCPNIOTransport.bind(TCPNIOTransport.java:384)
	at org.glassfish.grizzly.nio.transport.TCPNIOTransport.bind(TCPNIOTransport.java:375)
	at org.glassfish.grizzly.http.server.NetworkListener.start(NetworkListener.java:549)
	at org.glassfish.grizzly.http.server.HttpServer.start(HttpServer.java:255)
	at com.sun.jersey.api.container.grizzly2.GrizzlyServerFactory.createHttpServer(GrizzlyServerFactory.java:326)
	at com.sun.jersey.api.container.grizzly2.GrizzlyServerFactory.createHttpServer(GrizzlyServerFactory.java:343)
	at com.sun.jersey.test.framework.spi.container.grizzly2.web.GrizzlyWebTestContainerFactory$GrizzlyWebTestContainer.instantiateGrizzlyWebServer(GrizzlyWebTestContainerFactory.java:219)
	at com.sun.jersey.test.framework.spi.container.grizzly2.web.GrizzlyWebTestContainerFactory$GrizzlyWebTestContainer.<init>(GrizzlyWebTestContainerFactory.java:129)
	at com.sun.jersey.test.framework.spi.container.grizzly2.web.GrizzlyWebTestContainerFactory$GrizzlyWebTestContainer.<init>(GrizzlyWebTestContainerFactory.java:86)
	at com.sun.jersey.test.framework.spi.container.grizzly2.web.GrizzlyWebTestContainerFactory.create(GrizzlyWebTestContainerFactory.java:79)
	at com.sun.jersey.test.framework.JerseyTest.getContainer(JerseyTest.java:342)
	at com.sun.jersey.test.framework.JerseyTest.<init>(JerseyTest.java:217)
	at org.apache.hadoop.mapreduce.v2.hs.webapp.TestHsWebServicesJobs.<init>(TestHsWebServicesJobs.java:121)


FAILED:  org.apache.hadoop.mapreduce.v2.hs.webapp.TestHsWebServicesJobs.testJobCountersDefault

Error Message:
java.net.BindException: Address already in use

Stack Trace:
com.sun.jersey.test.framework.spi.container.TestContainerException: java.net.BindException: Address already in use
	at sun.nio.ch.Net.bind0(Native Method)
	at sun.nio.ch.Net.bind(Net.java:444)
	at sun.nio.ch.Net.bind(Net.java:436)
	at sun.nio.ch.ServerSocketChannelImpl.bind(ServerSocketChannelImpl.java:214)
	at sun.nio.ch.ServerSocketAdaptor.bind(ServerSocketAdaptor.java:74)
	at org.glassfish.grizzly.nio.transport.TCPNIOTransport.bind(TCPNIOTransport.java:413)
	at org.glassfish.grizzly.nio.transport.TCPNIOTransport.bind(TCPNIOTransport.java:384)
	at org.glassfish.grizzly.nio.transport.TCPNIOTransport.bind(TCPNIOTransport.java:375)
	at org.glassfish.grizzly.http.server.NetworkListener.start(NetworkListener.java:549)
	at org.glassfish.grizzly.http.server.HttpServer.start(HttpServer.java:255)
	at com.sun.jersey.api.container.grizzly2.GrizzlyServerFactory.createHttpServer(GrizzlyServerFactory.java:326)
	at com.sun.jersey.api.container.grizzly2.GrizzlyServerFactory.createHttpServer(GrizzlyServerFactory.java:343)
	at com.sun.jersey.test.framework.spi.container.grizzly2.web.GrizzlyWebTestContainerFactory$GrizzlyWebTestContainer.instantiateGrizzlyWebServer(GrizzlyWebTestContainerFactory.java:219)
	at com.sun.jersey.test.framework.spi.container.grizzly2.web.GrizzlyWebTestContainerFactory$GrizzlyWebTestContainer.<init>(GrizzlyWebTestContainerFactory.java:129)
	at com.sun.jersey.test.framework.spi.container.grizzly2.web.GrizzlyWebTestContainerFactory$GrizzlyWebTestContainer.<init>(GrizzlyWebTestContainerFactory.java:86)
	at com.sun.jersey.test.framework.spi.container.grizzly2.web.GrizzlyWebTestContainerFactory.create(GrizzlyWebTestContainerFactory.java:79)
	at com.sun.jersey.test.framework.JerseyTest.getContainer(JerseyTest.java:342)
	at com.sun.jersey.test.framework.JerseyTest.<init>(JerseyTest.java:217)
	at org.apache.hadoop.mapreduce.v2.hs.webapp.TestHsWebServicesJobs.<init>(TestHsWebServicesJobs.java:121)


FAILED:  org.apache.hadoop.mapreduce.v2.hs.webapp.TestHsWebServicesJobs.testJobIdNonExist

Error Message:
java.net.BindException: Address already in use

Stack Trace:
com.sun.jersey.test.framework.spi.container.TestContainerException: java.net.BindException: Address already in use
	at sun.nio.ch.Net.bind0(Native Method)
	at sun.nio.ch.Net.bind(Net.java:444)
	at sun.nio.ch.Net.bind(Net.java:436)
	at sun.nio.ch.ServerSocketChannelImpl.bind(ServerSocketChannelImpl.java:214)
	at sun.nio.ch.ServerSocketAdaptor.bind(ServerSocketAdaptor.java:74)
	at org.glassfish.grizzly.nio.transport.TCPNIOTransport.bind(TCPNIOTransport.java:413)
	at org.glassfish.grizzly.nio.transport.TCPNIOTransport.bind(TCPNIOTransport.java:384)
	at org.glassfish.grizzly.nio.transport.TCPNIOTransport.bind(TCPNIOTransport.java:375)
	at org.glassfish.grizzly.http.server.NetworkListener.start(NetworkListener.java:549)
	at org.glassfish.grizzly.http.server.HttpServer.start(HttpServer.java:255)
	at com.sun.jersey.api.container.grizzly2.GrizzlyServerFactory.createHttpServer(GrizzlyServerFactory.java:326)
	at com.sun.jersey.api.container.grizzly2.GrizzlyServerFactory.createHttpServer(GrizzlyServerFactory.java:343)
	at com.sun.jersey.test.framework.spi.container.grizzly2.web.GrizzlyWebTestContainerFactory$GrizzlyWebTestContainer.instantiateGrizzlyWebServer(GrizzlyWebTestContainerFactory.java:219)
	at com.sun.jersey.test.framework.spi.container.grizzly2.web.GrizzlyWebTestContainerFactory$GrizzlyWebTestContainer.<init>(GrizzlyWebTestContainerFactory.java:129)
	at com.sun.jersey.test.framework.spi.container.grizzly2.web.GrizzlyWebTestContainerFactory$GrizzlyWebTestContainer.<init>(GrizzlyWebTestContainerFactory.java:86)
	at com.sun.jersey.test.framework.spi.container.grizzly2.web.GrizzlyWebTestContainerFactory.create(GrizzlyWebTestContainerFactory.java:79)
	at com.sun.jersey.test.framework.JerseyTest.getContainer(JerseyTest.java:342)
	at com.sun.jersey.test.framework.JerseyTest.<init>(JerseyTest.java:217)
	at org.apache.hadoop.mapreduce.v2.hs.webapp.TestHsWebServicesJobs.<init>(TestHsWebServicesJobs.java:121)


FAILED:  org.apache.hadoop.mapreduce.v2.hs.webapp.TestHsWebServicesJobs.testJobAttemptsDefault

Error Message:
java.net.BindException: Address already in use

Stack Trace:
com.sun.jersey.test.framework.spi.container.TestContainerException: java.net.BindException: Address already in use
	at sun.nio.ch.Net.bind0(Native Method)
	at sun.nio.ch.Net.bind(Net.java:444)
	at sun.nio.ch.Net.bind(Net.java:436)
	at sun.nio.ch.ServerSocketChannelImpl.bind(ServerSocketChannelImpl.java:214)
	at sun.nio.ch.ServerSocketAdaptor.bind(ServerSocketAdaptor.java:74)
	at org.glassfish.grizzly.nio.transport.TCPNIOTransport.bind(TCPNIOTransport.java:413)
	at org.glassfish.grizzly.nio.transport.TCPNIOTransport.bind(TCPNIOTransport.java:384)
	at org.glassfish.grizzly.nio.transport.TCPNIOTransport.bind(TCPNIOTransport.java:375)
	at org.glassfish.grizzly.http.server.NetworkListener.start(NetworkListener.java:549)
	at org.glassfish.grizzly.http.server.HttpServer.start(HttpServer.java:255)
	at com.sun.jersey.api.container.grizzly2.GrizzlyServerFactory.createHttpServer(GrizzlyServerFactory.java:326)
	at com.sun.jersey.api.container.grizzly2.GrizzlyServerFactory.createHttpServer(GrizzlyServerFactory.java:343)
	at com.sun.jersey.test.framework.spi.container.grizzly2.web.GrizzlyWebTestContainerFactory$GrizzlyWebTestContainer.instantiateGrizzlyWebServer(GrizzlyWebTestContainerFactory.java:219)
	at com.sun.jersey.test.framework.spi.container.grizzly2.web.GrizzlyWebTestContainerFactory$GrizzlyWebTestContainer.<init>(GrizzlyWebTestContainerFactory.java:129)
	at com.sun.jersey.test.framework.spi.container.grizzly2.web.GrizzlyWebTestContainerFactory$GrizzlyWebTestContainer.<init>(GrizzlyWebTestContainerFactory.java:86)
	at com.sun.jersey.test.framework.spi.container.grizzly2.web.GrizzlyWebTestContainerFactory.create(GrizzlyWebTestContainerFactory.java:79)
	at com.sun.jersey.test.framework.JerseyTest.getContainer(JerseyTest.java:342)
	at com.sun.jersey.test.framework.JerseyTest.<init>(JerseyTest.java:217)
	at org.apache.hadoop.mapreduce.v2.hs.webapp.TestHsWebServicesJobs.<init>(TestHsWebServicesJobs.java:121)


FAILED:  org.apache.hadoop.mapreduce.v2.hs.webapp.TestHsWebServicesJobsQuery.testJobsQueryStateNone

Error Message:
Guice creation errors:

1) An exception was caught and reported. Message: java.util.zip.ZipException: invalid code lengths set
  at com.google.inject.internal.InjectorShell$Builder.build(InjectorShell.java:133)

1 error

Stack Trace:
com.google.inject.CreationException: Guice creation errors:

1) An exception was caught and reported. Message: java.util.zip.ZipException: invalid code lengths set
  at com.google.inject.internal.InjectorShell$Builder.build(InjectorShell.java:133)

1 error
	at java.util.zip.InflaterInputStream.read(InflaterInputStream.java:164)
	at java.util.zip.InflaterInputStream.read(InflaterInputStream.java:122)
	at java.io.FilterInputStream.read(FilterInputStream.java:83)
	at org.apache.xerces.impl.XMLEntityManager$RewindableInputStream.read(Unknown Source)
	at org.apache.xerces.impl.XMLEntityManager.setupCurrentEntity(Unknown Source)
	at org.apache.xerces.impl.XMLVersionDetector.determineDocVersion(Unknown Source)
	at org.apache.xerces.parsers.XML11Configuration.parse(Unknown Source)
	at org.apache.xerces.parsers.XML11Configuration.parse(Unknown Source)
	at org.apache.xerces.parsers.XMLParser.parse(Unknown Source)
	at org.apache.xerces.parsers.DOMParser.parse(Unknown Source)
	at org.apache.xerces.jaxp.DocumentBuilderImpl.parse(Unknown Source)
	at javax.xml.parsers.DocumentBuilder.parse(DocumentBuilder.java:150)
	at org.apache.hadoop.conf.Configuration.parse(Configuration.java:2499)
	at org.apache.hadoop.conf.Configuration.parse(Configuration.java:2487)
	at org.apache.hadoop.conf.Configuration.loadResource(Configuration.java:2558)
	at org.apache.hadoop.conf.Configuration.loadResources(Configuration.java:2511)
	at org.apache.hadoop.conf.Configuration.getProps(Configuration.java:2424)
	at org.apache.hadoop.conf.Configuration.set(Configuration.java:1160)
	at org.apache.hadoop.conf.Configuration.set(Configuration.java:1132)
	at org.apache.hadoop.mapreduce.v2.app.MockJobs.newJob(MockJobs.java:497)
	at org.apache.hadoop.mapreduce.v2.app.MockJobs.newJob(MockJobs.java:481)
	at org.apache.hadoop.mapreduce.v2.app.MockJobs.newJob(MockJobs.java:477)
	at org.apache.hadoop.mapreduce.v2.app.MockJobs.newJobs(MockJobs.java:121)
	at org.apache.hadoop.mapreduce.v2.hs.MockHistoryJobs.newHistoryJobs(MockHistoryJobs.java:54)
	at org.apache.hadoop.mapreduce.v2.hs.MockHistoryContext.<init>(MockHistoryContext.java:43)
	at org.apache.hadoop.mapreduce.v2.hs.webapp.TestHsWebServicesJobsQuery$1.configureServlets(TestHsWebServicesJobsQuery.java:77)
	at com.google.inject.servlet.ServletModule.configure(ServletModule.java:53)
	at com.google.inject.AbstractModule.configure(AbstractModule.java:59)
	at com.google.inject.spi.Elements$RecordingBinder.install(Elements.java:223)
	at com.google.inject.spi.Elements.getElements(Elements.java:101)
	at com.google.inject.internal.InjectorShell$Builder.build(InjectorShell.java:133)
	at com.google.inject.internal.InternalInjectorCreator.build(InternalInjectorCreator.java:103)
	at com.google.inject.Guice.createInjector(Guice.java:95)
	at com.google.inject.Guice.createInjector(Guice.java:72)
	at com.google.inject.Guice.createInjector(Guice.java:62)
	at org.apache.hadoop.mapreduce.v2.hs.webapp.TestHsWebServicesJobsQuery.<init>(TestHsWebServicesJobsQuery.java:73)


FAILED:  org.apache.hadoop.mapreduce.v2.hs.webapp.TestHsWebServicesJobsQuery.testJobsQueryStartTimeNegative

Error Message:
java.net.BindException: Address already in use

Stack Trace:
com.sun.jersey.test.framework.spi.container.TestContainerException: java.net.BindException: Address already in use
	at sun.nio.ch.Net.bind0(Native Method)
	at sun.nio.ch.Net.bind(Net.java:444)
	at sun.nio.ch.Net.bind(Net.java:436)
	at sun.nio.ch.ServerSocketChannelImpl.bind(ServerSocketChannelImpl.java:214)
	at sun.nio.ch.ServerSocketAdaptor.bind(ServerSocketAdaptor.java:74)
	at org.glassfish.grizzly.nio.transport.TCPNIOTransport.bind(TCPNIOTransport.java:413)
	at org.glassfish.grizzly.nio.transport.TCPNIOTransport.bind(TCPNIOTransport.java:384)
	at org.glassfish.grizzly.nio.transport.TCPNIOTransport.bind(TCPNIOTransport.java:375)
	at org.glassfish.grizzly.http.server.NetworkListener.start(NetworkListener.java:549)
	at org.glassfish.grizzly.http.server.HttpServer.start(HttpServer.java:255)
	at com.sun.jersey.api.container.grizzly2.GrizzlyServerFactory.createHttpServer(GrizzlyServerFactory.java:326)
	at com.sun.jersey.api.container.grizzly2.GrizzlyServerFactory.createHttpServer(GrizzlyServerFactory.java:343)
	at com.sun.jersey.test.framework.spi.container.grizzly2.web.GrizzlyWebTestContainerFactory$GrizzlyWebTestContainer.instantiateGrizzlyWebServer(GrizzlyWebTestContainerFactory.java:219)
	at com.sun.jersey.test.framework.spi.container.grizzly2.web.GrizzlyWebTestContainerFactory$GrizzlyWebTestContainer.<init>(GrizzlyWebTestContainerFactory.java:129)
	at com.sun.jersey.test.framework.spi.container.grizzly2.web.GrizzlyWebTestContainerFactory$GrizzlyWebTestContainer.<init>(GrizzlyWebTestContainerFactory.java:86)
	at com.sun.jersey.test.framework.spi.container.grizzly2.web.GrizzlyWebTestContainerFactory.create(GrizzlyWebTestContainerFactory.java:79)
	at com.sun.jersey.test.framework.JerseyTest.getContainer(JerseyTest.java:342)
	at com.sun.jersey.test.framework.JerseyTest.<init>(JerseyTest.java:217)
	at org.apache.hadoop.mapreduce.v2.hs.webapp.TestHsWebServicesJobsQuery.<init>(TestHsWebServicesJobsQuery.java:109)


FAILED:  org.apache.hadoop.mapreduce.v2.hs.webapp.TestHsWebServicesJobsQuery.testJobsQueryFinishTimeBeginEndInvalid

Error Message:
java.net.BindException: Address already in use

Stack Trace:
com.sun.jersey.test.framework.spi.container.TestContainerException: java.net.BindException: Address already in use
	at sun.nio.ch.Net.bind0(Native Method)
	at sun.nio.ch.Net.bind(Net.java:444)
	at sun.nio.ch.Net.bind(Net.java:436)
	at sun.nio.ch.ServerSocketChannelImpl.bind(ServerSocketChannelImpl.java:214)
	at sun.nio.ch.ServerSocketAdaptor.bind(ServerSocketAdaptor.java:74)
	at org.glassfish.grizzly.nio.transport.TCPNIOTransport.bind(TCPNIOTransport.java:413)
	at org.glassfish.grizzly.nio.transport.TCPNIOTransport.bind(TCPNIOTransport.java:384)
	at org.glassfish.grizzly.nio.transport.TCPNIOTransport.bind(TCPNIOTransport.java:375)
	at org.glassfish.grizzly.http.server.NetworkListener.start(NetworkListener.java:549)
	at org.glassfish.grizzly.http.server.HttpServer.start(HttpServer.java:255)
	at com.sun.jersey.api.container.grizzly2.GrizzlyServerFactory.createHttpServer(GrizzlyServerFactory.java:326)
	at com.sun.jersey.api.container.grizzly2.GrizzlyServerFactory.createHttpServer(GrizzlyServerFactory.java:343)
	at com.sun.jersey.test.framework.spi.container.grizzly2.web.GrizzlyWebTestContainerFactory$GrizzlyWebTestContainer.instantiateGrizzlyWebServer(GrizzlyWebTestContainerFactory.java:219)
	at com.sun.jersey.test.framework.spi.container.grizzly2.web.GrizzlyWebTestContainerFactory$GrizzlyWebTestContainer.<init>(GrizzlyWebTestContainerFactory.java:129)
	at com.sun.jersey.test.framework.spi.container.grizzly2.web.GrizzlyWebTestContainerFactory$GrizzlyWebTestContainer.<init>(GrizzlyWebTestContainerFactory.java:86)
	at com.sun.jersey.test.framework.spi.container.grizzly2.web.GrizzlyWebTestContainerFactory.create(GrizzlyWebTestContainerFactory.java:79)
	at com.sun.jersey.test.framework.JerseyTest.getContainer(JerseyTest.java:342)
	at com.sun.jersey.test.framework.JerseyTest.<init>(JerseyTest.java:217)
	at org.apache.hadoop.mapreduce.v2.hs.webapp.TestHsWebServicesJobsQuery.<init>(TestHsWebServicesJobsQuery.java:109)


FAILED:  org.apache.hadoop.mapreduce.v2.hs.webapp.TestHsWebServicesJobsQuery.testJobsQueryUserNone

Error Message:
java.net.BindException: Address already in use

Stack Trace:
com.sun.jersey.test.framework.spi.container.TestContainerException: java.net.BindException: Address already in use
	at sun.nio.ch.Net.bind0(Native Method)
	at sun.nio.ch.Net.bind(Net.java:444)
	at sun.nio.ch.Net.bind(Net.java:436)
	at sun.nio.ch.ServerSocketChannelImpl.bind(ServerSocketChannelImpl.java:214)
	at sun.nio.ch.ServerSocketAdaptor.bind(ServerSocketAdaptor.java:74)
	at org.glassfish.grizzly.nio.transport.TCPNIOTransport.bind(TCPNIOTransport.java:413)
	at org.glassfish.grizzly.nio.transport.TCPNIOTransport.bind(TCPNIOTransport.java:384)
	at org.glassfish.grizzly.nio.transport.TCPNIOTransport.bind(TCPNIOTransport.java:375)
	at org.glassfish.grizzly.http.server.NetworkListener.start(NetworkListener.java:549)
	at org.glassfish.grizzly.http.server.HttpServer.start(HttpServer.java:255)
	at com.sun.jersey.api.container.grizzly2.GrizzlyServerFactory.createHttpServer(GrizzlyServerFactory.java:326)
	at com.sun.jersey.api.container.grizzly2.GrizzlyServerFactory.createHttpServer(GrizzlyServerFactory.java:343)
	at com.sun.jersey.test.framework.spi.container.grizzly2.web.GrizzlyWebTestContainerFactory$GrizzlyWebTestContainer.instantiateGrizzlyWebServer(GrizzlyWebTestContainerFactory.java:219)
	at com.sun.jersey.test.framework.spi.container.grizzly2.web.GrizzlyWebTestContainerFactory$GrizzlyWebTestContainer.<init>(GrizzlyWebTestContainerFactory.java:129)
	at com.sun.jersey.test.framework.spi.container.grizzly2.web.GrizzlyWebTestContainerFactory$GrizzlyWebTestContainer.<init>(GrizzlyWebTestContainerFactory.java:86)
	at com.sun.jersey.test.framework.spi.container.grizzly2.web.GrizzlyWebTestContainerFactory.create(GrizzlyWebTestContainerFactory.java:79)
	at com.sun.jersey.test.framework.JerseyTest.getContainer(JerseyTest.java:342)
	at com.sun.jersey.test.framework.JerseyTest.<init>(JerseyTest.java:217)
	at org.apache.hadoop.mapreduce.v2.hs.webapp.TestHsWebServicesJobsQuery.<init>(TestHsWebServicesJobsQuery.java:109)


FAILED:  org.apache.hadoop.mapreduce.v2.hs.webapp.TestHsWebServicesJobsQuery.testJobsQueryStartTimeBeginEndInvalid

Error Message:
java.net.BindException: Address already in use

Stack Trace:
com.sun.jersey.test.framework.spi.container.TestContainerException: java.net.BindException: Address already in use
	at sun.nio.ch.Net.bind0(Native Method)
	at sun.nio.ch.Net.bind(Net.java:444)
	at sun.nio.ch.Net.bind(Net.java:436)
	at sun.nio.ch.ServerSocketChannelImpl.bind(ServerSocketChannelImpl.java:214)
	at sun.nio.ch.ServerSocketAdaptor.bind(ServerSocketAdaptor.java:74)
	at org.glassfish.grizzly.nio.transport.TCPNIOTransport.bind(TCPNIOTransport.java:413)
	at org.glassfish.grizzly.nio.transport.TCPNIOTransport.bind(TCPNIOTransport.java:384)
	at org.glassfish.grizzly.nio.transport.TCPNIOTransport.bind(TCPNIOTransport.java:375)
	at org.glassfish.grizzly.http.server.NetworkListener.start(NetworkListener.java:549)
	at org.glassfish.grizzly.http.server.HttpServer.start(HttpServer.java:255)
	at com.sun.jersey.api.container.grizzly2.GrizzlyServerFactory.createHttpServer(GrizzlyServerFactory.java:326)
	at com.sun.jersey.api.container.grizzly2.GrizzlyServerFactory.createHttpServer(GrizzlyServerFactory.java:343)
	at com.sun.jersey.test.framework.spi.container.grizzly2.web.GrizzlyWebTestContainerFactory$GrizzlyWebTestContainer.instantiateGrizzlyWebServer(GrizzlyWebTestContainerFactory.java:219)
	at com.sun.jersey.test.framework.spi.container.grizzly2.web.GrizzlyWebTestContainerFactory$GrizzlyWebTestContainer.<init>(GrizzlyWebTestContainerFactory.java:129)
	at com.sun.jersey.test.framework.spi.container.grizzly2.web.GrizzlyWebTestContainerFactory$GrizzlyWebTestContainer.<init>(GrizzlyWebTestContainerFactory.java:86)
	at com.sun.jersey.test.framework.spi.container.grizzly2.web.GrizzlyWebTestContainerFactory.create(GrizzlyWebTestContainerFactory.java:79)
	at com.sun.jersey.test.framework.JerseyTest.getContainer(JerseyTest.java:342)
	at com.sun.jersey.test.framework.JerseyTest.<init>(JerseyTest.java:217)
	at org.apache.hadoop.mapreduce.v2.hs.webapp.TestHsWebServicesJobsQuery.<init>(TestHsWebServicesJobsQuery.java:109)


FAILED:  org.apache.hadoop.mapreduce.v2.hs.webapp.TestHsWebServicesJobsQuery.testJobsQueryFinishTimeBeginNegative

Error Message:
java.net.BindException: Address already in use

Stack Trace:
com.sun.jersey.test.framework.spi.container.TestContainerException: java.net.BindException: Address already in use
	at sun.nio.ch.Net.bind0(Native Method)
	at sun.nio.ch.Net.bind(Net.java:444)
	at sun.nio.ch.Net.bind(Net.java:436)
	at sun.nio.ch.ServerSocketChannelImpl.bind(ServerSocketChannelImpl.java:214)
	at sun.nio.ch.ServerSocketAdaptor.bind(ServerSocketAdaptor.java:74)
	at org.glassfish.grizzly.nio.transport.TCPNIOTransport.bind(TCPNIOTransport.java:413)
	at org.glassfish.grizzly.nio.transport.TCPNIOTransport.bind(TCPNIOTransport.java:384)
	at org.glassfish.grizzly.nio.transport.TCPNIOTransport.bind(TCPNIOTransport.java:375)
	at org.glassfish.grizzly.http.server.NetworkListener.start(NetworkListener.java:549)
	at org.glassfish.grizzly.http.server.HttpServer.start(HttpServer.java:255)
	at com.sun.jersey.api.container.grizzly2.GrizzlyServerFactory.createHttpServer(GrizzlyServerFactory.java:326)
	at com.sun.jersey.api.container.grizzly2.GrizzlyServerFactory.createHttpServer(GrizzlyServerFactory.java:343)
	at com.sun.jersey.test.framework.spi.container.grizzly2.web.GrizzlyWebTestContainerFactory$GrizzlyWebTestContainer.instantiateGrizzlyWebServer(GrizzlyWebTestContainerFactory.java:219)
	at com.sun.jersey.test.framework.spi.container.grizzly2.web.GrizzlyWebTestContainerFactory$GrizzlyWebTestContainer.<init>(GrizzlyWebTestContainerFactory.java:129)
	at com.sun.jersey.test.framework.spi.container.grizzly2.web.GrizzlyWebTestContainerFactory$GrizzlyWebTestContainer.<init>(GrizzlyWebTestContainerFactory.java:86)
	at com.sun.jersey.test.framework.spi.container.grizzly2.web.GrizzlyWebTestContainerFactory.create(GrizzlyWebTestContainerFactory.java:79)
	at com.sun.jersey.test.framework.JerseyTest.getContainer(JerseyTest.java:342)
	at com.sun.jersey.test.framework.JerseyTest.<init>(JerseyTest.java:217)
	at org.apache.hadoop.mapreduce.v2.hs.webapp.TestHsWebServicesJobsQuery.<init>(TestHsWebServicesJobsQuery.java:109)


FAILED:  org.apache.hadoop.mapreduce.v2.hs.webapp.TestHsWebServicesJobsQuery.testJobsQueryStartTimeBeginEnd

Error Message:
java.net.BindException: Address already in use

Stack Trace:
com.sun.jersey.test.framework.spi.container.TestContainerException: java.net.BindException: Address already in use
	at sun.nio.ch.Net.bind0(Native Method)
	at sun.nio.ch.Net.bind(Net.java:444)
	at sun.nio.ch.Net.bind(Net.java:436)
	at sun.nio.ch.ServerSocketChannelImpl.bind(ServerSocketChannelImpl.java:214)
	at sun.nio.ch.ServerSocketAdaptor.bind(ServerSocketAdaptor.java:74)
	at org.glassfish.grizzly.nio.transport.TCPNIOTransport.bind(TCPNIOTransport.java:413)
	at org.glassfish.grizzly.nio.transport.TCPNIOTransport.bind(TCPNIOTransport.java:384)
	at org.glassfish.grizzly.nio.transport.TCPNIOTransport.bind(TCPNIOTransport.java:375)
	at org.glassfish.grizzly.http.server.NetworkListener.start(NetworkListener.java:549)
	at org.glassfish.grizzly.http.server.HttpServer.start(HttpServer.java:255)
	at com.sun.jersey.api.container.grizzly2.GrizzlyServerFactory.createHttpServer(GrizzlyServerFactory.java:326)
	at com.sun.jersey.api.container.grizzly2.GrizzlyServerFactory.createHttpServer(GrizzlyServerFactory.java:343)
	at com.sun.jersey.test.framework.spi.container.grizzly2.web.GrizzlyWebTestContainerFactory$GrizzlyWebTestContainer.instantiateGrizzlyWebServer(GrizzlyWebTestContainerFactory.java:219)
	at com.sun.jersey.test.framework.spi.container.grizzly2.web.GrizzlyWebTestContainerFactory$GrizzlyWebTestContainer.<init>(GrizzlyWebTestContainerFactory.java:129)
	at com.sun.jersey.test.framework.spi.container.grizzly2.web.GrizzlyWebTestContainerFactory$GrizzlyWebTestContainer.<init>(GrizzlyWebTestContainerFactory.java:86)
	at com.sun.jersey.test.framework.spi.container.grizzly2.web.GrizzlyWebTestContainerFactory.create(GrizzlyWebTestContainerFactory.java:79)
	at com.sun.jersey.test.framework.JerseyTest.getContainer(JerseyTest.java:342)
	at com.sun.jersey.test.framework.JerseyTest.<init>(JerseyTest.java:217)
	at org.apache.hadoop.mapreduce.v2.hs.webapp.TestHsWebServicesJobsQuery.<init>(TestHsWebServicesJobsQuery.java:109)


FAILED:  org.apache.hadoop.mapreduce.v2.hs.webapp.TestHsWebServicesJobsQuery.testJobsQueryLimitInvalid

Error Message:
java.net.BindException: Address already in use

Stack Trace:
com.sun.jersey.test.framework.spi.container.TestContainerException: java.net.BindException: Address already in use
	at sun.nio.ch.Net.bind0(Native Method)
	at sun.nio.ch.Net.bind(Net.java:444)
	at sun.nio.ch.Net.bind(Net.java:436)
	at sun.nio.ch.ServerSocketChannelImpl.bind(ServerSocketChannelImpl.java:214)
	at sun.nio.ch.ServerSocketAdaptor.bind(ServerSocketAdaptor.java:74)
	at org.glassfish.grizzly.nio.transport.TCPNIOTransport.bind(TCPNIOTransport.java:413)
	at org.glassfish.grizzly.nio.transport.TCPNIOTransport.bind(TCPNIOTransport.java:384)
	at org.glassfish.grizzly.nio.transport.TCPNIOTransport.bind(TCPNIOTransport.java:375)
	at org.glassfish.grizzly.http.server.NetworkListener.start(NetworkListener.java:549)
	at org.glassfish.grizzly.http.server.HttpServer.start(HttpServer.java:255)
	at com.sun.jersey.api.container.grizzly2.GrizzlyServerFactory.createHttpServer(GrizzlyServerFactory.java:326)
	at com.sun.jersey.api.container.grizzly2.GrizzlyServerFactory.createHttpServer(GrizzlyServerFactory.java:343)
	at com.sun.jersey.test.framework.spi.container.grizzly2.web.GrizzlyWebTestContainerFactory$GrizzlyWebTestContainer.instantiateGrizzlyWebServer(GrizzlyWebTestContainerFactory.java:219)
	at com.sun.jersey.test.framework.spi.container.grizzly2.web.GrizzlyWebTestContainerFactory$GrizzlyWebTestContainer.<init>(GrizzlyWebTestContainerFactory.java:129)
	at com.sun.jersey.test.framework.spi.container.grizzly2.web.GrizzlyWebTestContainerFactory$GrizzlyWebTestContainer.<init>(GrizzlyWebTestContainerFactory.java:86)
	at com.sun.jersey.test.framework.spi.container.grizzly2.web.GrizzlyWebTestContainerFactory.create(GrizzlyWebTestContainerFactory.java:79)
	at com.sun.jersey.test.framework.JerseyTest.getContainer(JerseyTest.java:342)
	at com.sun.jersey.test.framework.JerseyTest.<init>(JerseyTest.java:217)
	at org.apache.hadoop.mapreduce.v2.hs.webapp.TestHsWebServicesJobsQuery.<init>(TestHsWebServicesJobsQuery.java:109)


FAILED:  org.apache.hadoop.mapreduce.v2.hs.webapp.TestHsWebServicesJobsQuery.testJobsQueryQueueNonExist

Error Message:
java.net.BindException: Address already in use

Stack Trace:
com.sun.jersey.test.framework.spi.container.TestContainerException: java.net.BindException: Address already in use
	at sun.nio.ch.Net.bind0(Native Method)
	at sun.nio.ch.Net.bind(Net.java:444)
	at sun.nio.ch.Net.bind(Net.java:436)
	at sun.nio.ch.ServerSocketChannelImpl.bind(ServerSocketChannelImpl.java:214)
	at sun.nio.ch.ServerSocketAdaptor.bind(ServerSocketAdaptor.java:74)
	at org.glassfish.grizzly.nio.transport.TCPNIOTransport.bind(TCPNIOTransport.java:413)
	at org.glassfish.grizzly.nio.transport.TCPNIOTransport.bind(TCPNIOTransport.java:384)
	at org.glassfish.grizzly.nio.transport.TCPNIOTransport.bind(TCPNIOTransport.java:375)
	at org.glassfish.grizzly.http.server.NetworkListener.start(NetworkListener.java:549)
	at org.glassfish.grizzly.http.server.HttpServer.start(HttpServer.java:255)
	at com.sun.jersey.api.container.grizzly2.GrizzlyServerFactory.createHttpServer(GrizzlyServerFactory.java:326)
	at com.sun.jersey.api.container.grizzly2.GrizzlyServerFactory.createHttpServer(GrizzlyServerFactory.java:343)
	at com.sun.jersey.test.framework.spi.container.grizzly2.web.GrizzlyWebTestContainerFactory$GrizzlyWebTestContainer.instantiateGrizzlyWebServer(GrizzlyWebTestContainerFactory.java:219)
	at com.sun.jersey.test.framework.spi.container.grizzly2.web.GrizzlyWebTestContainerFactory$GrizzlyWebTestContainer.<init>(GrizzlyWebTestContainerFactory.java:129)
	at com.sun.jersey.test.framework.spi.container.grizzly2.web.GrizzlyWebTestContainerFactory$GrizzlyWebTestContainer.<init>(GrizzlyWebTestContainerFactory.java:86)
	at com.sun.jersey.test.framework.spi.container.grizzly2.web.GrizzlyWebTestContainerFactory.create(GrizzlyWebTestContainerFactory.java:79)
	at com.sun.jersey.test.framework.JerseyTest.getContainer(JerseyTest.java:342)
	at com.sun.jersey.test.framework.JerseyTest.<init>(JerseyTest.java:217)
	at org.apache.hadoop.mapreduce.v2.hs.webapp.TestHsWebServicesJobsQuery.<init>(TestHsWebServicesJobsQuery.java:109)


FAILED:  org.apache.hadoop.mapreduce.v2.hs.webapp.TestHsWebServicesJobsQuery.testJobsQueryStartTimeEndInvalidformat

Error Message:
java.net.BindException: Address already in use

Stack Trace:
com.sun.jersey.test.framework.spi.container.TestContainerException: java.net.BindException: Address already in use
	at sun.nio.ch.Net.bind0(Native Method)
	at sun.nio.ch.Net.bind(Net.java:444)
	at sun.nio.ch.Net.bind(Net.java:436)
	at sun.nio.ch.ServerSocketChannelImpl.bind(ServerSocketChannelImpl.java:214)
	at sun.nio.ch.ServerSocketAdaptor.bind(ServerSocketAdaptor.java:74)
	at org.glassfish.grizzly.nio.transport.TCPNIOTransport.bind(TCPNIOTransport.java:413)
	at org.glassfish.grizzly.nio.transport.TCPNIOTransport.bind(TCPNIOTransport.java:384)
	at org.glassfish.grizzly.nio.transport.TCPNIOTransport.bind(TCPNIOTransport.java:375)
	at org.glassfish.grizzly.http.server.NetworkListener.start(NetworkListener.java:549)
	at org.glassfish.grizzly.http.server.HttpServer.start(HttpServer.java:255)
	at com.sun.jersey.api.container.grizzly2.GrizzlyServerFactory.createHttpServer(GrizzlyServerFactory.java:326)
	at com.sun.jersey.api.container.grizzly2.GrizzlyServerFactory.createHttpServer(GrizzlyServerFactory.java:343)
	at com.sun.jersey.test.framework.spi.container.grizzly2.web.GrizzlyWebTestContainerFactory$GrizzlyWebTestContainer.instantiateGrizzlyWebServer(GrizzlyWebTestContainerFactory.java:219)
	at com.sun.jersey.test.framework.spi.container.grizzly2.web.GrizzlyWebTestContainerFactory$GrizzlyWebTestContainer.<init>(GrizzlyWebTestContainerFactory.java:129)
	at com.sun.jersey.test.framework.spi.container.grizzly2.web.GrizzlyWebTestContainerFactory$GrizzlyWebTestContainer.<init>(GrizzlyWebTestContainerFactory.java:86)
	at com.sun.jersey.test.framework.spi.container.grizzly2.web.GrizzlyWebTestContainerFactory.create(GrizzlyWebTestContainerFactory.java:79)
	at com.sun.jersey.test.framework.JerseyTest.getContainer(JerseyTest.java:342)
	at com.sun.jersey.test.framework.JerseyTest.<init>(JerseyTest.java:217)
	at org.apache.hadoop.mapreduce.v2.hs.webapp.TestHsWebServicesJobsQuery.<init>(TestHsWebServicesJobsQuery.java:109)


FAILED:  org.apache.hadoop.mapreduce.v2.hs.webapp.TestHsWebServicesJobsQuery.testJobsQueryStartTimeBegin

Error Message:
java.net.BindException: Address already in use

Stack Trace:
com.sun.jersey.test.framework.spi.container.TestContainerException: java.net.BindException: Address already in use
	at sun.nio.ch.Net.bind0(Native Method)
	at sun.nio.ch.Net.bind(Net.java:444)
	at sun.nio.ch.Net.bind(Net.java:436)
	at sun.nio.ch.ServerSocketChannelImpl.bind(ServerSocketChannelImpl.java:214)
	at sun.nio.ch.ServerSocketAdaptor.bind(ServerSocketAdaptor.java:74)
	at org.glassfish.grizzly.nio.transport.TCPNIOTransport.bind(TCPNIOTransport.java:413)
	at org.glassfish.grizzly.nio.transport.TCPNIOTransport.bind(TCPNIOTransport.java:384)
	at org.glassfish.grizzly.nio.transport.TCPNIOTransport.bind(TCPNIOTransport.java:375)
	at org.glassfish.grizzly.http.server.NetworkListener.start(NetworkListener.java:549)
	at org.glassfish.grizzly.http.server.HttpServer.start(HttpServer.java:255)
	at com.sun.jersey.api.container.grizzly2.GrizzlyServerFactory.createHttpServer(GrizzlyServerFactory.java:326)
	at com.sun.jersey.api.container.grizzly2.GrizzlyServerFactory.createHttpServer(GrizzlyServerFactory.java:343)
	at com.sun.jersey.test.framework.spi.container.grizzly2.web.GrizzlyWebTestContainerFactory$GrizzlyWebTestContainer.instantiateGrizzlyWebServer(GrizzlyWebTestContainerFactory.java:219)
	at com.sun.jersey.test.framework.spi.container.grizzly2.web.GrizzlyWebTestContainerFactory$GrizzlyWebTestContainer.<init>(GrizzlyWebTestContainerFactory.java:129)
	at com.sun.jersey.test.framework.spi.container.grizzly2.web.GrizzlyWebTestContainerFactory$GrizzlyWebTestContainer.<init>(GrizzlyWebTestContainerFactory.java:86)
	at com.sun.jersey.test.framework.spi.container.grizzly2.web.GrizzlyWebTestContainerFactory.create(GrizzlyWebTestContainerFactory.java:79)
	at com.sun.jersey.test.framework.JerseyTest.getContainer(JerseyTest.java:342)
	at com.sun.jersey.test.framework.JerseyTest.<init>(JerseyTest.java:217)
	at org.apache.hadoop.mapreduce.v2.hs.webapp.TestHsWebServicesJobsQuery.<init>(TestHsWebServicesJobsQuery.java:109)


FAILED:  org.apache.hadoop.mapreduce.v2.hs.webapp.TestHsWebServicesJobsQuery.testJobsQueryUser

Error Message:
java.net.BindException: Address already in use

Stack Trace:
com.sun.jersey.test.framework.spi.container.TestContainerException: java.net.BindException: Address already in use
	at sun.nio.ch.Net.bind0(Native Method)
	at sun.nio.ch.Net.bind(Net.java:444)
	at sun.nio.ch.Net.bind(Net.java:436)
	at sun.nio.ch.ServerSocketChannelImpl.bind(ServerSocketChannelImpl.java:214)
	at sun.nio.ch.ServerSocketAdaptor.bind(ServerSocketAdaptor.java:74)
	at org.glassfish.grizzly.nio.transport.TCPNIOTransport.bind(TCPNIOTransport.java:413)
	at org.glassfish.grizzly.nio.transport.TCPNIOTransport.bind(TCPNIOTransport.java:384)
	at org.glassfish.grizzly.nio.transport.TCPNIOTransport.bind(TCPNIOTransport.java:375)
	at org.glassfish.grizzly.http.server.NetworkListener.start(NetworkListener.java:549)
	at org.glassfish.grizzly.http.server.HttpServer.start(HttpServer.java:255)
	at com.sun.jersey.api.container.grizzly2.GrizzlyServerFactory.createHttpServer(GrizzlyServerFactory.java:326)
	at com.sun.jersey.api.container.grizzly2.GrizzlyServerFactory.createHttpServer(GrizzlyServerFactory.java:343)
	at com.sun.jersey.test.framework.spi.container.grizzly2.web.GrizzlyWebTestContainerFactory$GrizzlyWebTestContainer.instantiateGrizzlyWebServer(GrizzlyWebTestContainerFactory.java:219)
	at com.sun.jersey.test.framework.spi.container.grizzly2.web.GrizzlyWebTestContainerFactory$GrizzlyWebTestContainer.<init>(GrizzlyWebTestContainerFactory.java:129)
	at com.sun.jersey.test.framework.spi.container.grizzly2.web.GrizzlyWebTestContainerFactory$GrizzlyWebTestContainer.<init>(GrizzlyWebTestContainerFactory.java:86)
	at com.sun.jersey.test.framework.spi.container.grizzly2.web.GrizzlyWebTestContainerFactory.create(GrizzlyWebTestContainerFactory.java:79)
	at com.sun.jersey.test.framework.JerseyTest.getContainer(JerseyTest.java:342)
	at com.sun.jersey.test.framework.JerseyTest.<init>(JerseyTest.java:217)
	at org.apache.hadoop.mapreduce.v2.hs.webapp.TestHsWebServicesJobsQuery.<init>(TestHsWebServicesJobsQuery.java:109)


FAILED:  org.apache.hadoop.mapreduce.v2.hs.webapp.TestHsWebServicesJobsQuery.testJobsQueryFinishTimeBeginEnd

Error Message:
java.net.BindException: Address already in use

Stack Trace:
com.sun.jersey.test.framework.spi.container.TestContainerException: java.net.BindException: Address already in use
	at sun.nio.ch.Net.bind0(Native Method)
	at sun.nio.ch.Net.bind(Net.java:444)
	at sun.nio.ch.Net.bind(Net.java:436)
	at sun.nio.ch.ServerSocketChannelImpl.bind(ServerSocketChannelImpl.java:214)
	at sun.nio.ch.ServerSocketAdaptor.bind(ServerSocketAdaptor.java:74)
	at org.glassfish.grizzly.nio.transport.TCPNIOTransport.bind(TCPNIOTransport.java:413)
	at org.glassfish.grizzly.nio.transport.TCPNIOTransport.bind(TCPNIOTransport.java:384)
	at org.glassfish.grizzly.nio.transport.TCPNIOTransport.bind(TCPNIOTransport.java:375)
	at org.glassfish.grizzly.http.server.NetworkListener.start(NetworkListener.java:549)
	at org.glassfish.grizzly.http.server.HttpServer.start(HttpServer.java:255)
	at com.sun.jersey.api.container.grizzly2.GrizzlyServerFactory.createHttpServer(GrizzlyServerFactory.java:326)
	at com.sun.jersey.api.container.grizzly2.GrizzlyServerFactory.createHttpServer(GrizzlyServerFactory.java:343)
	at com.sun.jersey.test.framework.spi.container.grizzly2.web.GrizzlyWebTestContainerFactory$GrizzlyWebTestContainer.instantiateGrizzlyWebServer(GrizzlyWebTestContainerFactory.java:219)
	at com.sun.jersey.test.framework.spi.container.grizzly2.web.GrizzlyWebTestContainerFactory$GrizzlyWebTestContainer.<init>(GrizzlyWebTestContainerFactory.java:129)
	at com.sun.jersey.test.framework.spi.container.grizzly2.web.GrizzlyWebTestContainerFactory$GrizzlyWebTestContainer.<init>(GrizzlyWebTestContainerFactory.java:86)
	at com.sun.jersey.test.framework.spi.container.grizzly2.web.GrizzlyWebTestContainerFactory.create(GrizzlyWebTestContainerFactory.java:79)
	at com.sun.jersey.test.framework.JerseyTest.getContainer(JerseyTest.java:342)
	at com.sun.jersey.test.framework.JerseyTest.<init>(JerseyTest.java:217)
	at org.apache.hadoop.mapreduce.v2.hs.webapp.TestHsWebServicesJobsQuery.<init>(TestHsWebServicesJobsQuery.java:109)


FAILED:  org.apache.hadoop.mapreduce.v2.hs.webapp.TestHsWebServicesJobsQuery.testJobsQueryFinishTimeEndNegative

Error Message:
java.net.BindException: Address already in use

Stack Trace:
com.sun.jersey.test.framework.spi.container.TestContainerException: java.net.BindException: Address already in use
	at sun.nio.ch.Net.bind0(Native Method)
	at sun.nio.ch.Net.bind(Net.java:444)
	at sun.nio.ch.Net.bind(Net.java:436)
	at sun.nio.ch.ServerSocketChannelImpl.bind(ServerSocketChannelImpl.java:214)
	at sun.nio.ch.ServerSocketAdaptor.bind(ServerSocketAdaptor.java:74)
	at org.glassfish.grizzly.nio.transport.TCPNIOTransport.bind(TCPNIOTransport.java:413)
	at org.glassfish.grizzly.nio.transport.TCPNIOTransport.bind(TCPNIOTransport.java:384)
	at org.glassfish.grizzly.nio.transport.TCPNIOTransport.bind(TCPNIOTransport.java:375)
	at org.glassfish.grizzly.http.server.NetworkListener.start(NetworkListener.java:549)
	at org.glassfish.grizzly.http.server.HttpServer.start(HttpServer.java:255)
	at com.sun.jersey.api.container.grizzly2.GrizzlyServerFactory.createHttpServer(GrizzlyServerFactory.java:326)
	at com.sun.jersey.api.container.grizzly2.GrizzlyServerFactory.createHttpServer(GrizzlyServerFactory.java:343)
	at com.sun.jersey.test.framework.spi.container.grizzly2.web.GrizzlyWebTestContainerFactory$GrizzlyWebTestContainer.instantiateGrizzlyWebServer(GrizzlyWebTestContainerFactory.java:219)
	at com.sun.jersey.test.framework.spi.container.grizzly2.web.GrizzlyWebTestContainerFactory$GrizzlyWebTestContainer.<init>(GrizzlyWebTestContainerFactory.java:129)
	at com.sun.jersey.test.framework.spi.container.grizzly2.web.GrizzlyWebTestContainerFactory$GrizzlyWebTestContainer.<init>(GrizzlyWebTestContainerFactory.java:86)
	at com.sun.jersey.test.framework.spi.container.grizzly2.web.GrizzlyWebTestContainerFactory.create(GrizzlyWebTestContainerFactory.java:79)
	at com.sun.jersey.test.framework.JerseyTest.getContainer(JerseyTest.java:342)
	at com.sun.jersey.test.framework.JerseyTest.<init>(JerseyTest.java:217)
	at org.apache.hadoop.mapreduce.v2.hs.webapp.TestHsWebServicesJobsQuery.<init>(TestHsWebServicesJobsQuery.java:109)


FAILED:  org.apache.hadoop.mapreduce.v2.hs.webapp.TestHsWebServicesJobsQuery.testJobsQueryFinishTimeBegin

Error Message:
java.net.BindException: Address already in use

Stack Trace:
com.sun.jersey.test.framework.spi.container.TestContainerException: java.net.BindException: Address already in use
	at sun.nio.ch.Net.bind0(Native Method)
	at sun.nio.ch.Net.bind(Net.java:444)
	at sun.nio.ch.Net.bind(Net.java:436)
	at sun.nio.ch.ServerSocketChannelImpl.bind(ServerSocketChannelImpl.java:214)
	at sun.nio.ch.ServerSocketAdaptor.bind(ServerSocketAdaptor.java:74)
	at org.glassfish.grizzly.nio.transport.TCPNIOTransport.bind(TCPNIOTransport.java:413)
	at org.glassfish.grizzly.nio.transport.TCPNIOTransport.bind(TCPNIOTransport.java:384)
	at org.glassfish.grizzly.nio.transport.TCPNIOTransport.bind(TCPNIOTransport.java:375)
	at org.glassfish.grizzly.http.server.NetworkListener.start(NetworkListener.java:549)
	at org.glassfish.grizzly.http.server.HttpServer.start(HttpServer.java:255)
	at com.sun.jersey.api.container.grizzly2.GrizzlyServerFactory.createHttpServer(GrizzlyServerFactory.java:326)
	at com.sun.jersey.api.container.grizzly2.GrizzlyServerFactory.createHttpServer(GrizzlyServerFactory.java:343)
	at com.sun.jersey.test.framework.spi.container.grizzly2.web.GrizzlyWebTestContainerFactory$GrizzlyWebTestContainer.instantiateGrizzlyWebServer(GrizzlyWebTestContainerFactory.java:219)
	at com.sun.jersey.test.framework.spi.container.grizzly2.web.GrizzlyWebTestContainerFactory$GrizzlyWebTestContainer.<init>(GrizzlyWebTestContainerFactory.java:129)
	at com.sun.jersey.test.framework.spi.container.grizzly2.web.GrizzlyWebTestContainerFactory$GrizzlyWebTestContainer.<init>(GrizzlyWebTestContainerFactory.java:86)
	at com.sun.jersey.test.framework.spi.container.grizzly2.web.GrizzlyWebTestContainerFactory.create(GrizzlyWebTestContainerFactory.java:79)
	at com.sun.jersey.test.framework.JerseyTest.getContainer(JerseyTest.java:342)
	at com.sun.jersey.test.framework.JerseyTest.<init>(JerseyTest.java:217)
	at org.apache.hadoop.mapreduce.v2.hs.webapp.TestHsWebServicesJobsQuery.<init>(TestHsWebServicesJobsQuery.java:109)


FAILED:  org.apache.hadoop.mapreduce.v2.hs.webapp.TestHsWebServicesJobsQuery.testJobsQueryFinishTimeEnd

Error Message:
java.net.BindException: Address already in use

Stack Trace:
com.sun.jersey.test.framework.spi.container.TestContainerException: java.net.BindException: Address already in use
	at sun.nio.ch.Net.bind0(Native Method)
	at sun.nio.ch.Net.bind(Net.java:444)
	at sun.nio.ch.Net.bind(Net.java:436)
	at sun.nio.ch.ServerSocketChannelImpl.bind(ServerSocketChannelImpl.java:214)
	at sun.nio.ch.ServerSocketAdaptor.bind(ServerSocketAdaptor.java:74)
	at org.glassfish.grizzly.nio.transport.TCPNIOTransport.bind(TCPNIOTransport.java:413)
	at org.glassfish.grizzly.nio.transport.TCPNIOTransport.bind(TCPNIOTransport.java:384)
	at org.glassfish.grizzly.nio.transport.TCPNIOTransport.bind(TCPNIOTransport.java:375)
	at org.glassfish.grizzly.http.server.NetworkListener.start(NetworkListener.java:549)
	at org.glassfish.grizzly.http.server.HttpServer.start(HttpServer.java:255)
	at com.sun.jersey.api.container.grizzly2.GrizzlyServerFactory.createHttpServer(GrizzlyServerFactory.java:326)
	at com.sun.jersey.api.container.grizzly2.GrizzlyServerFactory.createHttpServer(GrizzlyServerFactory.java:343)
	at com.sun.jersey.test.framework.spi.container.grizzly2.web.GrizzlyWebTestContainerFactory$GrizzlyWebTestContainer.instantiateGrizzlyWebServer(GrizzlyWebTestContainerFactory.java:219)
	at com.sun.jersey.test.framework.spi.container.grizzly2.web.GrizzlyWebTestContainerFactory$GrizzlyWebTestContainer.<init>(GrizzlyWebTestContainerFactory.java:129)
	at com.sun.jersey.test.framework.spi.container.grizzly2.web.GrizzlyWebTestContainerFactory$GrizzlyWebTestContainer.<init>(GrizzlyWebTestContainerFactory.java:86)
	at com.sun.jersey.test.framework.spi.container.grizzly2.web.GrizzlyWebTestContainerFactory.create(GrizzlyWebTestContainerFactory.java:79)
	at com.sun.jersey.test.framework.JerseyTest.getContainer(JerseyTest.java:342)
	at com.sun.jersey.test.framework.JerseyTest.<init>(JerseyTest.java:217)
	at org.apache.hadoop.mapreduce.v2.hs.webapp.TestHsWebServicesJobsQuery.<init>(TestHsWebServicesJobsQuery.java:109)


FAILED:  org.apache.hadoop.mapreduce.v2.hs.webapp.dao.TestJobInfo.testAverageMergeTime

Error Message:
Could not load history file /home/jenkins/jenkins-slave/workspace/PreCommit-YARN-Build%402/hadoop-mapreduce-project/hadoop-mapreduce-client/hadoop-mapreduce-client-hs/target/test-classes/job_1329348432655_0001-1329348443227-user-Sleep+job-1329348468601-10-1-SUCCEEDED-default.jhist

Stack Trace:
org.apache.hadoop.yarn.exceptions.YarnRuntimeException: Could not load history file /home/jenkins/jenkins-slave/workspace/PreCommit-YARN-Build%402/hadoop-mapreduce-project/hadoop-mapreduce-client/hadoop-mapreduce-client-hs/target/test-classes/job_1329348432655_0001-1329348443227-user-Sleep+job-1329348468601-10-1-SUCCEEDED-default.jhist
	at org.apache.hadoop.fs.RawLocalFileSystem.deprecatedGetFileStatus(RawLocalFileSystem.java:612)
	at org.apache.hadoop.fs.RawLocalFileSystem.getFileLinkStatusInternal(RawLocalFileSystem.java:821)
	at org.apache.hadoop.fs.RawLocalFileSystem.getFileStatus(RawLocalFileSystem.java:602)
	at org.apache.hadoop.fs.FilterFileSystem.getFileStatus(FilterFileSystem.java:421)
	at org.apache.hadoop.fs.ChecksumFileSystem$ChecksumFSInputChecker.<init>(ChecksumFileSystem.java:140)
	at org.apache.hadoop.fs.ChecksumFileSystem.open(ChecksumFileSystem.java:341)
	at org.apache.hadoop.fs.FileSystem.open(FileSystem.java:767)
	at org.apache.hadoop.mapreduce.jobhistory.JobHistoryParser.<init>(JobHistoryParser.java:86)
	at org.apache.hadoop.mapreduce.v2.hs.CompletedJob.loadFullHistoryData(CompletedJob.java:348)
	at org.apache.hadoop.mapreduce.v2.hs.CompletedJob.<init>(CompletedJob.java:104)
	at org.apache.hadoop.mapreduce.v2.hs.webapp.dao.TestJobInfo.testAverageMergeTime(TestJobInfo.java:72)


FAILED:  org.apache.hadoop.mapred.TestClusterMRNotification.testMR

Error Message:
Job status not available 

Stack Trace:
java.io.IOException: Job status not available 
	at org.apache.hadoop.mapreduce.Job.updateStatus(Job.java:331)
	at org.apache.hadoop.mapreduce.Job.isComplete(Job.java:604)
	at org.apache.hadoop.mapreduce.Job.monitorAndPrintJob(Job.java:1349)
	at org.apache.hadoop.mapred.JobClient$NetworkedJob.monitorAndPrintJob(JobClient.java:407)
	at org.apache.hadoop.mapred.JobClient.monitorAndPrintJob(JobClient.java:857)
	at org.apache.hadoop.mapred.JobClient.runJob(JobClient.java:837)
	at org.apache.hadoop.mapred.NotificationTestCase.launchWordCount(NotificationTestCase.java:241)
	at org.apache.hadoop.mapred.NotificationTestCase.testMR(NotificationTestCase.java:156)
	at sun.reflect.NativeMethodAccessorImpl.invoke0(Native Method)
	at sun.reflect.NativeMethodAccessorImpl.invoke(NativeMethodAccessorImpl.java:57)
	at sun.reflect.DelegatingMethodAccessorImpl.invoke(DelegatingMethodAccessorImpl.java:43)
	at java.lang.reflect.Method.invoke(Method.java:606)
	at junit.framework.TestCase.runTest(TestCase.java:176)
	at junit.framework.TestCase.runBare(TestCase.java:141)
	at junit.framework.TestResult$1.protect(TestResult.java:122)
	at junit.framework.TestResult.runProtected(TestResult.java:142)
	at junit.framework.TestResult.run(TestResult.java:125)
	at junit.framework.TestCase.run(TestCase.java:129)
	at junit.framework.TestSuite.runTest(TestSuite.java:255)
	at junit.framework.TestSuite.run(TestSuite.java:250)
	at org.junit.internal.runners.JUnit38ClassRunner.run(JUnit38ClassRunner.java:84)
	at org.apache.maven.surefire.junit4.JUnit4Provider.execute(JUnit4Provider.java:264)
	at org.apache.maven.surefire.junit4.JUnit4Provider.executeTestSet(JUnit4Provider.java:153)
	at org.apache.maven.surefire.junit4.JUnit4Provider.invoke(JUnit4Provider.java:124)
	at org.apache.maven.surefire.booter.ForkedBooter.invokeProviderInSameClassLoader(ForkedBooter.java:200)
	at org.apache.maven.surefire.booter.ForkedBooter.runSuitesInProcess(ForkedBooter.java:153)
	at org.apache.maven.surefire.booter.ForkedBooter.main(ForkedBooter.java:103)


FAILED:  org.apache.hadoop.mapreduce.v2.TestMRJobsWithProfiler.testDefaultProfiler

Error Message:
expected:<4> but was:<1>

Stack Trace:
java.lang.AssertionError: expected:<4> but was:<1>
	at org.junit.Assert.fail(Assert.java:88)
	at org.junit.Assert.failNotEquals(Assert.java:743)
	at org.junit.Assert.assertEquals(Assert.java:118)
	at org.junit.Assert.assertEquals(Assert.java:555)
	at org.junit.Assert.assertEquals(Assert.java:542)
	at org.apache.hadoop.mapreduce.v2.TestMRJobsWithProfiler.testProfilerInternal(TestMRJobsWithProfiler.java:212)
	at org.apache.hadoop.mapreduce.v2.TestMRJobsWithProfiler.testDefaultProfiler(TestMRJobsWithProfiler.java:111)


FAILED:  org.apache.hadoop.yarn.applications.distributedshell.TestDistributedShell.testDSShellWithInvalidArgs

Error Message:
/home/jenkins/jenkins-slave/workspace/PreCommit-YARN-Build%402/hadoop-yarn-project/hadoop-yarn/hadoop-yarn-applications/hadoop-yarn-applications-distributedshell/target/test-classes/yarn-site.xml (No such file or directory)

Stack Trace:
java.io.FileNotFoundException: /home/jenkins/jenkins-slave/workspace/PreCommit-YARN-Build%402/hadoop-yarn-project/hadoop-yarn/hadoop-yarn-applications/hadoop-yarn-applications-distributedshell/target/test-classes/yarn-site.xml (No such file or directory)
	at java.io.FileOutputStream.open(Native Method)
	at java.io.FileOutputStream.<init>(FileOutputStream.java:221)
	at java.io.FileOutputStream.<init>(FileOutputStream.java:171)
	at org.apache.hadoop.yarn.applications.distributedshell.TestDistributedShell.setupInternal(TestDistributedShell.java:107)
	at org.apache.hadoop.yarn.applications.distributedshell.TestDistributedShell.setup(TestDistributedShell.java:71)


FAILED:  org.apache.hadoop.yarn.applications.distributedshell.TestDistributedShell.testDSShellWithoutDomain

Error Message:
/home/jenkins/jenkins-slave/workspace/PreCommit-YARN-Build%402/hadoop-yarn-project/hadoop-yarn/hadoop-yarn-applications/hadoop-yarn-applications-distributedshell/target/test-classes/yarn-site.xml (No such file or directory)

Stack Trace:
java.io.FileNotFoundException: /home/jenkins/jenkins-slave/workspace/PreCommit-YARN-Build%402/hadoop-yarn-project/hadoop-yarn/hadoop-yarn-applications/hadoop-yarn-applications-distributedshell/target/test-classes/yarn-site.xml (No such file or directory)
	at java.io.FileOutputStream.open(Native Method)
	at java.io.FileOutputStream.<init>(FileOutputStream.java:221)
	at java.io.FileOutputStream.<init>(FileOutputStream.java:171)
	at org.apache.hadoop.yarn.applications.distributedshell.TestDistributedShell.setupInternal(TestDistributedShell.java:107)
	at org.apache.hadoop.yarn.applications.distributedshell.TestDistributedShell.setup(TestDistributedShell.java:71)


FAILED:  org.apache.hadoop.yarn.applications.distributedshell.TestDistributedShell.testDSAttemptFailuresValidityIntervalFailed

Error Message:
/home/jenkins/jenkins-slave/workspace/PreCommit-YARN-Build%402/hadoop-yarn-project/hadoop-yarn/hadoop-yarn-applications/hadoop-yarn-applications-distributedshell/target/test-classes/yarn-site.xml (No such file or directory)

Stack Trace:
java.io.FileNotFoundException: /home/jenkins/jenkins-slave/workspace/PreCommit-YARN-Build%402/hadoop-yarn-project/hadoop-yarn/hadoop-yarn-applications/hadoop-yarn-applications-distributedshell/target/test-classes/yarn-site.xml (No such file or directory)
	at java.io.FileOutputStream.open(Native Method)
	at java.io.FileOutputStream.<init>(FileOutputStream.java:221)
	at java.io.FileOutputStream.<init>(FileOutputStream.java:171)
	at org.apache.hadoop.yarn.applications.distributedshell.TestDistributedShell.setupInternal(TestDistributedShell.java:107)
	at org.apache.hadoop.yarn.applications.distributedshell.TestDistributedShell.setup(TestDistributedShell.java:71)


FAILED:  org.apache.hadoop.yarn.applications.distributedshell.TestDistributedShell.testDSShellWithMultipleArgs

Error Message:
/home/jenkins/jenkins-slave/workspace/PreCommit-YARN-Build%402/hadoop-yarn-project/hadoop-yarn/hadoop-yarn-applications/hadoop-yarn-applications-distributedshell/target/test-classes/yarn-site.xml (No such file or directory)

Stack Trace:
java.io.FileNotFoundException: /home/jenkins/jenkins-slave/workspace/PreCommit-YARN-Build%402/hadoop-yarn-project/hadoop-yarn/hadoop-yarn-applications/hadoop-yarn-applications-distributedshell/target/test-classes/yarn-site.xml (No such file or directory)
	at java.io.FileOutputStream.open(Native Method)
	at java.io.FileOutputStream.<init>(FileOutputStream.java:221)
	at java.io.FileOutputStream.<init>(FileOutputStream.java:171)
	at org.apache.hadoop.yarn.applications.distributedshell.TestDistributedShell.setupInternal(TestDistributedShell.java:107)
	at org.apache.hadoop.yarn.applications.distributedshell.TestDistributedShell.setup(TestDistributedShell.java:71)


FAILED:  org.apache.hadoop.yarn.applications.distributedshell.TestDistributedShell.testDSAttemptFailuresValidityIntervalSucess

Error Message:
/home/jenkins/jenkins-slave/workspace/PreCommit-YARN-Build%402/hadoop-yarn-project/hadoop-yarn/hadoop-yarn-applications/hadoop-yarn-applications-distributedshell/target/test-classes/yarn-site.xml (No such file or directory)

Stack Trace:
java.io.FileNotFoundException: /home/jenkins/jenkins-slave/workspace/PreCommit-YARN-Build%402/hadoop-yarn-project/hadoop-yarn/hadoop-yarn-applications/hadoop-yarn-applications-distributedshell/target/test-classes/yarn-site.xml (No such file or directory)
	at java.io.FileOutputStream.open(Native Method)
	at java.io.FileOutputStream.<init>(FileOutputStream.java:221)
	at java.io.FileOutputStream.<init>(FileOutputStream.java:171)
	at org.apache.hadoop.yarn.applications.distributedshell.TestDistributedShell.setupInternal(TestDistributedShell.java:107)
	at org.apache.hadoop.yarn.applications.distributedshell.TestDistributedShell.setup(TestDistributedShell.java:71)


FAILED:  org.apache.hadoop.yarn.applications.distributedshell.TestDistributedShell.testDSShellWithDomain

Error Message:
/home/jenkins/jenkins-slave/workspace/PreCommit-YARN-Build%402/hadoop-yarn-project/hadoop-yarn/hadoop-yarn-applications/hadoop-yarn-applications-distributedshell/target/test-classes/yarn-site.xml (No such file or directory)

Stack Trace:
java.io.FileNotFoundException: /home/jenkins/jenkins-slave/workspace/PreCommit-YARN-Build%402/hadoop-yarn-project/hadoop-yarn/hadoop-yarn-applications/hadoop-yarn-applications-distributedshell/target/test-classes/yarn-site.xml (No such file or directory)
	at java.io.FileOutputStream.open(Native Method)
	at java.io.FileOutputStream.<init>(FileOutputStream.java:221)
	at java.io.FileOutputStream.<init>(FileOutputStream.java:171)
	at org.apache.hadoop.yarn.applications.distributedshell.TestDistributedShell.setupInternal(TestDistributedShell.java:107)
	at org.apache.hadoop.yarn.applications.distributedshell.TestDistributedShell.setup(TestDistributedShell.java:71)


FAILED:  org.apache.hadoop.yarn.applications.distributedshell.TestDistributedShell.testDebugFlag

Error Message:
/home/jenkins/jenkins-slave/workspace/PreCommit-YARN-Build%402/hadoop-yarn-project/hadoop-yarn/hadoop-yarn-applications/hadoop-yarn-applications-distributedshell/target/test-classes/yarn-site.xml (No such file or directory)

Stack Trace:
java.io.FileNotFoundException: /home/jenkins/jenkins-slave/workspace/PreCommit-YARN-Build%402/hadoop-yarn-project/hadoop-yarn/hadoop-yarn-applications/hadoop-yarn-applications-distributedshell/target/test-classes/yarn-site.xml (No such file or directory)
	at java.io.FileOutputStream.open(Native Method)
	at java.io.FileOutputStream.<init>(FileOutputStream.java:221)
	at java.io.FileOutputStream.<init>(FileOutputStream.java:171)
	at org.apache.hadoop.yarn.applications.distributedshell.TestDistributedShell.setupInternal(TestDistributedShell.java:107)
	at org.apache.hadoop.yarn.applications.distributedshell.TestDistributedShell.setup(TestDistributedShell.java:71)


FAILED:  org.apache.hadoop.yarn.applications.distributedshell.TestDistributedShell.testDSShellWithShellScript

Error Message:
/home/jenkins/jenkins-slave/workspace/PreCommit-YARN-Build%402/hadoop-yarn-project/hadoop-yarn/hadoop-yarn-applications/hadoop-yarn-applications-distributedshell/target/test-classes/yarn-site.xml (No such file or directory)

Stack Trace:
java.io.FileNotFoundException: /home/jenkins/jenkins-slave/workspace/PreCommit-YARN-Build%402/hadoop-yarn-project/hadoop-yarn/hadoop-yarn-applications/hadoop-yarn-applications-distributedshell/target/test-classes/yarn-site.xml (No such file or directory)
	at java.io.FileOutputStream.open(Native Method)
	at java.io.FileOutputStream.<init>(FileOutputStream.java:221)
	at java.io.FileOutputStream.<init>(FileOutputStream.java:171)
	at org.apache.hadoop.yarn.applications.distributedshell.TestDistributedShell.setupInternal(TestDistributedShell.java:107)
	at org.apache.hadoop.yarn.applications.distributedshell.TestDistributedShell.setup(TestDistributedShell.java:71)


FAILED:  org.apache.hadoop.yarn.applications.distributedshell.TestDistributedShell.testDSRestartWithPreviousRunningContainers

Error Message:
/home/jenkins/jenkins-slave/workspace/PreCommit-YARN-Build%402/hadoop-yarn-project/hadoop-yarn/hadoop-yarn-applications/hadoop-yarn-applications-distributedshell/target/test-classes/yarn-site.xml (No such file or directory)

Stack Trace:
java.io.FileNotFoundException: /home/jenkins/jenkins-slave/workspace/PreCommit-YARN-Build%402/hadoop-yarn-project/hadoop-yarn/hadoop-yarn-applications/hadoop-yarn-applications-distributedshell/target/test-classes/yarn-site.xml (No such file or directory)
	at java.io.FileOutputStream.open(Native Method)
	at java.io.FileOutputStream.<init>(FileOutputStream.java:221)
	at java.io.FileOutputStream.<init>(FileOutputStream.java:171)
	at org.apache.hadoop.yarn.applications.distributedshell.TestDistributedShell.setupInternal(TestDistributedShell.java:107)
	at org.apache.hadoop.yarn.applications.distributedshell.TestDistributedShell.setup(TestDistributedShell.java:71)


FAILED:  org.apache.hadoop.yarn.applications.distributedshell.TestDistributedShell.testDSShellWithCustomLogPropertyFile

Error Message:
/home/jenkins/jenkins-slave/workspace/PreCommit-YARN-Build%402/hadoop-yarn-project/hadoop-yarn/hadoop-yarn-applications/hadoop-yarn-applications-distributedshell/target/test-classes/yarn-site.xml (No such file or directory)

Stack Trace:
java.io.FileNotFoundException: /home/jenkins/jenkins-slave/workspace/PreCommit-YARN-Build%402/hadoop-yarn-project/hadoop-yarn/hadoop-yarn-applications/hadoop-yarn-applications-distributedshell/target/test-classes/yarn-site.xml (No such file or directory)
	at java.io.FileOutputStream.open(Native Method)
	at java.io.FileOutputStream.<init>(FileOutputStream.java:221)
	at java.io.FileOutputStream.<init>(FileOutputStream.java:171)
	at org.apache.hadoop.yarn.applications.distributedshell.TestDistributedShell.setupInternal(TestDistributedShell.java:107)
	at org.apache.hadoop.yarn.applications.distributedshell.TestDistributedShell.setup(TestDistributedShell.java:71)


FAILED:  org.apache.hadoop.yarn.applications.distributedshell.TestDistributedShell.testContainerLaunchFailureHandling

Error Message:
/home/jenkins/jenkins-slave/workspace/PreCommit-YARN-Build%402/hadoop-yarn-project/hadoop-yarn/hadoop-yarn-applications/hadoop-yarn-applications-distributedshell/target/test-classes/yarn-site.xml (No such file or directory)

Stack Trace:
java.io.FileNotFoundException: /home/jenkins/jenkins-slave/workspace/PreCommit-YARN-Build%402/hadoop-yarn-project/hadoop-yarn/hadoop-yarn-applications/hadoop-yarn-applications-distributedshell/target/test-classes/yarn-site.xml (No such file or directory)
	at java.io.FileOutputStream.open(Native Method)
	at java.io.FileOutputStream.<init>(FileOutputStream.java:221)
	at java.io.FileOutputStream.<init>(FileOutputStream.java:171)
	at org.apache.hadoop.yarn.applications.distributedshell.TestDistributedShell.setupInternal(TestDistributedShell.java:107)
	at org.apache.hadoop.yarn.applications.distributedshell.TestDistributedShell.setup(TestDistributedShell.java:71)


FAILED:  org.apache.hadoop.yarn.applications.distributedshell.TestDistributedShellWithNodeLabels.testDSShellWithNodeLabelExpression

Error Message:
/home/jenkins/jenkins-slave/workspace/PreCommit-YARN-Build%402/hadoop-yarn-project/hadoop-yarn/hadoop-yarn-applications/hadoop-yarn-applications-distributedshell/target/test-classes/yarn-site.xml (No such file or directory)

Stack Trace:
java.io.FileNotFoundException: /home/jenkins/jenkins-slave/workspace/PreCommit-YARN-Build%402/hadoop-yarn-project/hadoop-yarn/hadoop-yarn-applications/hadoop-yarn-applications-distributedshell/target/test-classes/yarn-site.xml (No such file or directory)
	at java.io.FileOutputStream.open(Native Method)
	at java.io.FileOutputStream.<init>(FileOutputStream.java:221)
	at java.io.FileOutputStream.<init>(FileOutputStream.java:171)
	at org.apache.hadoop.yarn.applications.distributedshell.TestDistributedShell.setupInternal(TestDistributedShell.java:107)
	at org.apache.hadoop.yarn.applications.distributedshell.TestDistributedShellWithNodeLabels.setup(TestDistributedShellWithNodeLabels.java:47)


FAILED:  org.apache.hadoop.yarn.applications.unmanagedamlauncher.TestUnmanagedAMLauncher.org.apache.hadoop.yarn.applications.unmanagedamlauncher.TestUnmanagedAMLauncher

Error Message:
/home/jenkins/jenkins-slave/workspace/PreCommit-YARN-Build%402/hadoop-yarn-project/hadoop-yarn/hadoop-yarn-applications/hadoop-yarn-applications-unmanaged-am-launcher/target/test-classes/yarn-site.xml (No such file or directory)

Stack Trace:
java.io.FileNotFoundException: /home/jenkins/jenkins-slave/workspace/PreCommit-YARN-Build%402/hadoop-yarn-project/hadoop-yarn/hadoop-yarn-applications/hadoop-yarn-applications-unmanaged-am-launcher/target/test-classes/yarn-site.xml (No such file or directory)
	at java.io.FileOutputStream.open(Native Method)
	at java.io.FileOutputStream.<init>(FileOutputStream.java:221)
	at java.io.FileOutputStream.<init>(FileOutputStream.java:171)
	at org.apache.hadoop.yarn.applications.unmanagedamlauncher.TestUnmanagedAMLauncher.setup(TestUnmanagedAMLauncher.java:89)


FAILED:  org.apache.hadoop.yarn.client.TestApplicationClientProtocolOnHA.testGetContainersOnHA

Error Message:
org.apache.hadoop.yarn.api.records.ContainerReport.setNodeHttpAddress(Ljava/lang/String;)V
 at org.apache.hadoop.yarn.api.records.ContainerReport.newInstance(ContainerReport.java:71)
 at org.apache.hadoop.yarn.client.ProtocolHATestBase$MiniYARNClusterForHATesting.createFakeContainerReport(ProtocolHATestBase.java:715)
 at org.apache.hadoop.yarn.client.ProtocolHATestBase$MiniYARNClusterForHATesting.createFakeContainerReports(ProtocolHATestBase.java:724)
 at org.apache.hadoop.yarn.client.ProtocolHATestBase$MiniYARNClusterForHATesting$CustomedClientRMService.getContainers(ProtocolHATestBase.java:569)
 at org.apache.hadoop.yarn.api.impl.pb.service.ApplicationClientProtocolPBServiceImpl.getContainers(ApplicationClientProtocolPBServiceImpl.java:408)
 at org.apache.hadoop.yarn.proto.ApplicationClientProtocol$ApplicationClientProtocolService$2.callBlockingMethod(ApplicationClientProtocol.java:447)
 at org.apache.hadoop.ipc.ProtobufRpcEngine$Server$ProtoBufRpcInvoker.call(ProtobufRpcEngine.java:636)
 at org.apache.hadoop.ipc.RPC$Server.call(RPC.java:973)
 at org.apache.hadoop.ipc.Server$Handler$1.run(Server.java:2140)
 at org.apache.hadoop.ipc.Server$Handler$1.run(Server.java:2136)
 at java.security.AccessController.doPrivileged(Native Method)
 at javax.security.auth.Subject.doAs(Subject.java:415)
 at org.apache.hadoop.security.UserGroupInformation.doAs(UserGroupInformation.java:1669)
 at org.apache.hadoop.ipc.Server$Handler.run(Server.java:2134)


Stack Trace:
org.apache.hadoop.ipc.RemoteException: org.apache.hadoop.yarn.api.records.ContainerReport.setNodeHttpAddress(Ljava/lang/String;)V
	at org.apache.hadoop.yarn.api.records.ContainerReport.newInstance(ContainerReport.java:71)
	at org.apache.hadoop.yarn.client.ProtocolHATestBase$MiniYARNClusterForHATesting.createFakeContainerReport(ProtocolHATestBase.java:715)
	at org.apache.hadoop.yarn.client.ProtocolHATestBase$MiniYARNClusterForHATesting.createFakeContainerReports(ProtocolHATestBase.java:724)
	at org.apache.hadoop.yarn.client.ProtocolHATestBase$MiniYARNClusterForHATesting$CustomedClientRMService.getContainers(ProtocolHATestBase.java:569)
	at org.apache.hadoop.yarn.api.impl.pb.service.ApplicationClientProtocolPBServiceImpl.getContainers(ApplicationClientProtocolPBServiceImpl.java:408)
	at org.apache.hadoop.yarn.proto.ApplicationClientProtocol$ApplicationClientProtocolService$2.callBlockingMethod(ApplicationClientProtocol.java:447)
	at org.apache.hadoop.ipc.ProtobufRpcEngine$Server$ProtoBufRpcInvoker.call(ProtobufRpcEngine.java:636)
	at org.apache.hadoop.ipc.RPC$Server.call(RPC.java:973)
	at org.apache.hadoop.ipc.Server$Handler$1.run(Server.java:2140)
	at org.apache.hadoop.ipc.Server$Handler$1.run(Server.java:2136)
	at java.security.AccessController.doPrivileged(Native Method)
	at javax.security.auth.Subject.doAs(Subject.java:415)
	at org.apache.hadoop.security.UserGroupInformation.doAs(UserGroupInformation.java:1669)
	at org.apache.hadoop.ipc.Server$Handler.run(Server.java:2134)

	at org.apache.hadoop.ipc.Client.call(Client.java:1492)
	at org.apache.hadoop.ipc.Client.call(Client.java:1423)
	at org.apache.hadoop.ipc.ProtobufRpcEngine$Invoker.invoke(ProtobufRpcEngine.java:229)
	at com.sun.proxy.$Proxy17.getContainers(Unknown Source)
	at org.apache.hadoop.yarn.api.impl.pb.client.ApplicationClientProtocolPBClientImpl.getContainers(ApplicationClientProtocolPBClientImpl.java:414)
	at sun.reflect.NativeMethodAccessorImpl.invoke0(Native Method)
	at sun.reflect.NativeMethodAccessorImpl.invoke(NativeMethodAccessorImpl.java:57)
	at sun.reflect.DelegatingMethodAccessorImpl.invoke(DelegatingMethodAccessorImpl.java:43)
	at java.lang.reflect.Method.invoke(Method.java:606)
	at org.apache.hadoop.io.retry.RetryInvocationHandler.invokeMethod(RetryInvocationHandler.java:186)
	at org.apache.hadoop.io.retry.RetryInvocationHandler.invoke(RetryInvocationHandler.java:101)
	at com.sun.proxy.$Proxy18.getContainers(Unknown Source)
	at org.apache.hadoop.yarn.client.api.impl.YarnClientImpl.getContainers(YarnClientImpl.java:689)
	at org.apache.hadoop.yarn.client.TestApplicationClientProtocolOnHA.testGetContainersOnHA(TestApplicationClientProtocolOnHA.java:154)


FAILED:  org.apache.hadoop.yarn.client.TestApplicationClientProtocolOnHA.testGetContainerReportOnHA

Error Message:
org.apache.hadoop.yarn.api.records.ContainerReport.setNodeHttpAddress(Ljava/lang/String;)V
 at org.apache.hadoop.yarn.api.records.ContainerReport.newInstance(ContainerReport.java:71)
 at org.apache.hadoop.yarn.client.ProtocolHATestBase$MiniYARNClusterForHATesting.createFakeContainerReport(ProtocolHATestBase.java:715)
 at org.apache.hadoop.yarn.client.ProtocolHATestBase$MiniYARNClusterForHATesting$CustomedClientRMService.getContainerReport(ProtocolHATestBase.java:556)
 at org.apache.hadoop.yarn.api.impl.pb.service.ApplicationClientProtocolPBServiceImpl.getContainerReport(ApplicationClientProtocolPBServiceImpl.java:394)
 at org.apache.hadoop.yarn.proto.ApplicationClientProtocol$ApplicationClientProtocolService$2.callBlockingMethod(ApplicationClientProtocol.java:445)
 at org.apache.hadoop.ipc.ProtobufRpcEngine$Server$ProtoBufRpcInvoker.call(ProtobufRpcEngine.java:636)
 at org.apache.hadoop.ipc.RPC$Server.call(RPC.java:973)
 at org.apache.hadoop.ipc.Server$Handler$1.run(Server.java:2140)
 at org.apache.hadoop.ipc.Server$Handler$1.run(Server.java:2136)
 at java.security.AccessController.doPrivileged(Native Method)
 at javax.security.auth.Subject.doAs(Subject.java:415)
 at org.apache.hadoop.security.UserGroupInformation.doAs(UserGroupInformation.java:1669)
 at org.apache.hadoop.ipc.Server$Handler.run(Server.java:2134)


Stack Trace:
org.apache.hadoop.ipc.RemoteException: org.apache.hadoop.yarn.api.records.ContainerReport.setNodeHttpAddress(Ljava/lang/String;)V
	at org.apache.hadoop.yarn.api.records.ContainerReport.newInstance(ContainerReport.java:71)
	at org.apache.hadoop.yarn.client.ProtocolHATestBase$MiniYARNClusterForHATesting.createFakeContainerReport(ProtocolHATestBase.java:715)
	at org.apache.hadoop.yarn.client.ProtocolHATestBase$MiniYARNClusterForHATesting$CustomedClientRMService.getContainerReport(ProtocolHATestBase.java:556)
	at org.apache.hadoop.yarn.api.impl.pb.service.ApplicationClientProtocolPBServiceImpl.getContainerReport(ApplicationClientProtocolPBServiceImpl.java:394)
	at org.apache.hadoop.yarn.proto.ApplicationClientProtocol$ApplicationClientProtocolService$2.callBlockingMethod(ApplicationClientProtocol.java:445)
	at org.apache.hadoop.ipc.ProtobufRpcEngine$Server$ProtoBufRpcInvoker.call(ProtobufRpcEngine.java:636)
	at org.apache.hadoop.ipc.RPC$Server.call(RPC.java:973)
	at org.apache.hadoop.ipc.Server$Handler$1.run(Server.java:2140)
	at org.apache.hadoop.ipc.Server$Handler$1.run(Server.java:2136)
	at java.security.AccessController.doPrivileged(Native Method)
	at javax.security.auth.Subject.doAs(Subject.java:415)
	at org.apache.hadoop.security.UserGroupInformation.doAs(UserGroupInformation.java:1669)
	at org.apache.hadoop.ipc.Server$Handler.run(Server.java:2134)

	at org.apache.hadoop.ipc.Client.call(Client.java:1492)
	at org.apache.hadoop.ipc.Client.call(Client.java:1423)
	at org.apache.hadoop.ipc.ProtobufRpcEngine$Invoker.invoke(ProtobufRpcEngine.java:229)
	at com.sun.proxy.$Proxy17.getContainerReport(Unknown Source)
	at org.apache.hadoop.yarn.api.impl.pb.client.ApplicationClientProtocolPBClientImpl.getContainerReport(ApplicationClientProtocolPBClientImpl.java:400)
	at sun.reflect.NativeMethodAccessorImpl.invoke0(Native Method)
	at sun.reflect.NativeMethodAccessorImpl.invoke(NativeMethodAccessorImpl.java:57)
	at sun.reflect.DelegatingMethodAccessorImpl.invoke(DelegatingMethodAccessorImpl.java:43)
	at java.lang.reflect.Method.invoke(Method.java:606)
	at org.apache.hadoop.io.retry.RetryInvocationHandler.invokeMethod(RetryInvocationHandler.java:186)
	at org.apache.hadoop.io.retry.RetryInvocationHandler.invoke(RetryInvocationHandler.java:101)
	at com.sun.proxy.$Proxy18.getContainerReport(Unknown Source)
	at org.apache.hadoop.yarn.client.api.impl.YarnClientImpl.getContainerReport(YarnClientImpl.java:660)
	at org.apache.hadoop.yarn.client.TestApplicationClientProtocolOnHA.testGetContainerReportOnHA(TestApplicationClientProtocolOnHA.java:146)


FAILED:  org.apache.hadoop.yarn.client.api.impl.TestAHSClient.testGetApplications

Error Message:
org.apache.hadoop.yarn.api.records.ContainerReport.setNodeHttpAddress(Ljava/lang/String;)V

Stack Trace:
java.lang.AbstractMethodError: org.apache.hadoop.yarn.api.records.ContainerReport.setNodeHttpAddress(Ljava/lang/String;)V
	at org.apache.hadoop.yarn.api.records.ContainerReport.newInstance(ContainerReport.java:71)
	at org.apache.hadoop.yarn.client.api.impl.TestAHSClient$MockAHSClient.createAppReports(TestAHSClient.java:370)
	at org.apache.hadoop.yarn.client.api.impl.TestAHSClient$MockAHSClient.<init>(TestAHSClient.java:211)
	at org.apache.hadoop.yarn.client.api.impl.TestAHSClient.testGetApplications(TestAHSClient.java:76)


FAILED:  org.apache.hadoop.yarn.client.api.impl.TestAHSClient.testGetContainerReport

Error Message:
org.apache.hadoop.yarn.api.records.ContainerReport.setNodeHttpAddress(Ljava/lang/String;)V

Stack Trace:
java.lang.AbstractMethodError: org.apache.hadoop.yarn.api.records.ContainerReport.setNodeHttpAddress(Ljava/lang/String;)V
	at org.apache.hadoop.yarn.api.records.ContainerReport.newInstance(ContainerReport.java:71)
	at org.apache.hadoop.yarn.client.api.impl.TestAHSClient$MockAHSClient.createAppReports(TestAHSClient.java:370)
	at org.apache.hadoop.yarn.client.api.impl.TestAHSClient$MockAHSClient.<init>(TestAHSClient.java:211)
	at org.apache.hadoop.yarn.client.api.impl.TestAHSClient.testGetContainerReport(TestAHSClient.java:169)


FAILED:  org.apache.hadoop.yarn.client.api.impl.TestAHSClient.testGetApplicationAttempts

Error Message:
org.apache.hadoop.yarn.api.records.ContainerReport.setNodeHttpAddress(Ljava/lang/String;)V

Stack Trace:
java.lang.AbstractMethodError: org.apache.hadoop.yarn.api.records.ContainerReport.setNodeHttpAddress(Ljava/lang/String;)V
	at org.apache.hadoop.yarn.api.records.ContainerReport.newInstance(ContainerReport.java:71)
	at org.apache.hadoop.yarn.client.api.impl.TestAHSClient$MockAHSClient.createAppReports(TestAHSClient.java:370)
	at org.apache.hadoop.yarn.client.api.impl.TestAHSClient$MockAHSClient.<init>(TestAHSClient.java:211)
	at org.apache.hadoop.yarn.client.api.impl.TestAHSClient.testGetApplicationAttempts(TestAHSClient.java:111)


FAILED:  org.apache.hadoop.yarn.client.api.impl.TestAHSClient.testGetApplicationReport

Error Message:
org.apache.hadoop.yarn.api.records.ContainerReport.setNodeHttpAddress(Ljava/lang/String;)V

Stack Trace:
java.lang.AbstractMethodError: org.apache.hadoop.yarn.api.records.ContainerReport.setNodeHttpAddress(Ljava/lang/String;)V
	at org.apache.hadoop.yarn.api.records.ContainerReport.newInstance(ContainerReport.java:71)
	at org.apache.hadoop.yarn.client.api.impl.TestAHSClient$MockAHSClient.createAppReports(TestAHSClient.java:370)
	at org.apache.hadoop.yarn.client.api.impl.TestAHSClient$MockAHSClient.<init>(TestAHSClient.java:211)
	at org.apache.hadoop.yarn.client.api.impl.TestAHSClient.testGetApplicationReport(TestAHSClient.java:94)


FAILED:  org.apache.hadoop.yarn.client.api.impl.TestAHSClient.testGetApplicationAttempt

Error Message:
org.apache.hadoop.yarn.api.records.ContainerReport.setNodeHttpAddress(Ljava/lang/String;)V

Stack Trace:
java.lang.AbstractMethodError: org.apache.hadoop.yarn.api.records.ContainerReport.setNodeHttpAddress(Ljava/lang/String;)V
	at org.apache.hadoop.yarn.api.records.ContainerReport.newInstance(ContainerReport.java:71)
	at org.apache.hadoop.yarn.client.api.impl.TestAHSClient$MockAHSClient.createAppReports(TestAHSClient.java:370)
	at org.apache.hadoop.yarn.client.api.impl.TestAHSClient$MockAHSClient.<init>(TestAHSClient.java:211)
	at org.apache.hadoop.yarn.client.api.impl.TestAHSClient.testGetApplicationAttempt(TestAHSClient.java:129)


FAILED:  org.apache.hadoop.yarn.client.api.impl.TestAHSClient.testGetContainers

Error Message:
org.apache.hadoop.yarn.api.records.ContainerReport.setNodeHttpAddress(Ljava/lang/String;)V

Stack Trace:
java.lang.AbstractMethodError: org.apache.hadoop.yarn.api.records.ContainerReport.setNodeHttpAddress(Ljava/lang/String;)V
	at org.apache.hadoop.yarn.api.records.ContainerReport.newInstance(ContainerReport.java:71)
	at org.apache.hadoop.yarn.client.api.impl.TestAHSClient$MockAHSClient.createAppReports(TestAHSClient.java:370)
	at org.apache.hadoop.yarn.client.api.impl.TestAHSClient$MockAHSClient.<init>(TestAHSClient.java:211)
	at org.apache.hadoop.yarn.client.api.impl.TestAHSClient.testGetContainers(TestAHSClient.java:150)


FAILED:  org.apache.hadoop.yarn.client.api.impl.TestYarnClient.testGetApplications

Error Message:
org.apache.hadoop.yarn.api.records.ContainerReport.setNodeHttpAddress(Ljava/lang/String;)V

Stack Trace:
java.lang.AbstractMethodError: org.apache.hadoop.yarn.api.records.ContainerReport.setNodeHttpAddress(Ljava/lang/String;)V
	at org.apache.hadoop.yarn.api.records.ContainerReport.newInstance(ContainerReport.java:71)
	at org.apache.hadoop.yarn.client.api.impl.TestYarnClient$MockYarnClient.createAppReports(TestYarnClient.java:612)
	at org.apache.hadoop.yarn.client.api.impl.TestYarnClient$MockYarnClient.<init>(TestYarnClient.java:504)
	at org.apache.hadoop.yarn.client.api.impl.TestYarnClient.testGetApplications(TestYarnClient.java:300)


FAILED:  org.apache.hadoop.yarn.client.api.impl.TestYarnClient.testGetContainerReport

Error Message:
org.apache.hadoop.yarn.api.records.ContainerReport.setNodeHttpAddress(Ljava/lang/String;)V

Stack Trace:
java.lang.AbstractMethodError: org.apache.hadoop.yarn.api.records.ContainerReport.setNodeHttpAddress(Ljava/lang/String;)V
	at org.apache.hadoop.yarn.api.records.ContainerReport.newInstance(ContainerReport.java:71)
	at org.apache.hadoop.yarn.client.api.impl.TestYarnClient$MockYarnClient.createAppReports(TestYarnClient.java:612)
	at org.apache.hadoop.yarn.client.api.impl.TestYarnClient$MockYarnClient.<init>(TestYarnClient.java:504)
	at org.apache.hadoop.yarn.client.api.impl.TestYarnClient.testGetContainerReport(TestYarnClient.java:428)


FAILED:  org.apache.hadoop.yarn.client.api.impl.TestYarnClient.testGetApplicationAttempts

Error Message:
org.apache.hadoop.yarn.api.records.ContainerReport.setNodeHttpAddress(Ljava/lang/String;)V

Stack Trace:
java.lang.AbstractMethodError: org.apache.hadoop.yarn.api.records.ContainerReport.setNodeHttpAddress(Ljava/lang/String;)V
	at org.apache.hadoop.yarn.api.records.ContainerReport.newInstance(ContainerReport.java:71)
	at org.apache.hadoop.yarn.client.api.impl.TestYarnClient$MockYarnClient.createAppReports(TestYarnClient.java:612)
	at org.apache.hadoop.yarn.client.api.impl.TestYarnClient$MockYarnClient.<init>(TestYarnClient.java:504)
	at org.apache.hadoop.yarn.client.api.impl.TestYarnClient.testGetApplicationAttempts(TestYarnClient.java:354)


FAILED:  org.apache.hadoop.yarn.client.api.impl.TestYarnClient.testGetLabelsToNodes

Error Message:
org.apache.hadoop.yarn.api.records.ContainerReport.setNodeHttpAddress(Ljava/lang/String;)V

Stack Trace:
java.lang.AbstractMethodError: org.apache.hadoop.yarn.api.records.ContainerReport.setNodeHttpAddress(Ljava/lang/String;)V
	at org.apache.hadoop.yarn.api.records.ContainerReport.newInstance(ContainerReport.java:71)
	at org.apache.hadoop.yarn.client.api.impl.TestYarnClient$MockYarnClient.createAppReports(TestYarnClient.java:612)
	at org.apache.hadoop.yarn.client.api.impl.TestYarnClient$MockYarnClient.<init>(TestYarnClient.java:504)
	at org.apache.hadoop.yarn.client.api.impl.TestYarnClient.testGetLabelsToNodes(TestYarnClient.java:456)


FAILED:  org.apache.hadoop.yarn.client.api.impl.TestYarnClient.testKillApplication

Error Message:
org.apache.hadoop.yarn.api.records.ContainerReport.setNodeHttpAddress(Ljava/lang/String;)V

Stack Trace:
java.lang.AbstractMethodError: org.apache.hadoop.yarn.api.records.ContainerReport.setNodeHttpAddress(Ljava/lang/String;)V
	at org.apache.hadoop.yarn.api.records.ContainerReport.newInstance(ContainerReport.java:71)
	at org.apache.hadoop.yarn.client.api.impl.TestYarnClient$MockYarnClient.createAppReports(TestYarnClient.java:612)
	at org.apache.hadoop.yarn.client.api.impl.TestYarnClient$MockYarnClient.<init>(TestYarnClient.java:504)
	at org.apache.hadoop.yarn.client.api.impl.TestYarnClient.testKillApplication(TestYarnClient.java:258)


FAILED:  org.apache.hadoop.yarn.client.api.impl.TestYarnClient.testGetApplicationAttempt

Error Message:
org.apache.hadoop.yarn.api.records.ContainerReport.setNodeHttpAddress(Ljava/lang/String;)V

Stack Trace:
java.lang.AbstractMethodError: org.apache.hadoop.yarn.api.records.ContainerReport.setNodeHttpAddress(Ljava/lang/String;)V
	at org.apache.hadoop.yarn.api.records.ContainerReport.newInstance(ContainerReport.java:71)
	at org.apache.hadoop.yarn.client.api.impl.TestYarnClient$MockYarnClient.createAppReports(TestYarnClient.java:612)
	at org.apache.hadoop.yarn.client.api.impl.TestYarnClient$MockYarnClient.<init>(TestYarnClient.java:504)
	at org.apache.hadoop.yarn.client.api.impl.TestYarnClient.testGetApplicationAttempt(TestYarnClient.java:372)


FAILED:  org.apache.hadoop.yarn.client.api.impl.TestYarnClient.testGetContainers

Error Message:
org.apache.hadoop.yarn.api.records.ContainerReport.setNodeHttpAddress(Ljava/lang/String;)V

Stack Trace:
java.lang.AbstractMethodError: org.apache.hadoop.yarn.api.records.ContainerReport.setNodeHttpAddress(Ljava/lang/String;)V
	at org.apache.hadoop.yarn.api.records.ContainerReport.newInstance(ContainerReport.java:71)
	at org.apache.hadoop.yarn.client.api.impl.TestYarnClient$MockYarnClient.createAppReports(TestYarnClient.java:612)
	at org.apache.hadoop.yarn.client.api.impl.TestYarnClient$MockYarnClient.<init>(TestYarnClient.java:504)
	at org.apache.hadoop.yarn.client.api.impl.TestYarnClient.testGetContainers(TestYarnClient.java:396)


FAILED:  org.apache.hadoop.yarn.client.api.impl.TestYarnClient.testSubmitApplication

Error Message:
org.apache.hadoop.yarn.api.records.ContainerReport.setNodeHttpAddress(Ljava/lang/String;)V

Stack Trace:
java.lang.AbstractMethodError: org.apache.hadoop.yarn.api.records.ContainerReport.setNodeHttpAddress(Ljava/lang/String;)V
	at org.apache.hadoop.yarn.api.records.ContainerReport.newInstance(ContainerReport.java:71)
	at org.apache.hadoop.yarn.client.api.impl.TestYarnClient$MockYarnClient.createAppReports(TestYarnClient.java:612)
	at org.apache.hadoop.yarn.client.api.impl.TestYarnClient$MockYarnClient.<init>(TestYarnClient.java:504)
	at org.apache.hadoop.yarn.client.api.impl.TestYarnClient.testSubmitApplication(TestYarnClient.java:153)


FAILED:  org.apache.hadoop.yarn.client.cli.TestYarnCLI.testGetContainerReport

Error Message:
org.apache.hadoop.yarn.api.records.ContainerReport.setNodeHttpAddress(Ljava/lang/String;)V

Stack Trace:
java.lang.AbstractMethodError: org.apache.hadoop.yarn.api.records.ContainerReport.setNodeHttpAddress(Ljava/lang/String;)V
	at org.apache.hadoop.yarn.api.records.ContainerReport.newInstance(ContainerReport.java:71)
	at org.apache.hadoop.yarn.client.cli.TestYarnCLI.testGetContainerReport(TestYarnCLI.java:225)


FAILED:  org.apache.hadoop.yarn.client.cli.TestYarnCLI.testGetContainers

Error Message:
org.apache.hadoop.yarn.api.records.ContainerReport.setNodeHttpAddress(Ljava/lang/String;)V

Stack Trace:
java.lang.AbstractMethodError: org.apache.hadoop.yarn.api.records.ContainerReport.setNodeHttpAddress(Ljava/lang/String;)V
	at org.apache.hadoop.yarn.api.records.ContainerReport.newInstance(ContainerReport.java:71)
	at org.apache.hadoop.yarn.client.cli.TestYarnCLI.testGetContainers(TestYarnCLI.java:262)


REGRESSION:  org.apache.hadoop.yarn.server.resourcemanager.applicationsmanager.TestAMRestart.testRMRestartOrFailoverNotCountedForAMFailures

Error Message:
java.util.zip.ZipException: invalid stored block lengths

Stack Trace:
java.lang.RuntimeException: java.util.zip.ZipException: invalid stored block lengths
	at java.util.zip.InflaterInputStream.read(InflaterInputStream.java:164)
	at java.util.zip.InflaterInputStream.read(InflaterInputStream.java:122)
	at java.io.FilterInputStream.read(FilterInputStream.java:83)
	at org.apache.xerces.impl.XMLEntityManager$RewindableInputStream.read(Unknown Source)
	at org.apache.xerces.impl.XMLEntityManager.setupCurrentEntity(Unknown Source)
	at org.apache.xerces.impl.XMLVersionDetector.determineDocVersion(Unknown Source)
	at org.apache.xerces.parsers.XML11Configuration.parse(Unknown Source)
	at org.apache.xerces.parsers.XML11Configuration.parse(Unknown Source)
	at org.apache.xerces.parsers.XMLParser.parse(Unknown Source)
	at org.apache.xerces.parsers.DOMParser.parse(Unknown Source)
	at org.apache.xerces.jaxp.DocumentBuilderImpl.parse(Unknown Source)
	at javax.xml.parsers.DocumentBuilder.parse(DocumentBuilder.java:150)
	at org.apache.hadoop.conf.Configuration.parse(Configuration.java:2499)
	at org.apache.hadoop.conf.Configuration.parse(Configuration.java:2487)
	at org.apache.hadoop.conf.Configuration.loadResource(Configuration.java:2558)
	at org.apache.hadoop.conf.Configuration.loadResources(Configuration.java:2511)
	at org.apache.hadoop.conf.Configuration.getProps(Configuration.java:2424)
	at org.apache.hadoop.conf.Configuration.set(Configuration.java:1160)
	at org.apache.hadoop.conf.Configuration.set(Configuration.java:1132)
	at org.apache.hadoop.conf.Configuration.setClass(Configuration.java:2289)
	at org.apache.hadoop.yarn.server.resourcemanager.applicationsmanager.TestAMRestart.testRMRestartOrFailoverNotCountedForAMFailures(TestAMRestart.java:537)


REGRESSION:  org.apache.hadoop.yarn.server.resourcemanager.applicationsmanager.TestAMRestart.testPreemptedAMRestartOnRMRestart

Error Message:
java.util.zip.ZipException: invalid stored block lengths

Stack Trace:
java.lang.RuntimeException: java.util.zip.ZipException: invalid stored block lengths
	at java.util.zip.InflaterInputStream.read(InflaterInputStream.java:164)
	at java.util.zip.InflaterInputStream.read(InflaterInputStream.java:122)
	at java.io.FilterInputStream.read(FilterInputStream.java:83)
	at org.apache.xerces.impl.XMLEntityManager$RewindableInputStream.read(Unknown Source)
	at org.apache.xerces.impl.XMLEntityManager.setupCurrentEntity(Unknown Source)
	at org.apache.xerces.impl.XMLVersionDetector.determineDocVersion(Unknown Source)
	at org.apache.xerces.parsers.XML11Configuration.parse(Unknown Source)
	at org.apache.xerces.parsers.XML11Configuration.parse(Unknown Source)
	at org.apache.xerces.parsers.XMLParser.parse(Unknown Source)
	at org.apache.xerces.parsers.DOMParser.parse(Unknown Source)
	at org.apache.xerces.jaxp.DocumentBuilderImpl.parse(Unknown Source)
	at javax.xml.parsers.DocumentBuilder.parse(DocumentBuilder.java:150)
	at org.apache.hadoop.conf.Configuration.parse(Configuration.java:2499)
	at org.apache.hadoop.conf.Configuration.parse(Configuration.java:2487)
	at org.apache.hadoop.conf.Configuration.loadResource(Configuration.java:2558)
	at org.apache.hadoop.conf.Configuration.loadResources(Configuration.java:2511)
	at org.apache.hadoop.conf.Configuration.getProps(Configuration.java:2424)
	at org.apache.hadoop.conf.Configuration.set(Configuration.java:1160)
	at org.apache.hadoop.conf.Configuration.set(Configuration.java:1132)
	at org.apache.hadoop.conf.Configuration.setClass(Configuration.java:2289)
	at org.apache.hadoop.yarn.server.resourcemanager.applicationsmanager.TestAMRestart.testPreemptedAMRestartOnRMRestart(TestAMRestart.java:470)


REGRESSION:  org.apache.hadoop.yarn.server.resourcemanager.applicationsmanager.TestAMRestart.testAMRestartWithExistingContainers

Error Message:
java.util.zip.ZipException: invalid stored block lengths

Stack Trace:
java.lang.RuntimeException: java.util.zip.ZipException: invalid stored block lengths
	at java.util.zip.InflaterInputStream.read(InflaterInputStream.java:164)
	at java.util.zip.InflaterInputStream.read(InflaterInputStream.java:122)
	at java.io.FilterInputStream.read(FilterInputStream.java:83)
	at org.apache.xerces.impl.XMLEntityManager$RewindableInputStream.read(Unknown Source)
	at org.apache.xerces.impl.XMLEntityManager.setupCurrentEntity(Unknown Source)
	at org.apache.xerces.impl.XMLVersionDetector.determineDocVersion(Unknown Source)
	at org.apache.xerces.parsers.XML11Configuration.parse(Unknown Source)
	at org.apache.xerces.parsers.XML11Configuration.parse(Unknown Source)
	at org.apache.xerces.parsers.XMLParser.parse(Unknown Source)
	at org.apache.xerces.parsers.DOMParser.parse(Unknown Source)
	at org.apache.xerces.jaxp.DocumentBuilderImpl.parse(Unknown Source)
	at javax.xml.parsers.DocumentBuilder.parse(DocumentBuilder.java:150)
	at org.apache.hadoop.conf.Configuration.parse(Configuration.java:2499)
	at org.apache.hadoop.conf.Configuration.parse(Configuration.java:2487)
	at org.apache.hadoop.conf.Configuration.loadResource(Configuration.java:2558)
	at org.apache.hadoop.conf.Configuration.loadResources(Configuration.java:2511)
	at org.apache.hadoop.conf.Configuration.getProps(Configuration.java:2424)
	at org.apache.hadoop.conf.Configuration.set(Configuration.java:1160)
	at org.apache.hadoop.conf.Configuration.set(Configuration.java:1132)
	at org.apache.hadoop.conf.Configuration.setInt(Configuration.java:1304)
	at org.apache.hadoop.yarn.server.resourcemanager.applicationsmanager.TestAMRestart.testAMRestartWithExistingContainers(TestAMRestart.java:68)


REGRESSION:  org.apache.hadoop.yarn.server.resourcemanager.applicationsmanager.TestAMRestart.testNMTokensRebindOnAMRestart

Error Message:
java.util.zip.ZipException: invalid stored block lengths

Stack Trace:
java.lang.RuntimeException: java.util.zip.ZipException: invalid stored block lengths
	at java.util.zip.InflaterInputStream.read(InflaterInputStream.java:164)
	at java.util.zip.InflaterInputStream.read(InflaterInputStream.java:122)
	at java.io.FilterInputStream.read(FilterInputStream.java:83)
	at org.apache.xerces.impl.XMLEntityManager$RewindableInputStream.read(Unknown Source)
	at org.apache.xerces.impl.XMLEntityManager.setupCurrentEntity(Unknown Source)
	at org.apache.xerces.impl.XMLVersionDetector.determineDocVersion(Unknown Source)
	at org.apache.xerces.parsers.XML11Configuration.parse(Unknown Source)
	at org.apache.xerces.parsers.XML11Configuration.parse(Unknown Source)
	at org.apache.xerces.parsers.XMLParser.parse(Unknown Source)
	at org.apache.xerces.parsers.DOMParser.parse(Unknown Source)
	at org.apache.xerces.jaxp.DocumentBuilderImpl.parse(Unknown Source)
	at javax.xml.parsers.DocumentBuilder.parse(DocumentBuilder.java:150)
	at org.apache.hadoop.conf.Configuration.parse(Configuration.java:2499)
	at org.apache.hadoop.conf.Configuration.parse(Configuration.java:2487)
	at org.apache.hadoop.conf.Configuration.loadResource(Configuration.java:2558)
	at org.apache.hadoop.conf.Configuration.loadResources(Configuration.java:2511)
	at org.apache.hadoop.conf.Configuration.getProps(Configuration.java:2424)
	at org.apache.hadoop.conf.Configuration.set(Configuration.java:1160)
	at org.apache.hadoop.conf.Configuration.set(Configuration.java:1132)
	at org.apache.hadoop.conf.Configuration.setInt(Configuration.java:1304)
	at org.apache.hadoop.yarn.server.resourcemanager.applicationsmanager.TestAMRestart.testNMTokensRebindOnAMRestart(TestAMRestart.java:260)


REGRESSION:  org.apache.hadoop.yarn.server.resourcemanager.scheduler.fair.TestAllocationFileLoaderService.testGetAllocationFileFromClasspath

Error Message:
null

Stack Trace:
java.lang.AssertionError: null
	at org.junit.Assert.fail(Assert.java:86)
	at org.junit.Assert.assertTrue(Assert.java:41)
	at org.junit.Assert.assertTrue(Assert.java:52)
	at org.apache.hadoop.yarn.server.resourcemanager.scheduler.fair.TestAllocationFileLoaderService.testGetAllocationFileFromClasspath(TestAllocationFileLoaderService.java:66)


REGRESSION:  org.apache.hadoop.yarn.server.resourcemanager.webapp.TestRMWebServicesNodes.testNonexistNodeXML

Error Message:
org/apache/hadoop/yarn/webapp/WebServicesTestUtils

Stack Trace:
java.lang.NoClassDefFoundError: org/apache/hadoop/yarn/webapp/WebServicesTestUtils
	at java.net.URLClassLoader$1.run(URLClassLoader.java:366)
	at java.net.URLClassLoader$1.run(URLClassLoader.java:355)
	at java.security.AccessController.doPrivileged(Native Method)
	at java.net.URLClassLoader.findClass(URLClassLoader.java:354)
	at java.lang.ClassLoader.loadClass(ClassLoader.java:425)
	at sun.misc.Launcher$AppClassLoader.loadClass(Launcher.java:308)
	at java.lang.ClassLoader.loadClass(ClassLoader.java:358)
	at org.apache.hadoop.yarn.server.resourcemanager.webapp.TestRMWebServicesNodes.testNonexistNodeXML(TestRMWebServicesNodes.java:487)


REGRESSION:  org.apache.hadoop.yarn.server.resourcemanager.webapp.TestRMWebServicesNodes.testInvalidNode

Error Message:
org/apache/hadoop/yarn/webapp/WebServicesTestUtils

Stack Trace:
java.lang.NoClassDefFoundError: org/apache/hadoop/yarn/webapp/WebServicesTestUtils
	at org.apache.hadoop.yarn.server.resourcemanager.webapp.TestRMWebServicesNodes.testInvalidNode(TestRMWebServicesNodes.java:529)


REGRESSION:  org.apache.hadoop.yarn.server.resourcemanager.webapp.TestRMWebServicesNodes.testNodes

Error Message:
org/apache/hadoop/yarn/webapp/WebServicesTestUtils

Stack Trace:
java.lang.NoClassDefFoundError: org/apache/hadoop/yarn/webapp/WebServicesTestUtils
	at org.apache.hadoop.yarn.server.resourcemanager.webapp.TestRMWebServicesNodes.verifyNodeInfoGeneric(TestRMWebServicesNodes.java:685)
	at org.apache.hadoop.yarn.server.resourcemanager.webapp.TestRMWebServicesNodes.verifyNodeInfo(TestRMWebServicesNodes.java:662)
	at org.apache.hadoop.yarn.server.resourcemanager.webapp.TestRMWebServicesNodes.testNodesHelper(TestRMWebServicesNodes.java:368)
	at org.apache.hadoop.yarn.server.resourcemanager.webapp.TestRMWebServicesNodes.testNodes(TestRMWebServicesNodes.java:112)


REGRESSION:  org.apache.hadoop.yarn.server.resourcemanager.webapp.TestRMWebServicesNodes.testSingleNodeQueryStateLost

Error Message:
org/apache/hadoop/yarn/webapp/WebServicesTestUtils

Stack Trace:
java.lang.NoClassDefFoundError: org/apache/hadoop/yarn/webapp/WebServicesTestUtils
	at org.apache.hadoop.yarn.server.resourcemanager.webapp.TestRMWebServicesNodes.testSingleNodeQueryStateLost(TestRMWebServicesNodes.java:299)


REGRESSION:  org.apache.hadoop.yarn.server.resourcemanager.webapp.TestRMWebServicesNodes.testSingleNodesXML

Error Message:
org/apache/hadoop/yarn/webapp/WebServicesTestUtils

Stack Trace:
java.lang.NoClassDefFoundError: org/apache/hadoop/yarn/webapp/WebServicesTestUtils
	at org.apache.hadoop.yarn.server.resourcemanager.webapp.TestRMWebServicesNodes.verifyNodesXML(TestRMWebServicesNodes.java:641)
	at org.apache.hadoop.yarn.server.resourcemanager.webapp.TestRMWebServicesNodes.testSingleNodesXML(TestRMWebServicesNodes.java:584)


REGRESSION:  org.apache.hadoop.yarn.server.resourcemanager.webapp.TestRMWebServicesNodes.testSingleNode

Error Message:
org/apache/hadoop/yarn/webapp/WebServicesTestUtils

Stack Trace:
java.lang.NoClassDefFoundError: org/apache/hadoop/yarn/webapp/WebServicesTestUtils
	at org.apache.hadoop.yarn.server.resourcemanager.webapp.TestRMWebServicesNodes.verifyNodeInfoGeneric(TestRMWebServicesNodes.java:685)
	at org.apache.hadoop.yarn.server.resourcemanager.webapp.TestRMWebServicesNodes.verifyNodeInfo(TestRMWebServicesNodes.java:662)
	at org.apache.hadoop.yarn.server.resourcemanager.webapp.TestRMWebServicesNodes.testSingleNodeHelper(TestRMWebServicesNodes.java:404)
	at org.apache.hadoop.yarn.server.resourcemanager.webapp.TestRMWebServicesNodes.testSingleNode(TestRMWebServicesNodes.java:377)


REGRESSION:  org.apache.hadoop.yarn.server.resourcemanager.webapp.TestRMWebServicesNodes.testNodesQueryStateInvalid

Error Message:
org/apache/hadoop/yarn/webapp/WebServicesTestUtils

Stack Trace:
java.lang.NoClassDefFoundError: org/apache/hadoop/yarn/webapp/WebServicesTestUtils
	at org.apache.hadoop.yarn.server.resourcemanager.webapp.TestRMWebServicesNodes.testNodesQueryStateInvalid(TestRMWebServicesNodes.java:227)


REGRESSION:  org.apache.hadoop.yarn.server.resourcemanager.webapp.TestRMWebServicesNodes.testNodesQueryNew

Error Message:
org/apache/hadoop/yarn/webapp/WebServicesTestUtils

Stack Trace:
java.lang.NoClassDefFoundError: org/apache/hadoop/yarn/webapp/WebServicesTestUtils
	at org.apache.hadoop.yarn.server.resourcemanager.webapp.TestRMWebServicesNodes.verifyNodeInfoGeneric(TestRMWebServicesNodes.java:685)
	at org.apache.hadoop.yarn.server.resourcemanager.webapp.TestRMWebServicesNodes.verifyNodeInfo(TestRMWebServicesNodes.java:662)
	at org.apache.hadoop.yarn.server.resourcemanager.webapp.TestRMWebServicesNodes.testNodesQueryNew(TestRMWebServicesNodes.java:184)


REGRESSION:  org.apache.hadoop.yarn.server.resourcemanager.webapp.TestRMWebServicesNodes.testSingleNodeDefault

Error Message:
org/apache/hadoop/yarn/webapp/WebServicesTestUtils

Stack Trace:
java.lang.NoClassDefFoundError: org/apache/hadoop/yarn/webapp/WebServicesTestUtils
	at org.apache.hadoop.yarn.server.resourcemanager.webapp.TestRMWebServicesNodes.verifyNodeInfoGeneric(TestRMWebServicesNodes.java:685)
	at org.apache.hadoop.yarn.server.resourcemanager.webapp.TestRMWebServicesNodes.verifyNodeInfo(TestRMWebServicesNodes.java:662)
	at org.apache.hadoop.yarn.server.resourcemanager.webapp.TestRMWebServicesNodes.testSingleNodeHelper(TestRMWebServicesNodes.java:404)
	at org.apache.hadoop.yarn.server.resourcemanager.webapp.TestRMWebServicesNodes.testSingleNodeDefault(TestRMWebServicesNodes.java:391)


REGRESSION:  org.apache.hadoop.yarn.server.resourcemanager.webapp.TestRMWebServicesNodes.testSingleNodeSlash

Error Message:
org/apache/hadoop/yarn/webapp/WebServicesTestUtils

Stack Trace:
java.lang.NoClassDefFoundError: org/apache/hadoop/yarn/webapp/WebServicesTestUtils
	at org.apache.hadoop.yarn.server.resourcemanager.webapp.TestRMWebServicesNodes.verifyNodeInfoGeneric(TestRMWebServicesNodes.java:685)
	at org.apache.hadoop.yarn.server.resourcemanager.webapp.TestRMWebServicesNodes.verifyNodeInfo(TestRMWebServicesNodes.java:662)
	at org.apache.hadoop.yarn.server.resourcemanager.webapp.TestRMWebServicesNodes.testSingleNodeHelper(TestRMWebServicesNodes.java:404)
	at org.apache.hadoop.yarn.server.resourcemanager.webapp.TestRMWebServicesNodes.testSingleNodeSlash(TestRMWebServicesNodes.java:384)


REGRESSION:  org.apache.hadoop.yarn.server.resourcemanager.webapp.TestRMWebServicesNodes.testNodesSlash

Error Message:
org/apache/hadoop/yarn/webapp/WebServicesTestUtils

Stack Trace:
java.lang.NoClassDefFoundError: org/apache/hadoop/yarn/webapp/WebServicesTestUtils
	at org.apache.hadoop.yarn.server.resourcemanager.webapp.TestRMWebServicesNodes.verifyNodeInfoGeneric(TestRMWebServicesNodes.java:685)
	at org.apache.hadoop.yarn.server.resourcemanager.webapp.TestRMWebServicesNodes.verifyNodeInfo(TestRMWebServicesNodes.java:662)
	at org.apache.hadoop.yarn.server.resourcemanager.webapp.TestRMWebServicesNodes.testNodesHelper(TestRMWebServicesNodes.java:368)
	at org.apache.hadoop.yarn.server.resourcemanager.webapp.TestRMWebServicesNodes.testNodesSlash(TestRMWebServicesNodes.java:117)


REGRESSION:  org.apache.hadoop.yarn.server.resourcemanager.webapp.TestRMWebServicesNodes.testNodesQueryStateLost

Error Message:
org/apache/hadoop/yarn/webapp/WebServicesTestUtils

Stack Trace:
java.lang.NoClassDefFoundError: org/apache/hadoop/yarn/webapp/WebServicesTestUtils
	at org.apache.hadoop.yarn.server.resourcemanager.webapp.TestRMWebServicesNodes.testNodesQueryStateLost(TestRMWebServicesNodes.java:268)


REGRESSION:  org.apache.hadoop.yarn.server.resourcemanager.webapp.TestRMWebServicesNodes.testNodesXML

Error Message:
org/apache/hadoop/yarn/webapp/WebServicesTestUtils

Stack Trace:
java.lang.NoClassDefFoundError: org/apache/hadoop/yarn/webapp/WebServicesTestUtils
	at org.apache.hadoop.yarn.server.resourcemanager.webapp.TestRMWebServicesNodes.verifyNodesXML(TestRMWebServicesNodes.java:641)
	at org.apache.hadoop.yarn.server.resourcemanager.webapp.TestRMWebServicesNodes.testNodesXML(TestRMWebServicesNodes.java:560)


REGRESSION:  org.apache.hadoop.yarn.server.resourcemanager.webapp.TestRMWebServicesNodes.testNodesDefault

Error Message:
org/apache/hadoop/yarn/webapp/WebServicesTestUtils

Stack Trace:
java.lang.NoClassDefFoundError: org/apache/hadoop/yarn/webapp/WebServicesTestUtils
	at org.apache.hadoop.yarn.server.resourcemanager.webapp.TestRMWebServicesNodes.verifyNodeInfoGeneric(TestRMWebServicesNodes.java:685)
	at org.apache.hadoop.yarn.server.resourcemanager.webapp.TestRMWebServicesNodes.verifyNodeInfo(TestRMWebServicesNodes.java:662)
	at org.apache.hadoop.yarn.server.resourcemanager.webapp.TestRMWebServicesNodes.testNodesHelper(TestRMWebServicesNodes.java:368)
	at org.apache.hadoop.yarn.server.resourcemanager.webapp.TestRMWebServicesNodes.testNodesDefault(TestRMWebServicesNodes.java:122)



Failed: YARN-2368 PreCommit Build #6904

Posted by Apache Jenkins Server <je...@builds.apache.org>.
Jira: https://issues.apache.org/jira/browse/YARN-2368
Build: https://builds.apache.org/job/PreCommit-YARN-Build/6904/

###################################################################################
########################## LAST 60 LINES OF THE CONSOLE ###########################
[...truncated 3735 lines...]
    {color:green}+1 javadoc{color}.  There were no new javadoc warning messages.

    {color:green}+1 eclipse:eclipse{color}.  The patch built with eclipse:eclipse.

    {color:red}-1 findbugs{color}.  The patch appears to introduce 5 new Findbugs (version 2.0.3) warnings.

    {color:green}+1 release audit{color}.  The applied patch does not increase the total number of release audit warnings.

    {color:red}-1 core tests{color}.  The patch failed these unit tests in hadoop-yarn-project/hadoop-yarn/hadoop-yarn-api hadoop-yarn-project/hadoop-yarn/hadoop-yarn-common hadoop-yarn-project/hadoop-yarn/hadoop-yarn-server/hadoop-yarn-server-resourcemanager:

                  org.apache.hadoop.yarn.server.resourcemanager.scheduler.capacity.TestContainerAllocation

Test results: https://builds.apache.org/job/PreCommit-YARN-Build/6904//testReport/
Findbugs warnings: https://builds.apache.org/job/PreCommit-YARN-Build/6904//artifact/patchprocess/newPatchFindbugsWarningshadoop-yarn-server-resourcemanager.html
Console output: https://builds.apache.org/job/PreCommit-YARN-Build/6904//console

This message is automatically generated.


======================================================================
======================================================================
    Adding comment to Jira.
======================================================================
======================================================================


Comment added.
d3c8ac626c9c432156e58a84ca4bfa1b67249bf1 logged out


======================================================================
======================================================================
    Finished build.
======================================================================
======================================================================


Build step 'Execute shell' marked build as failure
Archiving artifacts
Sending artifact delta relative to PreCommit-YARN-Build #6896
ERROR: Failed to archive {patchprocess/patchJavacWarnings.txt=patchprocess/patchJavacWarnings.txt, patchprocess/patchJavadocWarnings.txt=patchprocess/patchJavadocWarnings.txt, patchprocess/newPatchFindbugsWarningshadoop-yarn-server-resourcemanager.xml=patchprocess/newPatchFindbugsWarningshadoop-yarn-server-resourcemanager.xml, patchprocess/trunkJavadocWarnings.txt=patchprocess/trunkJavadocWarnings.txt, patchprocess/patchFindbugsWarningshadoop-yarn-common.xml=patchprocess/patchFindbugsWarningshadoop-yarn-common.xml, patchprocess/patchFindbugsWarningshadoop-yarn-api.xml=patchprocess/patchFindbugsWarningshadoop-yarn-api.xml, patchprocess/diffJavadocWarnings.txt=patchprocess/diffJavadocWarnings.txt, patchprocess/testrun_hadoop-yarn-api.txt=patchprocess/testrun_hadoop-yarn-api.txt, patchprocess/patchFindBugsOutputhadoop-yarn-server-resourcemanager.txt=patchprocess/patchFindBugsOutputhadoop-yarn-server-resourcemanager.txt, patchprocess/newPatchFindbugsWarningshadoop-yarn-common.xml=patchprocess/newPatchFindbugsWarningshadoop-yarn-common.xml, patchprocess/trunkJavacWarnings.txt=patchprocess/trunkJavacWarnings.txt, patchprocess/newPatchFindbugsWarningshadoop-yarn-server-resourcemanager.html=patchprocess/newPatchFindbugsWarningshadoop-yarn-server-resourcemanager.html, patchprocess/testrun_hadoop-yarn-server-resourcemanager.txt=patchprocess/testrun_hadoop-yarn-server-resourcemanager.txt, patchprocess/patchReleaseAuditOutput.txt=patchprocess/patchReleaseAuditOutput.txt, patchprocess/patchReleaseAuditWarnings.txt=patchprocess/patchReleaseAuditWarnings.txt, patchprocess/filteredPatchJavacWarnings.txt=patchprocess/filteredPatchJavacWarnings.txt, patchprocess/patchFindbugsWarningshadoop-yarn-server-resourcemanager.xml=patchprocess/patchFindbugsWarningshadoop-yarn-server-resourcemanager.xml, patchprocess/newPatchFindbugsWarningshadoop-yarn-common.html=patchprocess/newPatchFindbugsWarningshadoop-yarn-common.html, patchprocess/testrun_hadoop-yarn-common.txt=patchprocess/testrun_hadoop-yarn-common.txt, patchprocess/patchEclipseOutput.txt=patchprocess/patchEclipseOutput.txt, patchprocess/newPatchFindbugsWarningshadoop-yarn-api.html=patchprocess/newPatchFindbugsWarningshadoop-yarn-api.html, patchprocess/newPatchFindbugsWarningshadoop-yarn-api.xml=patchprocess/newPatchFindbugsWarningshadoop-yarn-api.xml, patchprocess/patchFindBugsOutputhadoop-yarn-api.txt=patchprocess/patchFindBugsOutputhadoop-yarn-api.txt, patchprocess/filteredTrunkJavacWarnings.txt=patchprocess/filteredTrunkJavacWarnings.txt, patchprocess/patchFindBugsOutputhadoop-yarn-common.txt=patchprocess/patchFindBugsOutputhadoop-yarn-common.txt} due to internal error; falling back to full archiving
java.lang.IllegalStateException: checksum mismatch after transfer (6577874794637500483 vs. 3109086039); /x1/jenkins/jenkins-home/jobs/PreCommit-YARN-Build/builds/2015-03-10_19-49-59/archive/patchprocess/patchJavadocWarnings.txt may be corrupted
	at jsync.protocol.FileSequenceReader.read(FileSequenceReader.java:45)
	at com.cloudbees.jenkins.plugins.jsync.archiver.JSyncArtifactManager.remoteSync(JSyncArtifactManager.java:145)
	at com.cloudbees.jenkins.plugins.jsync.archiver.JSyncArtifactManager.archive(JSyncArtifactManager.java:68)
	at hudson.tasks.ArtifactArchiver.perform(ArtifactArchiver.java:140)
	at hudson.tasks.BuildStepMonitor$1.perform(BuildStepMonitor.java:20)
	at hudson.model.AbstractBuild$AbstractBuildExecution.perform(AbstractBuild.java:756)
	at hudson.model.AbstractBuild$AbstractBuildExecution.performAllBuildSteps(AbstractBuild.java:720)
	at hudson.model.Build$BuildExecution.post2(Build.java:182)
	at hudson.model.AbstractBuild$AbstractBuildExecution.post(AbstractBuild.java:669)
	at hudson.model.Run.execute(Run.java:1731)
	at hudson.model.FreeStyleBuild.run(FreeStyleBuild.java:43)
	at hudson.model.ResourceController.execute(ResourceController.java:88)
	at hudson.model.Executor.run(Executor.java:232)
Description set: MAPREDUCE-4815
Recording test results
Email was triggered for: Failure
Sending email for trigger: Failure



###################################################################################
############################## FAILED TESTS (if any) ##############################
1 tests failed.
REGRESSION:  org.apache.hadoop.yarn.server.resourcemanager.scheduler.capacity.TestContainerAllocation.testAMContainerAllocationWhenDNSUnavailable

Error Message:
test timed out after 30000 milliseconds

Stack Trace:
java.lang.Exception: test timed out after 30000 milliseconds
	at java.lang.Thread.sleep(Native Method)
	at org.apache.hadoop.yarn.server.resourcemanager.MockRM.waitForState(MockRM.java:131)
	at org.apache.hadoop.yarn.server.resourcemanager.MockRM.launchAndRegisterAM(MockRM.java:669)
	at org.apache.hadoop.yarn.server.resourcemanager.scheduler.capacity.TestContainerAllocation.testAMContainerAllocationWhenDNSUnavailable(TestContainerAllocation.java:322)



Failed: YARN-3243 PreCommit Build #6903

Posted by Apache Jenkins Server <je...@builds.apache.org>.
Jira: https://issues.apache.org/jira/browse/YARN-3243
Build: https://builds.apache.org/job/PreCommit-YARN-Build/6903/

###################################################################################
########################## LAST 60 LINES OF THE CONSOLE ###########################
[...truncated 3510 lines...]
    {color:green}+1 @author{color}.  The patch does not contain any @author tags.

    {color:green}+1 tests included{color}.  The patch appears to include 7 new or modified test files.

    {color:green}+1 javac{color}.  The applied patch does not increase the total number of javac compiler warnings.

    {color:green}+1 javadoc{color}.  There were no new javadoc warning messages.

    {color:green}+1 eclipse:eclipse{color}.  The patch built with eclipse:eclipse.

    {color:red}-1 findbugs{color}.  The patch appears to introduce 5 new Findbugs (version 2.0.3) warnings.

    {color:green}+1 release audit{color}.  The applied patch does not increase the total number of release audit warnings.

    {color:red}-1 core tests{color}.  The patch failed these unit tests in hadoop-yarn-project/hadoop-yarn/hadoop-yarn-server/hadoop-yarn-server-resourcemanager:

                  org.apache.hadoop.yarn.server.resourcemanager.TestWorkPreservingRMRestart

                                      The following test timeouts occurred in hadoop-yarn-project/hadoop-yarn/hadoop-yarn-server/hadoop-yarn-server-resourcemanager:

org.apache.hadoop.yarn.server.resourcemanager.TestRMRestart

Test results: https://builds.apache.org/job/PreCommit-YARN-Build/6903//testReport/
Findbugs warnings: https://builds.apache.org/job/PreCommit-YARN-Build/6903//artifact/patchprocess/newPatchFindbugsWarningshadoop-yarn-server-resourcemanager.html
Console output: https://builds.apache.org/job/PreCommit-YARN-Build/6903//console

This message is automatically generated.


======================================================================
======================================================================
    Adding comment to Jira.
======================================================================
======================================================================


Comment added.
1c584bb3af23011b4e5bf2d524e9298cd9ec7653 logged out


======================================================================
======================================================================
    Finished build.
======================================================================
======================================================================


Build step 'Execute shell' marked build as failure
Archiving artifacts
Sending artifact delta relative to PreCommit-YARN-Build #6896
Archived 15 artifacts
Archive block size is 32768
Received 222 blocks and 1808402 bytes
Compression is 80.1%
Took 2.2 sec
Description set: MAPREDUCE-4815
Recording test results
Email was triggered for: Failure
Sending email for trigger: Failure



###################################################################################
############################## FAILED TESTS (if any) ##############################
1 tests failed.
REGRESSION:  org.apache.hadoop.yarn.server.resourcemanager.TestWorkPreservingRMRestart.testSchedulerRecovery[0]

Error Message:
expected:<<memory:6144, vCores:6>> but was:<<memory:0, vCores:-2>>

Stack Trace:
java.lang.AssertionError: expected:<<memory:6144, vCores:6>> but was:<<memory:0, vCores:-2>>
	at org.junit.Assert.fail(Assert.java:88)
	at org.junit.Assert.failNotEquals(Assert.java:743)
	at org.junit.Assert.assertEquals(Assert.java:118)
	at org.junit.Assert.assertEquals(Assert.java:144)
	at org.apache.hadoop.yarn.server.resourcemanager.TestWorkPreservingRMRestart.checkCSQueue(TestWorkPreservingRMRestart.java:269)
	at org.apache.hadoop.yarn.server.resourcemanager.TestWorkPreservingRMRestart.testSchedulerRecovery(TestWorkPreservingRMRestart.java:238)



Failed: YARN-3187 PreCommit Build #6902

Posted by Apache Jenkins Server <je...@builds.apache.org>.
Jira: https://issues.apache.org/jira/browse/YARN-3187
Build: https://builds.apache.org/job/PreCommit-YARN-Build/6902/

###################################################################################
########################## LAST 60 LINES OF THE CONSOLE ###########################
[...truncated 3123 lines...]


{color:green}+1 overall{color}.  Here are the results of testing the latest attachment 
  http://issues.apache.org/jira/secure/attachment/12703641/YARN-3187.4.patch
  against trunk revision 20b8ee1.

    {color:green}+1 @author{color}.  The patch does not contain any @author tags.

    {color:green}+0 tests included{color}.  The patch appears to be a documentation patch that doesn't require tests.

    {color:green}+1 javac{color}.  The applied patch does not increase the total number of javac compiler warnings.

    {color:green}+1 javadoc{color}.  There were no new javadoc warning messages.

    {color:green}+1 eclipse:eclipse{color}.  The patch built with eclipse:eclipse.

    {color:green}+1 findbugs{color}.  The patch does not introduce any new Findbugs (version 2.0.3) warnings.

    {color:green}+1 release audit{color}.  The applied patch does not increase the total number of release audit warnings.

    {color:green}+1 core tests{color}.  The patch passed unit tests in .

Test results: https://builds.apache.org/job/PreCommit-YARN-Build/6902//testReport/
Console output: https://builds.apache.org/job/PreCommit-YARN-Build/6902//console

This message is automatically generated.


======================================================================
======================================================================
    Adding comment to Jira.
======================================================================
======================================================================


Comment added.
81264b191d88a7dd0b4e991c134eabf3600dd60f logged out


======================================================================
======================================================================
    Finished build.
======================================================================
======================================================================


Archiving artifacts
Sending artifact delta relative to PreCommit-YARN-Build #6896
Archived 10 artifacts
Archive block size is 32768
Received 55 blocks and 6931929 bytes
Compression is 20.6%
Took 3.4 sec
Description set: YARN-3187
Recording test results
No test report files were found. Configuration error?
Build step 'Publish JUnit test result report' changed build result to FAILURE
Email was triggered for: Failure
Sending email for trigger: Failure



###################################################################################
############################## FAILED TESTS (if any) ##############################
No tests ran.

Failed: YARN-3326 PreCommit Build #6901

Posted by Apache Jenkins Server <je...@builds.apache.org>.
Jira: https://issues.apache.org/jira/browse/YARN-3326
Build: https://builds.apache.org/job/PreCommit-YARN-Build/6901/

###################################################################################
########################## LAST 60 LINES OF THE CONSOLE ###########################
[...truncated 4254 lines...]
{color:red}-1 overall{color}.  Here are the results of testing the latest attachment 
  http://issues.apache.org/jira/secure/attachment/12703640/YARN-3326.20150310-1.patch
  against trunk revision 7711049.

    {color:green}+1 @author{color}.  The patch does not contain any @author tags.

    {color:green}+1 tests included{color}.  The patch appears to include 1 new or modified test files.

    {color:green}+1 javac{color}.  The applied patch does not increase the total number of javac compiler warnings.

    {color:green}+1 javadoc{color}.  There were no new javadoc warning messages.

    {color:green}+1 eclipse:eclipse{color}.  The patch built with eclipse:eclipse.

    {color:red}-1 findbugs{color}.  The patch appears to introduce 5 new Findbugs (version 2.0.3) warnings.

    {color:green}+1 release audit{color}.  The applied patch does not increase the total number of release audit warnings.

    {color:red}-1 core tests{color}.  The patch failed these unit tests in hadoop-yarn-project/hadoop-yarn/hadoop-yarn-server/hadoop-yarn-server-resourcemanager:

                  org.apache.hadoop.yarn.server.resourcemanager.TestRM

Test results: https://builds.apache.org/job/PreCommit-YARN-Build/6901//testReport/
Findbugs warnings: https://builds.apache.org/job/PreCommit-YARN-Build/6901//artifact/patchprocess/newPatchFindbugsWarningshadoop-yarn-server-resourcemanager.html
Console output: https://builds.apache.org/job/PreCommit-YARN-Build/6901//console

This message is automatically generated.


======================================================================
======================================================================
    Adding comment to Jira.
======================================================================
======================================================================


Comment added.
1ba02704f0dd613839aecc48a5e9ed9308a9cf47 logged out


======================================================================
======================================================================
    Finished build.
======================================================================
======================================================================


Build step 'Execute shell' marked build as failure
Archiving artifacts
Sending artifact delta relative to PreCommit-YARN-Build #6896
Archived 15 artifacts
Archive block size is 32768
Received 54 blocks and 7366425 bytes
Compression is 19.4%
Took 2 sec
[description-setter] Could not determine description.
Recording test results
Email was triggered for: Failure
Sending email for trigger: Failure



###################################################################################
############################## FAILED TESTS (if any) ##############################
1 tests failed.
REGRESSION:  org.apache.hadoop.yarn.server.resourcemanager.TestRM.testAppOnMultiNode[1]

Error Message:
test timed out after 30000 milliseconds

Stack Trace:
java.lang.Exception: test timed out after 30000 milliseconds
	at java.net.Inet4AddressImpl.lookupAllHostAddr(Native Method)
	at java.net.InetAddress$1.lookupAllHostAddr(InetAddress.java:901)
	at java.net.InetAddress.getAddressesFromNameService(InetAddress.java:1293)
	at java.net.InetAddress.getAllByName0(InetAddress.java:1246)
	at java.net.InetAddress.getAllByName(InetAddress.java:1162)
	at java.net.InetAddress.getAllByName(InetAddress.java:1098)
	at java.net.InetAddress.getByName(InetAddress.java:1048)
	at org.apache.hadoop.net.NetUtils.normalizeHostName(NetUtils.java:563)
	at org.apache.hadoop.yarn.server.resourcemanager.NodesListManager.isValidNode(NodesListManager.java:147)
	at org.apache.hadoop.yarn.server.resourcemanager.ResourceTrackerService.nodeHeartbeat(ResourceTrackerService.java:367)
	at org.apache.hadoop.yarn.server.resourcemanager.MockNM.nodeHeartbeat(MockNM.java:178)
	at org.apache.hadoop.yarn.server.resourcemanager.MockNM.nodeHeartbeat(MockNM.java:136)
	at org.apache.hadoop.yarn.server.resourcemanager.TestRM.testAppOnMultiNode(TestRM.java:187)