You are viewing a plain text version of this content. The canonical link for it is here.
Posted to dev@jclouds.apache.org by je...@cloudbees.com on 2014/01/03 00:10:38 UTC
Build failed in Jenkins: jclouds-karaf-1.7.x-branch #88
See <https://jclouds.ci.cloudbees.com/job/jclouds-karaf-1.7.x-branch/88/>
------------------------------------------
[...truncated 1901 lines...]
at java.lang.Thread.run(Thread.java:662)
Caused by: java.lang.ClassNotFoundException: org.apache.maven.shared.filtering.MavenFilteringException
at org.codehaus.plexus.classworlds.strategy.SelfFirstStrategy.loadClass(SelfFirstStrategy.java:50)
at org.codehaus.plexus.classworlds.realm.ClassRealm.loadClass(ClassRealm.java:244)
at org.codehaus.plexus.classworlds.realm.ClassRealm.loadClass(ClassRealm.java:230)
... 66 more
[pool-1-thread-1] INFO hudson.maven.Maven3Builder$MavenExecutionListener - ------------------------------------------------------------------------
[pool-1-thread-1] INFO hudson.maven.Maven3Builder$MavenExecutionListener - Reactor Summary:
[pool-1-thread-1] INFO hudson.maven.Maven3Builder$MavenExecutionListener -
[pool-1-thread-1] INFO hudson.maven.Maven3Builder$MavenExecutionListener - Apache jclouds :: Karaf ........................... SUCCESS [5:17.629s]
[pool-1-thread-1] INFO hudson.maven.Maven3Builder$MavenExecutionListener - jclouds :: Karaf :: Core .......................... FAILURE [1:27.104s]
[pool-1-thread-1] INFO hudson.maven.Maven3Builder$MavenExecutionListener - jclouds :: Karaf :: Utils ......................... SKIPPED
[pool-1-thread-1] INFO hudson.maven.Maven3Builder$MavenExecutionListener - jclouds :: Karaf :: Recipe ........................ SKIPPED
[pool-1-thread-1] INFO hudson.maven.Maven3Builder$MavenExecutionListener - jclouds :: Karaf :: Cache ......................... SKIPPED
[pool-1-thread-1] INFO hudson.maven.Maven3Builder$MavenExecutionListener - jclouds :: Karaf :: Services ...................... SKIPPED
[pool-1-thread-1] INFO hudson.maven.Maven3Builder$MavenExecutionListener - jclouds :: Karaf :: Commands ...................... SKIPPED
[pool-1-thread-1] INFO hudson.maven.Maven3Builder$MavenExecutionListener - jclouds :: Karaf :: URL Handler ................... SKIPPED
[pool-1-thread-1] INFO hudson.maven.Maven3Builder$MavenExecutionListener - jclouds :: Karaf :: Chef .......................... SKIPPED
[pool-1-thread-1] INFO hudson.maven.Maven3Builder$MavenExecutionListener - jclouds :: Karaf :: Chef :: Core .................. SKIPPED
[pool-1-thread-1] INFO hudson.maven.Maven3Builder$MavenExecutionListener - jclouds :: Karaf :: Chef :: Services .............. SKIPPED
[pool-1-thread-1] INFO hudson.maven.Maven3Builder$MavenExecutionListener - jclouds :: Karaf :: Chef :: Commands .............. SKIPPED
[pool-1-thread-1] INFO hudson.maven.Maven3Builder$MavenExecutionListener - jclouds :: Karaf :: Chef :: Cache ................. SKIPPED
[pool-1-thread-1] INFO hudson.maven.Maven3Builder$MavenExecutionListener - jclouds :: Karaf :: Feature ....................... SKIPPED
[pool-1-thread-1] INFO hudson.maven.Maven3Builder$MavenExecutionListener - jclouds :: Karaf :: Integration Tests ............. SKIPPED
[pool-1-thread-1] INFO hudson.maven.Maven3Builder$MavenExecutionListener - ------------------------------------------------------------------------
[pool-1-thread-1] INFO hudson.maven.Maven3Builder$MavenExecutionListener - BUILD FAILURE
[pool-1-thread-1] INFO hudson.maven.Maven3Builder$MavenExecutionListener - ------------------------------------------------------------------------
[pool-1-thread-1] INFO hudson.maven.Maven3Builder$MavenExecutionListener - Total time: 8:47.019s
[pool-1-thread-1] INFO hudson.maven.Maven3Builder$MavenExecutionListener - Finished at: Thu Jan 02 18:10:20 EST 2014
[Unloading class sun.reflect.GeneratedSerializationConstructorAccessor35]
[Unloading class sun.reflect.GeneratedSerializationConstructorAccessor41]
[Unloading class sun.reflect.GeneratedSerializationConstructorAccessor47]
[Unloading class sun.reflect.GeneratedSerializationConstructorAccessor58]
[Unloading class sun.reflect.GeneratedSerializationConstructorAccessor44]
[Unloading class sun.reflect.GeneratedSerializationConstructorAccessor57]
[Unloading class sun.reflect.GeneratedSerializationConstructorAccessor59]
[Unloading class sun.reflect.GeneratedSerializationConstructorAccessor51]
[Unloading class sun.reflect.GeneratedSerializationConstructorAccessor60]
[Unloading class sun.reflect.GeneratedSerializationConstructorAccessor37]
[Unloading class sun.reflect.GeneratedSerializationConstructorAccessor40]
[Unloading class sun.reflect.GeneratedSerializationConstructorAccessor54]
[Unloading class sun.reflect.GeneratedConstructorAccessor5]
[Unloading class sun.reflect.GeneratedSerializationConstructorAccessor53]
[Unloading class sun.reflect.GeneratedConstructorAccessor8]
[Unloading class sun.reflect.GeneratedSerializationConstructorAccessor48]
[Unloading class sun.reflect.GeneratedSerializationConstructorAccessor62]
[Unloading class sun.reflect.GeneratedSerializationConstructorAccessor34]
[Unloading class sun.reflect.GeneratedSerializationConstructorAccessor61]
[Unloading class sun.reflect.GeneratedSerializationConstructorAccessor33]
[Unloading class sun.reflect.GeneratedSerializationConstructorAccessor1]
[Unloading class sun.reflect.GeneratedSerializationConstructorAccessor29]
[Unloading class sun.reflect.GeneratedSerializationConstructorAccessor46]
[Unloading class sun.reflect.GeneratedConstructorAccessor6]
[Unloading class sun.reflect.GeneratedSerializationConstructorAccessor50]
[Unloading class sun.reflect.GeneratedSerializationConstructorAccessor63]
[Unloading class sun.reflect.GeneratedSerializationConstructorAccessor38]
[Unloading class sun.reflect.GeneratedSerializationConstructorAccessor39]
[Unloading class sun.reflect.GeneratedSerializationConstructorAccessor31]
[Unloading class sun.reflect.GeneratedSerializationConstructorAccessor49]
[Unloading class sun.reflect.GeneratedSerializationConstructorAccessor52]
[Unloading class sun.reflect.GeneratedSerializationConstructorAccessor45]
[Unloading class sun.reflect.GeneratedSerializationConstructorAccessor42]
[Unloading class sun.reflect.GeneratedSerializationConstructorAccessor56]
[Unloading class sun.reflect.GeneratedSerializationConstructorAccessor43]
[Unloading class sun.reflect.GeneratedSerializationConstructorAccessor36]
[Unloading class sun.reflect.GeneratedSerializationConstructorAccessor30]
[Unloading class sun.reflect.GeneratedSerializationConstructorAccessor55]
[Unloading class sun.reflect.GeneratedSerializationConstructorAccessor26]
[pool-1-thread-1] INFO hudson.maven.Maven3Builder$MavenExecutionListener - Final Memory: 18M/34M
[pool-1-thread-1] INFO hudson.maven.Maven3Builder$MavenExecutionListener - ------------------------------------------------------------------------
[JENKINS] Archiving <https://jclouds.ci.cloudbees.com/job/jclouds-karaf-1.7.x-branch/ws/utils/pom.xml> to /home/jclouds/hudson_home/jobs/jclouds-karaf-1.7.x-branch/modules/org.apache.jclouds.karaf$utils/builds/2014-01-02_23-01-25/archive/org.apache.jclouds.karaf/utils/1.7.1-SNAPSHOT/utils-1.7.1-SNAPSHOT.pom
[JENKINS] Archiving <https://jclouds.ci.cloudbees.com/job/jclouds-karaf-1.7.x-branch/ws/cache/pom.xml> to /home/jclouds/hudson_home/jobs/jclouds-karaf-1.7.x-branch/modules/org.apache.jclouds.karaf$cache/builds/2014-01-02_23-01-25/archive/org.apache.jclouds.karaf/cache/1.7.1-SNAPSHOT/cache-1.7.1-SNAPSHOT.pom
[JENKINS] Archiving <https://jclouds.ci.cloudbees.com/job/jclouds-karaf-1.7.x-branch/ws/chef/commands/pom.xml> to /home/jclouds/hudson_home/jobs/jclouds-karaf-1.7.x-branch/modules/org.apache.jclouds.karaf.chef$commands/builds/2014-01-02_23-01-25/archive/org.apache.jclouds.karaf.chef/commands/1.7.1-SNAPSHOT/commands-1.7.1-SNAPSHOT.pom
[JENKINS] Archiving <https://jclouds.ci.cloudbees.com/job/jclouds-karaf-1.7.x-branch/ws/recipe/pom.xml> to /home/jclouds/hudson_home/jobs/jclouds-karaf-1.7.x-branch/modules/org.apache.jclouds.karaf$recipe/builds/2014-01-02_23-01-25/archive/org.apache.jclouds.karaf/recipe/1.7.1-SNAPSHOT/recipe-1.7.1-SNAPSHOT.pom
[JENKINS] Archiving <https://jclouds.ci.cloudbees.com/job/jclouds-karaf-1.7.x-branch/ws/feature/pom.xml> to /home/jclouds/hudson_home/jobs/jclouds-karaf-1.7.x-branch/modules/org.apache.jclouds.karaf$jclouds-karaf/builds/2014-01-02_23-01-25/archive/org.apache.jclouds.karaf/jclouds-karaf/1.7.1-SNAPSHOT/jclouds-karaf-1.7.1-SNAPSHOT.pom
[JENKINS] Archiving <https://jclouds.ci.cloudbees.com/job/jclouds-karaf-1.7.x-branch/ws/commands/pom.xml> to /home/jclouds/hudson_home/jobs/jclouds-karaf-1.7.x-branch/modules/org.apache.jclouds.karaf$commands/builds/2014-01-02_23-01-25/archive/org.apache.jclouds.karaf/commands/1.7.1-SNAPSHOT/commands-1.7.1-SNAPSHOT.pom
[JENKINS] Archiving <https://jclouds.ci.cloudbees.com/job/jclouds-karaf-1.7.x-branch/ws/itests/pom.xml> to /home/jclouds/hudson_home/jobs/jclouds-karaf-1.7.x-branch/modules/org.apache.jclouds.karaf$itests/builds/2014-01-02_23-01-25/archive/org.apache.jclouds.karaf/itests/1.7.1-SNAPSHOT/itests-1.7.1-SNAPSHOT.pom
[JENKINS] Archiving <https://jclouds.ci.cloudbees.com/job/jclouds-karaf-1.7.x-branch/ws/urlhandler/pom.xml> to /home/jclouds/hudson_home/jobs/jclouds-karaf-1.7.x-branch/modules/org.apache.jclouds.karaf$urlhandler/builds/2014-01-02_23-01-25/archive/org.apache.jclouds.karaf/urlhandler/1.7.1-SNAPSHOT/urlhandler-1.7.1-SNAPSHOT.pom
[JENKINS] Archiving <https://jclouds.ci.cloudbees.com/job/jclouds-karaf-1.7.x-branch/ws/services/pom.xml> to /home/jclouds/hudson_home/jobs/jclouds-karaf-1.7.x-branch/modules/org.apache.jclouds.karaf$services/builds/2014-01-02_23-01-25/archive/org.apache.jclouds.karaf/services/1.7.1-SNAPSHOT/services-1.7.1-SNAPSHOT.pom
[JENKINS] Archiving <https://jclouds.ci.cloudbees.com/job/jclouds-karaf-1.7.x-branch/ws/chef/core/pom.xml> to /home/jclouds/hudson_home/jobs/jclouds-karaf-1.7.x-branch/modules/org.apache.jclouds.karaf.chef$core/builds/2014-01-02_23-01-25/archive/org.apache.jclouds.karaf.chef/core/1.7.1-SNAPSHOT/core-1.7.1-SNAPSHOT.pom
[JENKINS] Archiving <https://jclouds.ci.cloudbees.com/job/jclouds-karaf-1.7.x-branch/ws/chef/services/pom.xml> to /home/jclouds/hudson_home/jobs/jclouds-karaf-1.7.x-branch/modules/org.apache.jclouds.karaf.chef$services/builds/2014-01-02_23-01-25/archive/org.apache.jclouds.karaf.chef/services/1.7.1-SNAPSHOT/services-1.7.1-SNAPSHOT.pom
[JENKINS] Archiving <https://jclouds.ci.cloudbees.com/job/jclouds-karaf-1.7.x-branch/ws/chef/pom.xml> to /home/jclouds/hudson_home/jobs/jclouds-karaf-1.7.x-branch/modules/org.apache.jclouds.karaf$chef/builds/2014-01-02_23-01-25/archive/org.apache.jclouds.karaf/chef/1.7.1-SNAPSHOT/chef-1.7.1-SNAPSHOT.pom
[JENKINS] Archiving <https://jclouds.ci.cloudbees.com/job/jclouds-karaf-1.7.x-branch/ws/pom.xml> to /home/jclouds/hudson_home/jobs/jclouds-karaf-1.7.x-branch/modules/org.apache.jclouds$jclouds-karaf/builds/2014-01-02_23-01-25/archive/org.apache.jclouds/jclouds-karaf/1.7.1-SNAPSHOT/jclouds-karaf-1.7.1-SNAPSHOT.pom
[JENKINS] Archiving <https://jclouds.ci.cloudbees.com/job/jclouds-karaf-1.7.x-branch/ws/core/pom.xml> to /home/jclouds/hudson_home/jobs/jclouds-karaf-1.7.x-branch/modules/org.apache.jclouds.karaf$core/builds/2014-01-02_23-01-25/archive/org.apache.jclouds.karaf/core/1.7.1-SNAPSHOT/core-1.7.1-SNAPSHOT.pom
[JENKINS] Archiving <https://jclouds.ci.cloudbees.com/job/jclouds-karaf-1.7.x-branch/ws/chef/cache/pom.xml> to /home/jclouds/hudson_home/jobs/jclouds-karaf-1.7.x-branch/modules/org.apache.jclouds.karaf.chef$cache/builds/2014-01-02_23-01-25/archive/org.apache.jclouds.karaf.chef/cache/1.7.1-SNAPSHOT/cache-1.7.1-SNAPSHOT.pom
[pool-1-thread-1] INFO org.apache.maven.cli.event.ExecutionEventLogger - ------------------------------------------------------------------------
[pool-1-thread-1] INFO org.apache.maven.cli.event.ExecutionEventLogger - Reactor Summary:
[pool-1-thread-1] INFO org.apache.maven.cli.event.ExecutionEventLogger -
[pool-1-thread-1] INFO org.apache.maven.cli.event.ExecutionEventLogger - Apache jclouds :: Karaf ........................... SUCCESS [5:17.629s]
[pool-1-thread-1] INFO org.apache.maven.cli.event.ExecutionEventLogger - jclouds :: Karaf :: Core .......................... FAILURE [1:27.104s]
[pool-1-thread-1] INFO org.apache.maven.cli.event.ExecutionEventLogger - jclouds :: Karaf :: Utils ......................... SKIPPED
[pool-1-thread-1] INFO org.apache.maven.cli.event.ExecutionEventLogger - jclouds :: Karaf :: Recipe ........................ SKIPPED
[pool-1-thread-1] INFO org.apache.maven.cli.event.ExecutionEventLogger - jclouds :: Karaf :: Cache ......................... SKIPPED
[pool-1-thread-1] INFO org.apache.maven.cli.event.ExecutionEventLogger - jclouds :: Karaf :: Services ...................... SKIPPED
[pool-1-thread-1] INFO org.apache.maven.cli.event.ExecutionEventLogger - jclouds :: Karaf :: Commands ...................... SKIPPED
[pool-1-thread-1] INFO org.apache.maven.cli.event.ExecutionEventLogger - jclouds :: Karaf :: URL Handler ................... SKIPPED
[pool-1-thread-1] INFO org.apache.maven.cli.event.ExecutionEventLogger - jclouds :: Karaf :: Chef .......................... SKIPPED
[pool-1-thread-1] INFO org.apache.maven.cli.event.ExecutionEventLogger - jclouds :: Karaf :: Chef :: Core .................. SKIPPED
[pool-1-thread-1] INFO org.apache.maven.cli.event.ExecutionEventLogger - jclouds :: Karaf :: Chef :: Services .............. SKIPPED
[pool-1-thread-1] INFO org.apache.maven.cli.event.ExecutionEventLogger - jclouds :: Karaf :: Chef :: Commands .............. SKIPPED
[pool-1-thread-1] INFO org.apache.maven.cli.event.ExecutionEventLogger - jclouds :: Karaf :: Chef :: Cache ................. SKIPPED
[pool-1-thread-1] INFO org.apache.maven.cli.event.ExecutionEventLogger - jclouds :: Karaf :: Feature ....................... SKIPPED
[pool-1-thread-1] INFO org.apache.maven.cli.event.ExecutionEventLogger - jclouds :: Karaf :: Integration Tests ............. SKIPPED
[pool-1-thread-1] INFO org.apache.maven.cli.event.ExecutionEventLogger - ------------------------------------------------------------------------
[pool-1-thread-1] INFO org.apache.maven.cli.event.ExecutionEventLogger - BUILD FAILURE
[pool-1-thread-1] INFO org.apache.maven.cli.event.ExecutionEventLogger - ------------------------------------------------------------------------
[pool-1-thread-1] INFO org.apache.maven.cli.event.ExecutionEventLogger - Total time: 8:54.976s
[pool-1-thread-1] INFO org.apache.maven.cli.event.ExecutionEventLogger - Finished at: Thu Jan 02 18:10:28 EST 2014
[pool-1-thread-1] INFO org.apache.maven.cli.event.ExecutionEventLogger - Final Memory: 18M/35M
[pool-1-thread-1] INFO org.apache.maven.cli.event.ExecutionEventLogger - ------------------------------------------------------------------------
[pool-1-thread-1] WARN org.apache.maven.DefaultMaven - The requested profile "doc" could not be activated because it does not exist.
[pool-1-thread-1] WARN org.apache.maven.DefaultMaven - The requested profile "src" could not be activated because it does not exist.
Waiting for Jenkins to finish collecting data
mavenExecutionResult exceptions not empty
message : Failed to execute goal org.apache.maven.plugins:maven-resources-plugin:2.6:resources (default-resources) on project core: Execution default-resources of goal org.apache.maven.plugins:maven-resources-plugin:2.6:resources failed: A required class was missing while executing org.apache.maven.plugins:maven-resources-plugin:2.6:resources: org/apache/maven/shared/filtering/MavenFilteringException
-----------------------------------------------------
realm = plugin>org.apache.maven.plugins:maven-resources-plugin:2.6
strategy = org.codehaus.plexus.classworlds.strategy.SelfFirstStrategy
urls[0] = file:/home/jenkins/.m2/repository/org/apache/maven/plugins/maven-resources-plugin/2.6/maven-resources-plugin-2.6.jar
urls[1] = file:/home/jenkins/.m2/repository/org/codehaus/plexus/plexus-utils/1.1/plexus-utils-1.1.jar
Number of foreign imports: 1
import: Entry[import from realm ClassRealm[project>org.apache.jclouds:jclouds-karaf:1.7.1-SNAPSHOT, parent: ClassRealm[maven.api, parent: null]]]
-----------------------------------------------------
cause : Execution default-resources of goal org.apache.maven.plugins:maven-resources-plugin:2.6:resources failed: A required class was missing while executing org.apache.maven.plugins:maven-resources-plugin:2.6:resources: org/apache/maven/shared/filtering/MavenFilteringException
-----------------------------------------------------
realm = plugin>org.apache.maven.plugins:maven-resources-plugin:2.6
strategy = org.codehaus.plexus.classworlds.strategy.SelfFirstStrategy
urls[0] = file:/home/jenkins/.m2/repository/org/apache/maven/plugins/maven-resources-plugin/2.6/maven-resources-plugin-2.6.jar
urls[1] = file:/home/jenkins/.m2/repository/org/codehaus/plexus/plexus-utils/1.1/plexus-utils-1.1.jar
Number of foreign imports: 1
import: Entry[import from realm ClassRealm[project>org.apache.jclouds:jclouds-karaf:1.7.1-SNAPSHOT, parent: ClassRealm[maven.api, parent: null]]]
-----------------------------------------------------
Stack trace :
org.apache.maven.lifecycle.LifecycleExecutionException: Failed to execute goal org.apache.maven.plugins:maven-resources-plugin:2.6:resources (default-resources) on project core: Execution default-resources of goal org.apache.maven.plugins:maven-resources-plugin:2.6:resources failed: A required class was missing while executing org.apache.maven.plugins:maven-resources-plugin:2.6:resources: org/apache/maven/shared/filtering/MavenFilteringException
-----------------------------------------------------
realm = plugin>org.apache.maven.plugins:maven-resources-plugin:2.6
strategy = org.codehaus.plexus.classworlds.strategy.SelfFirstStrategy
urls[0] = file:/home/jenkins/.m2/repository/org/apache/maven/plugins/maven-resources-plugin/2.6/maven-resources-plugin-2.6.jar
urls[1] = file:/home/jenkins/.m2/repository/org/codehaus/plexus/plexus-utils/1.1/plexus-utils-1.1.jar
Number of foreign imports: 1
import: Entry[import from realm ClassRealm[project>org.apache.jclouds:jclouds-karaf:1.7.1-SNAPSHOT, parent: ClassRealm[maven.api, parent: null]]]
-----------------------------------------------------
at org.apache.maven.lifecycle.internal.MojoExecutor.execute(MojoExecutor.java:224)
at org.apache.maven.lifecycle.internal.MojoExecutor.execute(MojoExecutor.java:153)
at org.apache.maven.lifecycle.internal.MojoExecutor.execute(MojoExecutor.java:145)
at org.apache.maven.lifecycle.internal.LifecycleModuleBuilder.buildProject(LifecycleModuleBuilder.java:84)
at org.apache.maven.lifecycle.internal.LifecycleModuleBuilder.buildProject(LifecycleModuleBuilder.java:59)
at org.apache.maven.lifecycle.internal.LifecycleStarter.singleThreadedBuild(LifecycleStarter.java:183)
at org.apache.maven.lifecycle.internal.LifecycleStarter.execute(LifecycleStarter.java:161)
at org.apache.maven.DefaultMaven.doExecute(DefaultMaven.java:318)
at org.apache.maven.DefaultMaven.execute(DefaultMaven.java:153)
at org.jvnet.hudson.maven3.launcher.Maven31Launcher.main(Maven31Launcher.java:132)
at sun.reflect.NativeMethodAccessorImpl.invoke0(Native Method)
at sun.reflect.NativeMethodAccessorImpl.invoke(NativeMethodAccessorImpl.java:39)
at sun.reflect.DelegatingMethodAccessorImpl.invoke(DelegatingMethodAccessorImpl.java:25)
at java.lang.reflect.Method.invoke(Method.java:597)
at org.codehaus.plexus.classworlds.launcher.Launcher.launchStandard(Launcher.java:331)
at org.codehaus.plexus.classworlds.launcher.Launcher.launch(Launcher.java:239)
at jenkins.maven3.agent.Maven31Main.launch(Maven31Main.java:181)
at sun.reflect.NativeMethodAccessorImpl.invoke0(Native Method)
at sun.reflect.NativeMethodAccessorImpl.invoke(NativeMethodAccessorImpl.java:39)
at sun.reflect.DelegatingMethodAccessorImpl.invoke(DelegatingMethodAccessorImpl.java:25)
at java.lang.reflect.Method.invoke(Method.java:597)
at hudson.maven.Maven3Builder.call(Maven3Builder.java:129)
at hudson.maven.Maven3Builder.call(Maven3Builder.java:67)
at hudson.remoting.UserRequest.perform(UserRequest.java:118)
at hudson.remoting.UserRequest.perform(UserRequest.java:48)
at hudson.remoting.Request$2.run(Request.java:326)
at hudson.remoting.InterceptingExecutorService$1.call(InterceptingExecutorService.java:72)
at java.util.concurrent.FutureTask$Sync.innerRun(FutureTask.java:303)
at java.util.concurrent.FutureTask.run(FutureTask.java:138)
at java.util.concurrent.ThreadPoolExecutor$Worker.runTask(ThreadPoolExecutor.java:895)
at java.util.concurrent.ThreadPoolExecutor$Worker.run(ThreadPoolExecutor.java:918)
at java.lang.Thread.run(Thread.java:662)
Caused by: org.apache.maven.plugin.PluginExecutionException: Execution default-resources of goal org.apache.maven.plugins:maven-resources-plugin:2.6:resources failed: A required class was missing while executing org.apache.maven.plugins:maven-resources-plugin:2.6:resources: org/apache/maven/shared/filtering/MavenFilteringException
-----------------------------------------------------
realm = plugin>org.apache.maven.plugins:maven-resources-plugin:2.6
strategy = org.codehaus.plexus.classworlds.strategy.SelfFirstStrategy
urls[0] = file:/home/jenkins/.m2/repository/org/apache/maven/plugins/maven-resources-plugin/2.6/maven-resources-plugin-2.6.jar
urls[1] = file:/home/jenkins/.m2/repository/org/codehaus/plexus/plexus-utils/1.1/plexus-utils-1.1.jar
Number of foreign imports: 1
import: Entry[import from realm ClassRealm[project>org.apache.jclouds:jclouds-karaf:1.7.1-SNAPSHOT, parent: ClassRealm[maven.api, parent: null]]]
-----------------------------------------------------
at org.apache.maven.plugin.DefaultBuildPluginManager.executeMojo(DefaultBuildPluginManager.java:132)
at org.apache.maven.lifecycle.internal.MojoExecutor.execute(MojoExecutor.java:208)
... 31 more
Caused by: org.apache.maven.plugin.PluginContainerException: A required class was missing while executing org.apache.maven.plugins:maven-resources-plugin:2.6:resources: org/apache/maven/shared/filtering/MavenFilteringException
-----------------------------------------------------
realm = plugin>org.apache.maven.plugins:maven-resources-plugin:2.6
strategy = org.codehaus.plexus.classworlds.strategy.SelfFirstStrategy
urls[0] = file:/home/jenkins/.m2/repository/org/apache/maven/plugins/maven-resources-plugin/2.6/maven-resources-plugin-2.6.jar
urls[1] = file:/home/jenkins/.m2/repository/org/codehaus/plexus/plexus-utils/1.1/plexus-utils-1.1.jar
Number of foreign imports: 1
import: Entry[import from realm ClassRealm[project>org.apache.jclouds:jclouds-karaf:1.7.1-SNAPSHOT, parent: ClassRealm[maven.api, parent: null]]]
-----------------------------------------------------
at org.apache.maven.plugin.DefaultBuildPluginManager.executeMojo(DefaultBuildPluginManager.java:130)
... 32 more
Caused by: java.lang.NoClassDefFoundError: org/apache/maven/shared/filtering/MavenFilteringException
at java.lang.Class.getDeclaredConstructors0(Native Method)
at java.lang.Class.privateGetDeclaredConstructors(Class.java:2398)
at java.lang.Class.getDeclaredConstructors(Class.java:1838)
at com.google.inject.spi.InjectionPoint.forConstructorOf(InjectionPoint.java:245)
at com.google.inject.internal.ConstructorBindingImpl.create(ConstructorBindingImpl.java:99)
at com.google.inject.internal.InjectorImpl.createUninitializedBinding(InjectorImpl.java:653)
at com.google.inject.internal.InjectorImpl.createJustInTimeBinding(InjectorImpl.java:863)
at com.google.inject.internal.InjectorImpl.createJustInTimeBindingRecursive(InjectorImpl.java:790)
at com.google.inject.internal.InjectorImpl.getJustInTimeBinding(InjectorImpl.java:278)
at com.google.inject.internal.InjectorImpl.getBindingOrThrow(InjectorImpl.java:210)
at com.google.inject.internal.InjectorImpl.getProviderOrThrow(InjectorImpl.java:986)
at com.google.inject.internal.InjectorImpl.getProvider(InjectorImpl.java:1019)
at com.google.inject.internal.InjectorImpl.getProvider(InjectorImpl.java:982)
at com.google.inject.internal.InjectorImpl.getInstance(InjectorImpl.java:1032)
at org.eclipse.sisu.reflect.AbstractDeferredClass.get(AbstractDeferredClass.java:44)
at com.google.inject.internal.ProviderInternalFactory.provision(ProviderInternalFactory.java:86)
at com.google.inject.internal.InternalFactoryToInitializableAdapter.provision(InternalFactoryToInitializableAdapter.java:55)
at com.google.inject.internal.ProviderInternalFactory$1.call(ProviderInternalFactory.java:70)
at com.google.inject.internal.ProvisionListenerStackCallback$Provision.provision(ProvisionListenerStackCallback.java:100)
at org.eclipse.sisu.plexus.lifecycles.PlexusLifecycleManager.onProvision(PlexusLifecycleManager.java:134)
at com.google.inject.internal.ProvisionListenerStackCallback$Provision.provision(ProvisionListenerStackCallback.java:109)
at com.google.inject.internal.ProvisionListenerStackCallback.provision(ProvisionListenerStackCallback.java:55)
at com.google.inject.internal.ProviderInternalFactory.circularGet(ProviderInternalFactory.java:68)
at com.google.inject.internal.InternalFactoryToInitializableAdapter.get(InternalFactoryToInitializableAdapter.java:47)
at com.google.inject.internal.InjectorImpl$2$1.call(InjectorImpl.java:997)
at com.google.inject.internal.InjectorImpl.callInContext(InjectorImpl.java:1047)
at com.google.inject.internal.InjectorImpl$2.get(InjectorImpl.java:993)
at com.google.inject.Scopes$1$1.get(Scopes.java:59)
at org.eclipse.sisu.locators.LazyBeanEntry.getValue(LazyBeanEntry.java:82)
at org.eclipse.sisu.plexus.locators.LazyPlexusBean.getValue(LazyPlexusBean.java:52)
at org.codehaus.plexus.DefaultPlexusContainer.lookup(DefaultPlexusContainer.java:259)
at org.codehaus.plexus.DefaultPlexusContainer.lookup(DefaultPlexusContainer.java:251)
at org.apache.maven.plugin.internal.DefaultMavenPluginManager.getConfiguredMojo(DefaultMavenPluginManager.java:459)
at org.apache.maven.plugin.DefaultBuildPluginManager.executeMojo(DefaultBuildPluginManager.java:97)
... 32 more
Caused by: java.lang.ClassNotFoundException: org.apache.maven.shared.filtering.MavenFilteringException
at org.codehaus.plexus.classworlds.strategy.SelfFirstStrategy.loadClass(SelfFirstStrategy.java:50)
at org.codehaus.plexus.classworlds.realm.ClassRealm.loadClass(ClassRealm.java:244)
at org.codehaus.plexus.classworlds.realm.ClassRealm.loadClass(ClassRealm.java:230)
... 66 more
channel stopped
Jenkins build is back to normal : jclouds-karaf-1.7.x-branch #89
Posted by je...@cloudbees.com.
See <https://jclouds.ci.cloudbees.com/job/jclouds-karaf-1.7.x-branch/89/>