You are viewing a plain text version of this content. The canonical link for it is here.
Posted to yarn-dev@hadoop.apache.org by Apache Jenkins Server <je...@builds.apache.org> on 2015/03/20 17:04:03 UTC

Failed: YARN-3294 PreCommit Build #7042

Jira: https://issues.apache.org/jira/browse/YARN-3294
Build: https://builds.apache.org/job/PreCommit-YARN-Build/7042/

###################################################################################
########################## LAST 60 LINES OF THE CONSOLE ###########################
[...truncated 3814 lines...]
  against trunk revision 8041267.

    {color:green}+1 @author{color}.  The patch does not contain any @author tags.

    {color:green}+1 tests included{color}.  The patch appears to include 1 new or modified test files.

    {color:green}+1 javac{color}.  The applied patch does not increase the total number of javac compiler warnings.

    {color:green}+1 javadoc{color}.  There were no new javadoc warning messages.

    {color:green}+1 eclipse:eclipse{color}.  The patch built with eclipse:eclipse.

    {color:red}-1 findbugs{color}.  The patch appears to introduce 2 new Findbugs (version 2.0.3) warnings.

    {color:green}+1 release audit{color}.  The applied patch does not increase the total number of release audit warnings.

    {color:red}-1 core tests{color}.  The patch failed these unit tests in hadoop-yarn-project/hadoop-yarn/hadoop-yarn-common hadoop-yarn-project/hadoop-yarn/hadoop-yarn-server/hadoop-yarn-server-resourcemanager:

                  org.apache.hadoop.yarn.server.resourcemanager.TestRM
                  org.apache.hadoop.yarn.server.resourcemanager.TestMoveApplication

Test results: https://builds.apache.org/job/PreCommit-YARN-Build/7042//testReport/
Findbugs warnings: https://builds.apache.org/job/PreCommit-YARN-Build/7042//artifact/patchprocess/newPatchFindbugsWarningshadoop-yarn-common.html
Findbugs warnings: https://builds.apache.org/job/PreCommit-YARN-Build/7042//artifact/patchprocess/newPatchFindbugsWarningshadoop-yarn-server-resourcemanager.html
Console output: https://builds.apache.org/job/PreCommit-YARN-Build/7042//console

This message is automatically generated.


======================================================================
======================================================================
    Adding comment to Jira.
======================================================================
======================================================================


Comment added.
9919c6995eaf5df958585d51ab3cddad681c00c8 logged out


======================================================================
======================================================================
    Finished build.
======================================================================
======================================================================


Build step 'Execute shell' marked build as failure
Archiving artifacts
Sending artifact delta relative to PreCommit-YARN-Build #7039
Archived 20 artifacts
Archive block size is 32768
Received 228 blocks and 1911485 bytes
Compression is 79.6%
Took 1.6 sec
Description set: MAPREDUCE-4424
Recording test results
Email was triggered for: Failure
Sending email for trigger: Failure



###################################################################################
############################## FAILED TESTS (if any) ##############################
2 tests failed.
REGRESSION:  org.apache.hadoop.yarn.server.resourcemanager.TestMoveApplication.testMoveSuccessful

Error Message:
test timed out after 10000 milliseconds

Stack Trace:
java.lang.Exception: test timed out after 10000 milliseconds
	at java.lang.Thread.sleep(Native Method)
	at org.apache.hadoop.yarn.server.resourcemanager.MockRM.waitForState(MockRM.java:131)
	at org.apache.hadoop.yarn.server.resourcemanager.MockRM.submitApp(MockRM.java:422)
	at org.apache.hadoop.yarn.server.resourcemanager.MockRM.submitApp(MockRM.java:314)
	at org.apache.hadoop.yarn.server.resourcemanager.MockRM.submitApp(MockRM.java:306)
	at org.apache.hadoop.yarn.server.resourcemanager.MockRM.submitApp(MockRM.java:297)
	at org.apache.hadoop.yarn.server.resourcemanager.MockRM.submitApp(MockRM.java:290)
	at org.apache.hadoop.yarn.server.resourcemanager.MockRM.submitApp(MockRM.java:259)
	at org.apache.hadoop.yarn.server.resourcemanager.MockRM.submitApp(MockRM.java:247)
	at org.apache.hadoop.yarn.server.resourcemanager.MockRM.submitApp(MockRM.java:242)
	at org.apache.hadoop.yarn.server.resourcemanager.TestMoveApplication.testMoveSuccessful(TestMoveApplication.java:128)


REGRESSION:  org.apache.hadoop.yarn.server.resourcemanager.TestRM.testNMTokenSentForNormalContainer[0]

Error Message:
test timed out after 20000 milliseconds

Stack Trace:
java.lang.Exception: test timed out after 20000 milliseconds
	at java.net.Inet4AddressImpl.lookupAllHostAddr(Native Method)
	at java.net.InetAddress$1.lookupAllHostAddr(InetAddress.java:901)
	at java.net.InetAddress.getAddressesFromNameService(InetAddress.java:1293)
	at java.net.InetAddress.getAllByName0(InetAddress.java:1246)
	at java.net.InetAddress.getAllByName(InetAddress.java:1162)
	at java.net.InetAddress.getAllByName(InetAddress.java:1098)
	at java.net.InetAddress.getByName(InetAddress.java:1048)
	at org.apache.hadoop.security.SecurityUtil$QualifiedHostResolver.getInetAddressByName(SecurityUtil.java:599)
	at org.apache.hadoop.security.SecurityUtil$QualifiedHostResolver.getByExactName(SecurityUtil.java:572)
	at org.apache.hadoop.security.SecurityUtil$QualifiedHostResolver.getByName(SecurityUtil.java:553)
	at org.apache.hadoop.security.SecurityUtil.getByName(SecurityUtil.java:465)
	at org.apache.hadoop.net.NetUtils.createSocketAddrForHost(NetUtils.java:237)
	at org.apache.hadoop.yarn.server.utils.BuilderUtils.newContainerToken(BuilderUtils.java:255)
	at org.apache.hadoop.yarn.server.resourcemanager.security.RMContainerTokenSecretManager.createContainerToken(RMContainerTokenSecretManager.java:220)
	at org.apache.hadoop.yarn.server.resourcemanager.scheduler.SchedulerApplicationAttempt.pullNewlyAllocatedContainersAndNMTokens(SchedulerApplicationAttempt.java:454)
	at org.apache.hadoop.yarn.server.resourcemanager.scheduler.common.fica.FiCaSchedulerApp.getAllocation(FiCaSchedulerApp.java:269)
	at org.apache.hadoop.yarn.server.resourcemanager.scheduler.capacity.CapacityScheduler.allocate(CapacityScheduler.java:917)
	at org.apache.hadoop.yarn.server.resourcemanager.ApplicationMasterService.allocate(ApplicationMasterService.java:530)
	at org.apache.hadoop.yarn.server.resourcemanager.MockAM$2.run(MockAM.java:237)
	at org.apache.hadoop.yarn.server.resourcemanager.MockAM$2.run(MockAM.java:234)
	at java.security.AccessController.doPrivileged(Native Method)
	at javax.security.auth.Subject.doAs(Subject.java:415)
	at org.apache.hadoop.security.UserGroupInformation.doAs(UserGroupInformation.java:1669)
	at org.apache.hadoop.yarn.server.resourcemanager.MockAM.doAllocateAs(MockAM.java:234)
	at org.apache.hadoop.yarn.server.resourcemanager.MockAM.allocate(MockAM.java:226)
	at org.apache.hadoop.yarn.server.resourcemanager.MockAM.allocate(MockAM.java:215)
	at org.apache.hadoop.yarn.server.resourcemanager.MockAM.allocate(MockAM.java:156)
	at org.apache.hadoop.yarn.server.resourcemanager.MockAM.allocate(MockAM.java:147)
	at org.apache.hadoop.yarn.server.resourcemanager.TestRM.testNMTokenSentForNormalContainer(TestRM.java:241)



Success: YARN-3294 PreCommit Build #7044

Posted by Apache Jenkins Server <je...@builds.apache.org>.
Jira: https://issues.apache.org/jira/browse/YARN-3294
Build: https://builds.apache.org/job/PreCommit-YARN-Build/7044/

###################################################################################
########################## LAST 60 LINES OF THE CONSOLE ###########################
[...truncated 3643 lines...]




{color:green}+1 overall{color}.  Here are the results of testing the latest attachment 
  http://issues.apache.org/jira/secure/attachment/12705966/apache-yarn-3294.3.patch
  against trunk revision 1561231.

    {color:green}+1 @author{color}.  The patch does not contain any @author tags.

    {color:green}+1 tests included{color}.  The patch appears to include 1 new or modified test files.

    {color:green}+1 javac{color}.  The applied patch does not increase the total number of javac compiler warnings.

    {color:green}+1 javadoc{color}.  There were no new javadoc warning messages.

    {color:green}+1 eclipse:eclipse{color}.  The patch built with eclipse:eclipse.

    {color:green}+1 findbugs{color}.  The patch does not introduce any new Findbugs (version 2.0.3) warnings.

    {color:green}+1 release audit{color}.  The applied patch does not increase the total number of release audit warnings.

    {color:green}+1 core tests{color}.  The patch passed unit tests in hadoop-yarn-project/hadoop-yarn/hadoop-yarn-common hadoop-yarn-project/hadoop-yarn/hadoop-yarn-server/hadoop-yarn-server-resourcemanager.

Test results: https://builds.apache.org/job/PreCommit-YARN-Build/7044//testReport/
Console output: https://builds.apache.org/job/PreCommit-YARN-Build/7044//console

This message is automatically generated.


======================================================================
======================================================================
    Adding comment to Jira.
======================================================================
======================================================================


Comment added.
1579a63fd3bf99f8c24cdb9d2d72005578685ee4 logged out


======================================================================
======================================================================
    Finished build.
======================================================================
======================================================================


Archiving artifacts
Sending artifact delta relative to PreCommit-YARN-Build #7039
Archived 20 artifacts
Archive block size is 32768
Received 57 blocks and 7493236 bytes
Compression is 20.0%
Took 3.1 sec
Description set: YARN-3294
Recording test results
Email was triggered for: Success
Sending email for trigger: Success



###################################################################################
############################## FAILED TESTS (if any) ##############################
All tests passed

Failed: YARN-2901 PreCommit Build #7043

Posted by Apache Jenkins Server <je...@builds.apache.org>.
Jira: https://issues.apache.org/jira/browse/YARN-2901
Build: https://builds.apache.org/job/PreCommit-YARN-Build/7043/

###################################################################################
########################## LAST 60 LINES OF THE CONSOLE ###########################
[...truncated 4425 lines...]
{color:red}-1 overall{color}.  Here are the results of testing the latest attachment 
  http://issues.apache.org/jira/secure/attachment/12705935/apache-yarn-2901.1.patch
  against trunk revision 8041267.

    {color:green}+1 @author{color}.  The patch does not contain any @author tags.

    {color:green}+1 tests included{color}.  The patch appears to include 1 new or modified test files.

    {color:green}+1 javac{color}.  The applied patch does not increase the total number of javac compiler warnings.

    {color:green}+1 javadoc{color}.  There were no new javadoc warning messages.

    {color:green}+1 eclipse:eclipse{color}.  The patch built with eclipse:eclipse.

    {color:green}+1 findbugs{color}.  The patch does not introduce any new Findbugs (version 2.0.3) warnings.

    {color:green}+1 release audit{color}.  The applied patch does not increase the total number of release audit warnings.

    {color:red}-1 core tests{color}.  The patch failed these unit tests in hadoop-yarn-project/hadoop-yarn/hadoop-yarn-common hadoop-yarn-project/hadoop-yarn/hadoop-yarn-server/hadoop-yarn-server-nodemanager hadoop-yarn-project/hadoop-yarn/hadoop-yarn-server/hadoop-yarn-server-resourcemanager:

                  org.apache.hadoop.yarn.server.resourcemanager.TestRMRestart
                  org.apache.hadoop.yarn.server.resourcemanager.TestRM

Test results: https://builds.apache.org/job/PreCommit-YARN-Build/7043//testReport/
Console output: https://builds.apache.org/job/PreCommit-YARN-Build/7043//console

This message is automatically generated.


======================================================================
======================================================================
    Adding comment to Jira.
======================================================================
======================================================================


Comment added.
da6b8bd6969fad57ceeedc5a3749deed29cca000 logged out


======================================================================
======================================================================
    Finished build.
======================================================================
======================================================================


Build step 'Execute shell' marked build as failure
Archiving artifacts
Sending artifact delta relative to PreCommit-YARN-Build #7039
Archived 25 artifacts
Archive block size is 32768
Received 59 blocks and 7698861 bytes
Compression is 20.1%
Took 2.9 sec
Description set: MAPREDUCE-4424
Recording test results
Email was triggered for: Failure
Sending email for trigger: Failure



###################################################################################
############################## FAILED TESTS (if any) ##############################
2 tests failed.
REGRESSION:  org.apache.hadoop.yarn.server.resourcemanager.TestRM.testAppOnMultiNode[0]

Error Message:
test timed out after 30000 milliseconds

Stack Trace:
java.lang.Exception: test timed out after 30000 milliseconds
	at java.net.Inet4AddressImpl.lookupAllHostAddr(Native Method)
	at java.net.InetAddress$1.lookupAllHostAddr(InetAddress.java:901)
	at java.net.InetAddress.getAddressesFromNameService(InetAddress.java:1293)
	at java.net.InetAddress.getAllByName0(InetAddress.java:1246)
	at java.net.InetAddress.getAllByName(InetAddress.java:1162)
	at java.net.InetAddress.getAllByName(InetAddress.java:1098)
	at java.net.InetAddress.getByName(InetAddress.java:1048)
	at org.apache.hadoop.security.SecurityUtil$QualifiedHostResolver.getInetAddressByName(SecurityUtil.java:599)
	at org.apache.hadoop.security.SecurityUtil$QualifiedHostResolver.getByExactName(SecurityUtil.java:572)
	at org.apache.hadoop.security.SecurityUtil$QualifiedHostResolver.getByName(SecurityUtil.java:553)
	at org.apache.hadoop.security.SecurityUtil.getByName(SecurityUtil.java:465)
	at org.apache.hadoop.net.NetUtils.createSocketAddrForHost(NetUtils.java:237)
	at org.apache.hadoop.yarn.server.utils.BuilderUtils.newContainerToken(BuilderUtils.java:255)
	at org.apache.hadoop.yarn.server.resourcemanager.security.RMContainerTokenSecretManager.createContainerToken(RMContainerTokenSecretManager.java:220)
	at org.apache.hadoop.yarn.server.resourcemanager.scheduler.SchedulerApplicationAttempt.pullNewlyAllocatedContainersAndNMTokens(SchedulerApplicationAttempt.java:454)
	at org.apache.hadoop.yarn.server.resourcemanager.scheduler.common.fica.FiCaSchedulerApp.getAllocation(FiCaSchedulerApp.java:269)
	at org.apache.hadoop.yarn.server.resourcemanager.scheduler.capacity.CapacityScheduler.allocate(CapacityScheduler.java:917)
	at org.apache.hadoop.yarn.server.resourcemanager.ApplicationMasterService.allocate(ApplicationMasterService.java:530)
	at org.apache.hadoop.yarn.server.resourcemanager.MockAM$2.run(MockAM.java:237)
	at org.apache.hadoop.yarn.server.resourcemanager.MockAM$2.run(MockAM.java:234)
	at java.security.AccessController.doPrivileged(Native Method)
	at javax.security.auth.Subject.doAs(Subject.java:415)
	at org.apache.hadoop.security.UserGroupInformation.doAs(UserGroupInformation.java:1669)
	at org.apache.hadoop.yarn.server.resourcemanager.MockAM.doAllocateAs(MockAM.java:234)
	at org.apache.hadoop.yarn.server.resourcemanager.MockAM.allocate(MockAM.java:226)
	at org.apache.hadoop.yarn.server.resourcemanager.MockAM.allocate(MockAM.java:215)
	at org.apache.hadoop.yarn.server.resourcemanager.TestRM.testAppOnMultiNode(TestRM.java:188)


REGRESSION:  org.apache.hadoop.yarn.server.resourcemanager.TestRMRestart.testRMRestartGetApplicationList[1]

Error Message:

rMAppManager.logApplicationSummary(
    isA(org.apache.hadoop.yarn.api.records.ApplicationId)
);
Wanted 3 times:
-> at org.apache.hadoop.yarn.server.resourcemanager.TestRMRestart.testRMRestartGetApplicationList(TestRMRestart.java:969)
But was 2 times:
-> at org.apache.hadoop.yarn.server.resourcemanager.RMAppManager.handle(RMAppManager.java:66)


Stack Trace:
org.mockito.exceptions.verification.TooLittleActualInvocations: 
rMAppManager.logApplicationSummary(
    isA(org.apache.hadoop.yarn.api.records.ApplicationId)
);
Wanted 3 times:
-> at org.apache.hadoop.yarn.server.resourcemanager.TestRMRestart.testRMRestartGetApplicationList(TestRMRestart.java:969)
But was 2 times:
-> at org.apache.hadoop.yarn.server.resourcemanager.RMAppManager.handle(RMAppManager.java:66)

	at org.apache.hadoop.yarn.server.resourcemanager.TestRMRestart.testRMRestartGetApplicationList(TestRMRestart.java:969)