You are viewing a plain text version of this content. The canonical link for it is here.
Posted to torque-dev@db.apache.org by Apache Jenkins Server <je...@builds.apache.org> on 2016/09/21 00:24:00 UTC

Build failed in Jenkins: Torque4-trunk #568

See <https://builds.apache.org/job/Torque4-trunk/568/changes>

Changes:

[tfischer] Remove unused templates

------------------------------------------
Started by an SCM change
[EnvInject] - Loading node environment variables.
Building remotely on ubuntu-6 (Ubuntu yahoo-not-h2 ubuntu docker) in workspace <https://builds.apache.org/job/Torque4-trunk/ws/>
Cleaning up <https://builds.apache.org/job/Torque4-trunk/ws/torque4-trunk>
Deleting <https://builds.apache.org/job/Torque4-trunk/ws/torque4-trunk/torque-runtime/target>
Deleting <https://builds.apache.org/job/Torque4-trunk/ws/torque4-trunk/target>
Updating http://svn.apache.org/repos/asf/db/torque/torque4/trunk at revision '2016-09-21T00:22:57.800 +0000'
D         torque-templates/src/main/resources/org/apache/torque/templates/om/templates/peer/base/log.vm
U         torque-templates/src/main/resources/org/apache/torque/templates/om/templates/peer/base/basePeerForView.vm
U         torque-templates/src/main/resources/org/apache/torque/templates/om/templates/peer/base/basePeer.vm
D         torque-templates/src/main/resources/org/apache/torque/templates/om/templates/peer/impl/base/doSelect.vm
D         torque-templates/src/main/resources/org/apache/torque/templates/om/templates/peer/impl/base/log.vm
D         torque-templates/src/main/resources/org/apache/torque/templates/om/templates/peer/impl/base/doInsert.vm
U         torque-templates/src/main/resources/org/apache/torque/templates/om/templates/peer/impl/base/basePeerImpl.vm
U         torque-templates/src/main/resources/org/apache/torque/templates/om/templates/peer/impl/base/basePeerForViewImpl.vm
U         torque-templates/src/main/resources/org/apache/torque/templates/om/templates/peer/impl/base/imports.vm
U         torque-templates/src/main/resources/org/apache/torque/templates/om/outlets/peerImpl.xml
U         torque-templates/src/main/resources/org/apache/torque/templates/om/outlets/basePeer.xml
 U        torque-templates
U         torque-runtime/src/main/java/org/apache/torque/TorqueInstance.java
U         torque-runtime/NOTICE
At revision 1761651

Parsing POMs
Established TCP socket on 46259
maven32-agent.jar already up to date
maven32-interceptor.jar already up to date
maven3-interceptor-commons.jar already up to date
[torque4-trunk] $ /home/jenkins/tools/java/latest1.7/bin/java -Xmx2g -Xms256m -XX:MaxPermSize=512m -cp /home/jenkins/jenkins-slave/maven32-agent.jar:/home/jenkins/tools/maven/latest3/boot/plexus-classworlds-2.5.2.jar:/home/jenkins/tools/maven/latest3/conf/logging jenkins.maven3.agent.Maven32Main /home/jenkins/tools/maven/latest3/ /home/jenkins/jenkins-slave/slave.jar /home/jenkins/jenkins-slave/maven32-interceptor.jar /home/jenkins/jenkins-slave/maven3-interceptor-commons.jar 46259
<===[JENKINS REMOTING CAPACITY]===>   channel started
Executing Maven:  -B -f <https://builds.apache.org/job/Torque4-trunk/ws/torque4-trunk/pom.xml> -Dmaven.repo.local=/home/jenkins/jenkins-slave/maven-repositories/1 clean install cobertura:cobertura findbugs:findbugs checkstyle:checkstyle pmd:pmd pmd:cpd
[INFO] Scanning for projects...
[INFO] Downloading: https://repo.maven.apache.org/maven2/org/apache/maven/wagon/wagon-ssh-external/2.2/wagon-ssh-external-2.2.pom
[INFO] Downloaded: https://repo.maven.apache.org/maven2/org/apache/maven/wagon/wagon-ssh-external/2.2/wagon-ssh-external-2.2.pom (5 KB at 7.7 KB/sec)
[INFO] Downloading: https://repo.maven.apache.org/maven2/org/apache/maven/wagon/wagon-ssh-common/2.2/wagon-ssh-common-2.2.pom
[INFO] Downloaded: https://repo.maven.apache.org/maven2/org/apache/maven/wagon/wagon-ssh-common/2.2/wagon-ssh-common-2.2.pom (2 KB at 22.4 KB/sec)
[INFO] Downloading: https://repo.maven.apache.org/maven2/org/apache/maven/wagon/wagon-ssh-external/2.2/wagon-ssh-external-2.2.jar
[INFO] Downloading: https://repo.maven.apache.org/maven2/org/apache/maven/wagon/wagon-ssh-common/2.2/wagon-ssh-common-2.2.jar
[INFO] Downloaded: https://repo.maven.apache.org/maven2/org/apache/maven/wagon/wagon-ssh-external/2.2/wagon-ssh-external-2.2.jar (15 KB at 302.0 KB/sec)
[INFO] Downloaded: https://repo.maven.apache.org/maven2/org/apache/maven/wagon/wagon-ssh-common/2.2/wagon-ssh-common-2.2.jar (25 KB at 339.5 KB/sec)
[INFO] ------------------------------------------------------------------------
[INFO] Reactor Build Order:
[INFO] 
[INFO] Torque Maven Parent
[INFO] Torque Runtime
[INFO] Torque Generator
[INFO] Torque Templates
[INFO] Torque Generator Maven 2 Plugin
[INFO] Torque Generator Ant tasks
[INFO] Torque Site
[INFO] Downloading: https://repo.maven.apache.org/maven2/org/apache/maven/plugins/maven-eclipse-plugin/2.9/maven-eclipse-plugin-2.9.pom
[INFO] Downloaded: https://repo.maven.apache.org/maven2/org/apache/maven/plugins/maven-eclipse-plugin/2.9/maven-eclipse-plugin-2.9.pom (15 KB at 182.0 KB/sec)
[INFO] Downloading: https://repo.maven.apache.org/maven2/org/apache/maven/plugins/maven-eclipse-plugin/2.9/maven-eclipse-plugin-2.9.jar
[INFO] Downloaded: https://repo.maven.apache.org/maven2/org/apache/maven/plugins/maven-eclipse-plugin/2.9/maven-eclipse-plugin-2.9.jar (213 KB at 1950.2 KB/sec)
[INFO] Downloading: https://repo.maven.apache.org/maven2/org/codehaus/mojo/cobertura-maven-plugin/2.3/cobertura-maven-plugin-2.3.pom
[INFO] Downloaded: https://repo.maven.apache.org/maven2/org/codehaus/mojo/cobertura-maven-plugin/2.3/cobertura-maven-plugin-2.3.pom (6 KB at 28.8 KB/sec)
[INFO] Downloading: https://repo.maven.apache.org/maven2/org/codehaus/mojo/cobertura-maven-plugin/2.3/cobertura-maven-plugin-2.3.jar
[INFO] Downloaded: https://repo.maven.apache.org/maven2/org/codehaus/mojo/cobertura-maven-plugin/2.3/cobertura-maven-plugin-2.3.jar (32 KB at 149.6 KB/sec)
[INFO] Downloading: https://repo.maven.apache.org/maven2/org/codehaus/mojo/findbugs-maven-plugin/3.0.0/findbugs-maven-plugin-3.0.0.pom
[INFO] Downloaded: https://repo.maven.apache.org/maven2/org/codehaus/mojo/findbugs-maven-plugin/3.0.0/findbugs-maven-plugin-3.0.0.pom (19 KB at 403.4 KB/sec)
[INFO] Downloading: https://repo.maven.apache.org/maven2/org/codehaus/mojo/findbugs-maven-plugin/3.0.0/findbugs-maven-plugin-3.0.0.jar
[INFO] Downloaded: https://repo.maven.apache.org/maven2/org/codehaus/mojo/findbugs-maven-plugin/3.0.0/findbugs-maven-plugin-3.0.0.jar (130 KB at 2028.9 KB/sec)
[INFO] Downloading: https://repo.maven.apache.org/maven2/org/apache/maven/plugins/maven-jxr-plugin/2.4/maven-jxr-plugin-2.4.pom
[INFO] Downloaded: https://repo.maven.apache.org/maven2/org/apache/maven/plugins/maven-jxr-plugin/2.4/maven-jxr-plugin-2.4.pom (8 KB at 62.6 KB/sec)
[INFO] Downloading: https://repo.maven.apache.org/maven2/org/apache/maven/jxr/jxr/2.4/jxr-2.4.pom
[INFO] Downloaded: https://repo.maven.apache.org/maven2/org/apache/maven/jxr/jxr/2.4/jxr-2.4.pom (6 KB at 78.0 KB/sec)
[INFO] Downloading: https://repo.maven.apache.org/maven2/org/apache/maven/plugins/maven-jxr-plugin/2.4/maven-jxr-plugin-2.4.jar
[INFO] Downloaded: https://repo.maven.apache.org/maven2/org/apache/maven/plugins/maven-jxr-plugin/2.4/maven-jxr-plugin-2.4.jar (33 KB at 795.3 KB/sec)
[INFO]                                                                         
[INFO] ------------------------------------------------------------------------
[INFO] Building Torque Maven Parent 4.1-SNAPSHOT
[INFO] ------------------------------------------------------------------------
[INFO] 
[INFO] --- maven-clean-plugin:3.0.0:clean (default-clean) @ torque ---
[INFO] 
[INFO] --- maven-remote-resources-plugin:1.5:process (process-resource-bundles) @ torque ---
[INFO] 
[INFO] --- maven-site-plugin:3.5.1:attach-descriptor (attach-descriptor) @ torque ---
[INFO] 
[INFO] --- maven-source-plugin:3.0.0:jar-no-fork (attach-sources) @ torque ---
[INFO] 
[INFO] --- apache-rat-plugin:0.11:check (default) @ torque ---
[INFO] 57 implicit excludes (use -debug for more details).
[INFO] Exclude: velocity.log
[INFO] Exclude: .checkstyle
[INFO] Exclude: checkstyle-cache.ccf
[INFO] Exclude: derby.log
[INFO] Exclude: LICENSE-EDL.txt
[INFO] Exclude: DEPENDENCIES
[INFO] Exclude: torque-test/target/**/*
[INFO] Exclude: torque-test/.classpath
[INFO] Exclude: torque-test/.project
[INFO] Exclude: torque-test/.settings/**
[INFO] Exclude: torque-test/src/main/generated-java/**/*
[INFO] Exclude: torque-test/derby.log
[INFO] 120 resources included (use -debug for more details)
[INFO] Rat check: Summary of files. Unapproved: 0 unknown: 0 generated: 0 approved: 115 licence.
[CHECKSTYLE] No report found for mojo check
[PMD] No report found for mojo check[INFO] 
[INFO] --- maven-install-plugin:2.5.2:install (default-install) @ torque ---

[INFO] Installing <https://builds.apache.org/job/Torque4-trunk/ws/torque4-trunk/pom.xml> to /home/jenkins/jenkins-slave/maven-repositories/1/org/apache/torque/torque/4.1-SNAPSHOT/torque-4.1-SNAPSHOT.pom
[INFO] 
[INFO] >>> cobertura-maven-plugin:2.3:cobertura (default-cli) > [cobertura]test @ torque >>>
[INFO] 
[INFO] --- maven-remote-resources-plugin:1.5:process (process-resource-bundles) @ torque ---
[INFO] 
[INFO] --- cobertura-maven-plugin:2.3:instrument (default-cli) @ torque ---
[INFO] Downloading: https://repo.maven.apache.org/maven2/net/sourceforge/cobertura/cobertura/1.9.2/cobertura-1.9.2.pom
[INFO] Downloaded: https://repo.maven.apache.org/maven2/net/sourceforge/cobertura/cobertura/1.9.2/cobertura-1.9.2.pom (2 KB at 7.3 KB/sec)
[INFO] Downloading: https://repo.maven.apache.org/maven2/asm/asm-tree/3.0/asm-tree-3.0.pom
[INFO] Downloaded: https://repo.maven.apache.org/maven2/asm/asm-tree/3.0/asm-tree-3.0.pom (499 B at 7.3 KB/sec)
[INFO] Downloading: https://repo.maven.apache.org/maven2/log4j/log4j/1.2.9/log4j-1.2.9.pom
[INFO] Downloaded: https://repo.maven.apache.org/maven2/log4j/log4j/1.2.9/log4j-1.2.9.pom (144 B at 7.8 KB/sec)
[INFO] Downloading: https://repo.maven.apache.org/maven2/net/sourceforge/cobertura/cobertura-runtime/1.9.2/cobertura-runtime-1.9.2.pom
[INFO] Downloaded: https://repo.maven.apache.org/maven2/net/sourceforge/cobertura/cobertura-runtime/1.9.2/cobertura-runtime-1.9.2.pom (2 KB at 10.5 KB/sec)
[INFO] Downloading: https://repo.maven.apache.org/maven2/net/sourceforge/cobertura/cobertura/1.9.2/cobertura-1.9.2.jar
[INFO] Downloading: https://repo.maven.apache.org/maven2/asm/asm-tree/3.0/asm-tree-3.0.jar
[INFO] Downloading: https://repo.maven.apache.org/maven2/log4j/log4j/1.2.9/log4j-1.2.9.jar
[INFO] Downloaded: https://repo.maven.apache.org/maven2/asm/asm-tree/3.0/asm-tree-3.0.jar (22 KB at 477.5 KB/sec)
[INFO] Downloaded: https://repo.maven.apache.org/maven2/log4j/log4j/1.2.9/log4j-1.2.9.jar (345 KB at 5134.8 KB/sec)
[INFO] Downloaded: https://repo.maven.apache.org/maven2/net/sourceforge/cobertura/cobertura/1.9.2/cobertura-1.9.2.jar (225 KB at 1070.8 KB/sec)
[INFO] Not executing cobertura:instrument as the project is not a Java classpath-capable package
[INFO] 
[INFO] <<< cobertura-maven-plugin:2.3:cobertura (default-cli) < [cobertura]test @ torque <<<
[INFO] 
[INFO] --- cobertura-maven-plugin:2.3:cobertura (default-cli) @ torque ---
[INFO] Not executing cobertura:report as the cobertura data file (<https://builds.apache.org/job/Torque4-trunk/ws/torque4-trunk/target/cobertura/cobertura.ser)> could not be found
[INFO] 
[INFO] --- findbugs-maven-plugin:3.0.0:findbugs (default-cli) @ torque ---
[INFO] Downloading: https://repo.maven.apache.org/maven2/com/google/code/findbugs/findbugs/3.0.0/findbugs-3.0.0.pom
[INFO] Downloaded: https://repo.maven.apache.org/maven2/com/google/code/findbugs/findbugs/3.0.0/findbugs-3.0.0.pom (5 KB at 130.8 KB/sec)
[INFO] Downloading: https://repo.maven.apache.org/maven2/com/google/code/findbugs/jFormatString/3.0.0/jFormatString-3.0.0.pom
[INFO] Downloaded: https://repo.maven.apache.org/maven2/com/google/code/findbugs/jFormatString/3.0.0/jFormatString-3.0.0.pom (4 KB at 187.4 KB/sec)
[INFO] Downloading: https://repo.maven.apache.org/maven2/com/google/code/findbugs/findbugs/3.0.0/findbugs-3.0.0.jar
[INFO] Downloading: https://repo.maven.apache.org/maven2/com/google/code/findbugs/jFormatString/3.0.0/jFormatString-3.0.0.jar
[INFO] Downloaded: https://repo.maven.apache.org/maven2/com/google/code/findbugs/jFormatString/3.0.0/jFormatString-3.0.0.jar (34 KB at 771.1 KB/sec)
[INFO] Downloaded: https://repo.maven.apache.org/maven2/com/google/code/findbugs/findbugs/3.0.0/findbugs-3.0.0.jar (3537 KB at 13498.7 KB/sec)
[INFO] 
[INFO] --- maven-checkstyle-plugin:2.13:checkstyle (default-cli) @ torque ---
[FINDBUGS] No report found for mojo findbugs
[INFO] 
[CHECKSTYLE] Parsing file <https://builds.apache.org/job/Torque4-trunk/ws/torque4-trunk/target/checkstyle-result.xml>
[CHECKSTYLE] Successfully parsed file <https://builds.apache.org/job/Torque4-trunk/ws/torque4-trunk/target/checkstyle-result.xml> of module Torque Maven Parent with 0 unique warnings and 0 duplicates.
[CHECKSTYLE] Computing warning deltas based on reference build #567
[INFO] 
[INFO] --- maven-pmd-plugin:3.2:pmd (default-cli) @ torque ---
[INFO] Downloading: https://repo.maven.apache.org/maven2/net/sourceforge/pmd/pmd/5.1.2/pmd-5.1.2.pom
[INFO] Downloaded: https://repo.maven.apache.org/maven2/net/sourceforge/pmd/pmd/5.1.2/pmd-5.1.2.pom (36 KB at 245.2 KB/sec)
[INFO] Downloading: https://repo.maven.apache.org/maven2/net/sourceforge/pmd/pmd/5.1.2/pmd-5.1.2.jar
[INFO] Downloaded: https://repo.maven.apache.org/maven2/net/sourceforge/pmd/pmd/5.1.2/pmd-5.1.2.jar (2049 KB at 7342.8 KB/sec)
[PMD] No report found for mojo pmd[INFO] 
[INFO] --- maven-pmd-plugin:3.2:cpd (default-cli) @ torque ---

[DRY] No report found for mojo cpd
[INFO]                                                                         
[INFO] ------------------------------------------------------------------------
[INFO] Building Torque Runtime 4.1-SNAPSHOT
[INFO] ------------------------------------------------------------------------
[INFO] Downloading: https://repo.maven.apache.org/maven2/org/apache/fulcrum/fulcrum-testcontainer/1.0.6/fulcrum-testcontainer-1.0.6.pom
[INFO] Downloaded: https://repo.maven.apache.org/maven2/org/apache/fulcrum/fulcrum-testcontainer/1.0.6/fulcrum-testcontainer-1.0.6.pom (5 KB at 22.0 KB/sec)
[INFO] Downloading: https://repo.maven.apache.org/maven2/org/apache/fulcrum/fulcrum-parent/1/fulcrum-parent-1.pom
[INFO] Downloaded: https://repo.maven.apache.org/maven2/org/apache/fulcrum/fulcrum-parent/1/fulcrum-parent-1.pom (19 KB at 97.9 KB/sec)
[INFO] Downloading: https://repo.maven.apache.org/maven2/org/apache/fulcrum/fulcrum-yaafi/1.0.6/fulcrum-yaafi-1.0.6.pom
[INFO] Downloaded: https://repo.maven.apache.org/maven2/org/apache/fulcrum/fulcrum-yaafi/1.0.6/fulcrum-yaafi-1.0.6.pom (3 KB at 15.5 KB/sec)
[INFO] Downloading: https://repo.maven.apache.org/maven2/org/apache/fulcrum/fulcrum-testcontainer/1.0.6/fulcrum-testcontainer-1.0.6.jar
[INFO] Downloading: https://repo.maven.apache.org/maven2/org/apache/fulcrum/fulcrum-yaafi/1.0.6/fulcrum-yaafi-1.0.6.jar
[INFO] Downloaded: https://repo.maven.apache.org/maven2/org/apache/fulcrum/fulcrum-yaafi/1.0.6/fulcrum-yaafi-1.0.6.jar (128 KB at 480.2 KB/sec)
[INFO] Downloaded: https://repo.maven.apache.org/maven2/org/apache/fulcrum/fulcrum-testcontainer/1.0.6/fulcrum-testcontainer-1.0.6.jar (14 KB at 37.0 KB/sec)
[INFO] 
[INFO] --- maven-clean-plugin:3.0.0:clean (default-clean) @ torque-runtime ---
[INFO] 
[INFO] --- maven-remote-resources-plugin:1.5:process (process-resource-bundles) @ torque-runtime ---
[INFO] 
[INFO] --- maven-resources-plugin:2.7:resources (default-resources) @ torque-runtime ---
[INFO] Using 'ISO-8859-1' encoding to copy filtered resources.
[INFO] skip non existing resourceDirectory <https://builds.apache.org/job/Torque4-trunk/ws/torque4-trunk/torque-runtime/src/main/resources>
[INFO] Copying 3 resources
[INFO] 
[INFO] --- maven-compiler-plugin:3.5.1:compile (default-compile) @ torque-runtime ---
[INFO] Changes detected - recompiling the module!
[INFO] Compiling 119 source files to <https://builds.apache.org/job/Torque4-trunk/ws/torque4-trunk/torque-runtime/target/classes>
[INFO] ------------------------------------------------------------------------
[INFO] Reactor Summary:
[INFO] 
[INFO] Torque Maven Parent ................................ SUCCESS [ 27.600 s]
[INFO] Torque Runtime ..................................... FAILURE [  2.710 s]
[INFO] Torque Generator ................................... SKIPPED
[INFO] Torque Templates ................................... SKIPPED
[INFO] Torque Generator Maven 2 Plugin .................... SKIPPED
[INFO] Torque Generator Ant tasks ......................... SKIPPED
[INFO] Torque Site ........................................ SKIPPED
[INFO] ------------------------------------------------------------------------
[INFO] BUILD FAILURE
[INFO] ------------------------------------------------------------------------
[INFO] Total time: 43.450 s
[INFO] Finished at: 2016-09-21T00:22:43+00:00
[INFO] Final Memory: 55M/604M
[INFO] ------------------------------------------------------------------------
[ERROR] Failed to execute goal org.apache.maven.plugins:maven-compiler-plugin:3.5.1:compile (default-compile) on project torque-runtime: Fatal error compiling: invalid target release: 1.8 -> [Help 1]
[ERROR] 
[ERROR] To see the full stack trace of the errors, re-run Maven with the -e switch.
[ERROR] Re-run Maven using the -X switch to enable full debug logging.
[ERROR] 
[ERROR] For more information about the errors and possible solutions, please read the following articles:
[ERROR] [Help 1] http://cwiki.apache.org/confluence/display/MAVEN/MojoExecutionException
[ERROR] 
[ERROR] After correcting the problems, you can resume the build with the command
[ERROR]   mvn <goals> -rf :torque-runtime
[JENKINS] Archiving <https://builds.apache.org/job/Torque4-trunk/ws/torque4-trunk/torque-maven-plugin/pom.xml> to org.apache.torque/torque-maven-plugin/4.1-SNAPSHOT/torque-maven-plugin-4.1-SNAPSHOT.pom
[JENKINS] Archiving <https://builds.apache.org/job/Torque4-trunk/ws/torque4-trunk/pom.xml> to org.apache.torque/torque/4.1-SNAPSHOT/torque-4.1-SNAPSHOT.pom
<https://builds.apache.org/job/Torque4-trunk/ws/torque4-trunk/pom.xml> is not inside <https://builds.apache.org/job/Torque4-trunk/ws/torque4-trunk/torque4-trunk/;> will archive in a separate pass
[JENKINS] Archiving <https://builds.apache.org/job/Torque4-trunk/ws/torque4-trunk/torque-site/pom.xml> to org.apache.torque/torque-site/4.1-SNAPSHOT/torque-site-4.1-SNAPSHOT.pom
[JENKINS] Archiving <https://builds.apache.org/job/Torque4-trunk/ws/torque4-trunk/torque-generator/pom.xml> to org.apache.torque/torque-generator/4.1-SNAPSHOT/torque-generator-4.1-SNAPSHOT.pom
[JENKINS] Archiving <https://builds.apache.org/job/Torque4-trunk/ws/torque4-trunk/torque-templates/pom.xml> to org.apache.torque/torque-templates/4.1-SNAPSHOT/torque-templates-4.1-SNAPSHOT.pom
[JENKINS] Archiving <https://builds.apache.org/job/Torque4-trunk/ws/torque4-trunk/torque-runtime/pom.xml> to org.apache.torque/torque-runtime/4.1-SNAPSHOT/torque-runtime-4.1-SNAPSHOT.pom
[JENKINS] Archiving <https://builds.apache.org/job/Torque4-trunk/ws/torque4-trunk/torque-ant-tasks/pom.xml> to org.apache.torque/torque-ant-tasks/4.1-SNAPSHOT/torque-ant-tasks-4.1-SNAPSHOT.pom
Sending e-mails to: torque-dev@db.apache.org
channel stopped
Skipping Cobertura coverage report as build was not UNSTABLE or better ...

---------------------------------------------------------------------
To unsubscribe, e-mail: torque-dev-unsubscribe@db.apache.org
For additional commands, e-mail: torque-dev-help@db.apache.org


Build failed in Jenkins: Torque4-trunk #574

Posted by Apache Jenkins Server <je...@builds.apache.org>.
See <https://builds.apache.org/job/Torque4-trunk/574/changes>

Changes:

[tv] Start to fix JavaDoc of generated files

------------------------------------------
[...truncated 267 lines...]
[DEBUG] Looking for /parameters.properties using the class loader
[WARNING] Unable to find any resource with the name '/parameters.properties'
[DEBUG] Configuring the service component TorqueComponent
[DEBUG] Incarnating the service TorqueComponent
[DEBUG] Instantiating the implementation class for TorqueComponent
[DEBUG] Incarnating the service TorqueComponent
[DEBUG] LogEnabled.enableLogging() for TorqueComponent
[DEBUG] Contextualizable.contextualize() for TorqueComponent
[DEBUG] Configurable.configure() for TorqueComponent
[DEBUG] configure(TorqueComponent::<no value>:@null:20:22)
[DEBUG] Config File changes to src/test/resources/Torque.properties
[DEBUG] Config File is <https://builds.apache.org/job/Torque4-trunk/ws/torque4-trunk/torque-runtime/src/test/resources/Torque.properties>
[DEBUG] Initializable.initialize() for TorqueComponent
[DEBUG] initialize()
[DEBUG] YAAFI Avalon Service Container is up and running
[INFO] YaffiContainer ready.
[DEBUG] Located the service 'org.apache.torque.avalon.Torque' in the local container
[DEBUG] Disposing of container...
[DEBUG] Disposing all services
[DEBUG] Decommision the service TorqueComponent
[DEBUG] Decommisioning the service TorqueComponent
[DEBUG] Disposable.dispose() for TorqueComponent
[DEBUG] dispose()
[DEBUG] Disposing the service TorqueComponent
[DEBUG] All services are disposed
[INFO] YaffiContainer has been disposed.
Tests run: 2, Failures: 0, Errors: 0, Skipped: 0, Time elapsed: 0.247 sec - in org.apache.torque.avalon.AvalonTest
Running org.apache.torque.criteria.CriteriaTest
Tests run: 33, Failures: 0, Errors: 0, Skipped: 0, Time elapsed: 0.316 sec - in org.apache.torque.criteria.CriteriaTest
Running org.apache.torque.criteria.CriterionTest
Tests run: 10, Failures: 0, Errors: 0, Skipped: 0, Time elapsed: 0.161 sec - in org.apache.torque.criteria.CriterionTest
Running org.apache.torque.criteria.JoinTest
Tests run: 2, Failures: 0, Errors: 0, Skipped: 0, Time elapsed: 0.135 sec - in org.apache.torque.criteria.JoinTest
Running org.apache.torque.TorqueRuntimeExceptionTest
Tests run: 1, Failures: 0, Errors: 0, Skipped: 0, Time elapsed: 0.12 sec - in org.apache.torque.TorqueRuntimeExceptionTest
Running org.apache.torque.sql.SqlBuilderTest
Tests run: 130, Failures: 0, Errors: 0, Skipped: 0, Time elapsed: 0.358 sec - in org.apache.torque.sql.SqlBuilderTest
Running org.apache.torque.sql.QueryTest
Tests run: 2, Failures: 0, Errors: 0, Skipped: 0, Time elapsed: 0.126 sec - in org.apache.torque.sql.QueryTest
Running org.apache.torque.om.ComboKeyTest
Tests run: 9, Failures: 0, Errors: 0, Skipped: 0, Time elapsed: 0.024 sec - in org.apache.torque.om.ComboKeyTest
Running org.apache.torque.om.NumberKeyTest
Tests run: 23, Failures: 0, Errors: 0, Skipped: 0, Time elapsed: 0.023 sec - in org.apache.torque.om.NumberKeyTest
Running org.apache.torque.om.mapper.IntegerMapperTest
Tests run: 3, Failures: 0, Errors: 0, Skipped: 0, Time elapsed: 0.353 sec - in org.apache.torque.om.mapper.IntegerMapperTest
Running org.apache.torque.om.mapper.DateMapperTest
Tests run: 3, Failures: 0, Errors: 0, Skipped: 0, Time elapsed: 0.36 sec - in org.apache.torque.om.mapper.DateMapperTest
Running org.apache.torque.om.mapper.ObjectListMapperTest
Tests run: 12, Failures: 0, Errors: 0, Skipped: 0, Time elapsed: 0.462 sec - in org.apache.torque.om.mapper.ObjectListMapperTest
Running org.apache.torque.om.mapper.CompositeMapperTest
Tests run: 2, Failures: 0, Errors: 0, Skipped: 0, Time elapsed: 0.349 sec - in org.apache.torque.om.mapper.CompositeMapperTest
Running org.apache.torque.om.mapper.LongMapperTest
Tests run: 3, Failures: 0, Errors: 0, Skipped: 0, Time elapsed: 0.364 sec - in org.apache.torque.om.mapper.LongMapperTest
Running org.apache.torque.om.mapper.StringMapperTest
Tests run: 3, Failures: 0, Errors: 0, Skipped: 0, Time elapsed: 0.338 sec - in org.apache.torque.om.mapper.StringMapperTest
Running org.apache.torque.om.mapper.BigDecimalMapperTest
Tests run: 3, Failures: 0, Errors: 0, Skipped: 0, Time elapsed: 0.374 sec - in org.apache.torque.om.mapper.BigDecimalMapperTest
Running org.apache.torque.util.UniqueListTest
Tests run: 2, Failures: 0, Errors: 0, Skipped: 0, Time elapsed: 0.012 sec - in org.apache.torque.util.UniqueListTest
Running org.apache.torque.util.functions.AggregateFunctionTest
Tests run: 12, Failures: 0, Errors: 0, Skipped: 0, Time elapsed: 0.023 sec - in org.apache.torque.util.functions.AggregateFunctionTest
Running org.apache.torque.util.functions.MinTest
Tests run: 4, Failures: 0, Errors: 0, Skipped: 0, Time elapsed: 0.019 sec - in org.apache.torque.util.functions.MinTest
Running org.apache.torque.util.functions.MaxTest
Tests run: 4, Failures: 0, Errors: 0, Skipped: 0, Time elapsed: 0.022 sec - in org.apache.torque.util.functions.MaxTest
Running org.apache.torque.util.functions.AbstractFunctionTest
Tests run: 11, Failures: 0, Errors: 0, Skipped: 0, Time elapsed: 0.027 sec - in org.apache.torque.util.functions.AbstractFunctionTest
Running org.apache.torque.util.functions.CountTest
Tests run: 4, Failures: 0, Errors: 0, Skipped: 0, Time elapsed: 0.02 sec - in org.apache.torque.util.functions.CountTest
Running org.apache.torque.util.functions.SumTest
Tests run: 4, Failures: 0, Errors: 0, Skipped: 0, Time elapsed: 0.019 sec - in org.apache.torque.util.functions.SumTest
Running org.apache.torque.util.functions.AvgTest
Tests run: 4, Failures: 0, Errors: 0, Skipped: 0, Time elapsed: 0.02 sec - in org.apache.torque.util.functions.AvgTest
Running org.apache.torque.util.BasePeerImplTest
Tests run: 16, Failures: 0, Errors: 0, Skipped: 0, Time elapsed: 0.505 sec - in org.apache.torque.util.BasePeerImplTest
Running org.apache.torque.util.SummaryHelperTest
Tests run: 1, Failures: 0, Errors: 0, Skipped: 0, Time elapsed: 0.432 sec - in org.apache.torque.util.SummaryHelperTest

Results :

Tests run: 365, Failures: 0, Errors: 0, Skipped: 0

[JENKINS] Recording test results
[INFO] 
[INFO] --- maven-jar-plugin:3.0.0:jar (default-jar) @ torque-runtime ---
[INFO] Building jar: <https://builds.apache.org/job/Torque4-trunk/ws/torque4-trunk/torque-runtime/target/torque-runtime-4.1-SNAPSHOT.jar>
[INFO] 
[INFO] --- maven-site-plugin:3.5.1:attach-descriptor (attach-descriptor) @ torque-runtime ---
[INFO] 
[INFO] --- maven-source-plugin:3.0.0:jar-no-fork (attach-sources) @ torque-runtime ---
[INFO] Building jar: <https://builds.apache.org/job/Torque4-trunk/ws/torque4-trunk/torque-runtime/target/torque-runtime-4.1-SNAPSHOT-sources.jar>
[INFO] 
[INFO] --- apache-rat-plugin:0.11:check (default) @ torque-runtime ---
[INFO] 51 implicit excludes (use -debug for more details).
[INFO] Exclude: velocity.log
[INFO] Exclude: .checkstyle
[INFO] Exclude: checkstyle-cache.ccf
[INFO] Exclude: derby.log
[INFO] Exclude: LICENSE-EDL.txt
[INFO] Exclude: DEPENDENCIES
[INFO] Exclude: torque-test/target/**/*
[INFO] Exclude: torque-test/.classpath
[INFO] Exclude: torque-test/.project
[INFO] Exclude: torque-test/.settings/**
[INFO] Exclude: torque-test/src/main/generated-java/**/*
[INFO] Exclude: torque-test/derby.log
[INFO] 182 resources included (use -debug for more details)
[INFO] Rat check: Summary of files. Unapproved: 0 unknown: 0 generated: 0 approved: 180 licence.
[CHECKSTYLE] No report found for mojo check
[PMD] No report found for mojo check[INFO] 
[INFO] --- maven-install-plugin:2.5.2:install (default-install) @ torque-runtime ---

[INFO] Installing <https://builds.apache.org/job/Torque4-trunk/ws/torque4-trunk/torque-runtime/target/torque-runtime-4.1-SNAPSHOT.jar> to /home/jenkins/jenkins-slave/maven-repositories/1/org/apache/torque/torque-runtime/4.1-SNAPSHOT/torque-runtime-4.1-SNAPSHOT.jar
[INFO] Installing <https://builds.apache.org/job/Torque4-trunk/ws/torque4-trunk/torque-runtime/pom.xml> to /home/jenkins/jenkins-slave/maven-repositories/1/org/apache/torque/torque-runtime/4.1-SNAPSHOT/torque-runtime-4.1-SNAPSHOT.pom
[INFO] Installing <https://builds.apache.org/job/Torque4-trunk/ws/torque4-trunk/torque-runtime/target/torque-runtime-4.1-SNAPSHOT-sources.jar> to /home/jenkins/jenkins-slave/maven-repositories/1/org/apache/torque/torque-runtime/4.1-SNAPSHOT/torque-runtime-4.1-SNAPSHOT-sources.jar
[INFO] 
[INFO] >>> cobertura-maven-plugin:2.3:cobertura (default-cli) > [cobertura]test @ torque-runtime >>>
[INFO] 
[INFO] --- maven-remote-resources-plugin:1.5:process (process-resource-bundles) @ torque-runtime ---
[INFO] 
[INFO] --- maven-resources-plugin:2.7:resources (default-resources) @ torque-runtime ---
[INFO] Using 'ISO-8859-1' encoding to copy filtered resources.
[INFO] skip non existing resourceDirectory <https://builds.apache.org/job/Torque4-trunk/ws/torque4-trunk/torque-runtime/src/main/resources>
[INFO] Copying 3 resources
[INFO] Copying 3 resources
[INFO] 
[INFO] --- maven-compiler-plugin:3.5.1:compile (default-compile) @ torque-runtime ---
[INFO] Nothing to compile - all classes are up to date
[INFO] 
[INFO] --- cobertura-maven-plugin:2.3:instrument (default-cli) @ torque-runtime ---
[INFO] Cobertura 1.9.2 - GNU GPL License (NO WARRANTY) - See COPYRIGHT file
Instrumenting 122 files to <https://builds.apache.org/job/Torque4-trunk/ws/torque4-trunk/torque-runtime/target/generated-classes/cobertura>
Cobertura: Saved information on 122 classes.
Instrument time: 430ms

[INFO] Instrumentation was successful.
[INFO] 
[INFO] --- maven-resources-plugin:2.7:testResources (default-testResources) @ torque-runtime ---
[INFO] Using 'ISO-8859-1' encoding to copy filtered resources.
[INFO] Copying 5 resources
[INFO] Copying 3 resources
[INFO] Copying 3 resources
[INFO] 
[INFO] --- maven-compiler-plugin:3.5.1:testCompile (default-testCompile) @ torque-runtime ---
[INFO] Nothing to compile - all classes are up to date
[INFO] 
[INFO] --- maven-surefire-plugin:2.19.1:test (default-test) @ torque-runtime ---

-------------------------------------------------------
 T E S T S
-------------------------------------------------------

Results :

Tests run: 0, Failures: 0, Errors: 0, Skipped: 0

[JENKINS] Recording test results
[INFO] ------------------------------------------------------------------------
[INFO] Reactor Summary:
[INFO] 
[INFO] Torque Maven Parent ................................ SUCCESS [ 24.624 s]
[INFO] Torque Runtime ..................................... FAILURE [ 39.566 s]
[INFO] Torque Generator ................................... SKIPPED
[INFO] Torque Templates ................................... SKIPPED
[INFO] Torque Generator Maven 2 Plugin .................... SKIPPED
[INFO] Torque Generator Ant tasks ......................... SKIPPED
[INFO] Torque Site ........................................ SKIPPED
[INFO] ------------------------------------------------------------------------
[INFO] BUILD FAILURE
[INFO] ------------------------------------------------------------------------
[INFO] Total time: 01:16 min
[INFO] Finished at: 2016-12-16T16:25:13+00:00
[INFO] Final Memory: 60M/625M
[INFO] ------------------------------------------------------------------------
Waiting for Jenkins to finish collecting data
[ERROR] Failed to execute goal org.apache.maven.plugins:maven-surefire-plugin:2.19.1:test (default-test) on project torque-runtime: Execution default-test of goal org.apache.maven.plugins:maven-surefire-plugin:2.19.1:test failed: There was an error in the forked process
[ERROR] java.lang.VerifyError:
[ERROR] Expecting a stackmap frame at branch target 107
[ERROR] Exception Details:
[ERROR] Location:
[ERROR] org/apache/torque/manager/AbstractBaseManager.getOMInstance(Lorg/apache/torque/om/ObjectKey;Z)Lorg/apache/torque/om/Persistent; @48: ifeq
[ERROR] Reason:
[ERROR] Expected stackmap frame at this location.
[ERROR] Bytecode:
[ERROR] 0x0000000: 033e 11ff ff36 04b8 002e 1230 b600 3411
[ERROR] 0x0000010: 00d7 b600 3a01 3a05 b800 2e12 30b6 0034
[ERROR] 0x0000020: 1100 d8b6 003a 1c11 00d8 3e11 0000 3604
[ERROR] 0x0000030: 9900 3b1d 1100 d8a0 001f 1504 1100 00a0
[ERROR] 0x0000040: 0017 b800 2e12 30b6 0034 1d15 0404 b600
[ERROR] 0x0000050: 9c11 ffff 3604 b800 2e12 30b6 0034 1100
[ERROR] 0x0000060: dab6 003a 2a2b b600 b23a 0515 049b 0017
[ERROR] 0x0000070: b800 2e12 30b6 0034 1d15 0403 b600 9c11
[ERROR] 0x0000080: ffff 3604 b800 2e12 30b6 0034 1100 ddb6
[ERROR] 0x0000090: 003a 1905 1100 dd3e 1100 0036 04c7 008e
[ERROR] 0x00000a0: 1d11 00dd a000 1f15 0411 0000 a000 17b8
[ERROR] 0x00000b0: 002e 1230 b600 341d 1504 04b6 009c 11ff
[ERROR] 0x00000c0: ff36 04b8 002e 1230 b600 3411 00df b600
[ERROR] 0x00000d0: 3a2a 2bb6 00b5 3a05 b800 2e12 30b6 0034
[ERROR] 0x00000e0: 1100 e0b6 003a 1c11 00e0 3e11 0000 3604
[ERROR] 0x00000f0: 9900 3b1d 1100 e0a0 001f 1504 1100 00a0
[ERROR] 0x0000100: 0017 b800 2e12 30b6 0034 1d15 0404 b600
[ERROR] 0x0000110: 9c11 ffff 3604 b800 2e12 30b6 0034 1100
[ERROR] 0x0000120: e2b6 003a 2a19 05b6 00b9 5715 049b 0017
[ERROR] 0x0000130: b800 2e12 30b6 0034 1d15 0403 b600 9c11
[ERROR] 0x0000140: ffff 3604 b800 2e12 30b6 0034 1100 e6b6
[ERROR] 0x0000150: 003a 1905 b0
[ERROR] Stackmap Table:
[ERROR] append_frame(@146,Object[#114])
[ERROR] same_frame_extended(@338)
[ERROR] 
[ERROR] at java.lang.Class.getDeclaredMethods0(Native Method)
[ERROR] at java.lang.Class.privateGetDeclaredMethods(Class.java:2701)
[ERROR] at java.lang.Class.privateGetMethodRecursive(Class.java:3048)
[ERROR] at java.lang.Class.getMethod0(Class.java:3018)
[ERROR] at java.lang.Class.getMethod(Class.java:1784)
[ERROR] at org.apache.maven.surefire.util.ReflectionUtils.tryGetMethod(ReflectionUtils.java:61)
[ERROR] at org.apache.maven.surefire.common.junit3.JUnit3TestChecker.isSuiteOnly(JUnit3TestChecker.java:64)
[ERROR] at org.apache.maven.surefire.common.junit3.JUnit3TestChecker.isValidJUnit3Test(JUnit3TestChecker.java:59)
[ERROR] at org.apache.maven.surefire.common.junit3.JUnit3TestChecker.accept(JUnit3TestChecker.java:54)
[ERROR] at org.apache.maven.surefire.junit.PojoAndJUnit3Checker.accept(PojoAndJUnit3Checker.java:43)
[ERROR] at org.apache.maven.surefire.util.DefaultScanResult.applyFilter(DefaultScanResult.java:98)
[ERROR] at org.apache.maven.surefire.junit.JUnit3Provider.scanClassPath(JUnit3Provider.java:143)
[ERROR] at org.apache.maven.surefire.junit.JUnit3Provider.invoke(JUnit3Provider.java:87)
[ERROR] at org.apache.maven.surefire.booter.ForkedBooter.invokeProviderInSameClassLoader(ForkedBooter.java:290)
[ERROR] at org.apache.maven.surefire.booter.ForkedBooter.runSuitesInProcess(ForkedBooter.java:242)
[ERROR] at org.apache.maven.surefire.booter.ForkedBooter.main(ForkedBooter.java:121)
[ERROR] -> [Help 1]
[ERROR] 
[ERROR] To see the full stack trace of the errors, re-run Maven with the -e switch.
[ERROR] Re-run Maven using the -X switch to enable full debug logging.
[ERROR] 
[ERROR] For more information about the errors and possible solutions, please read the following articles:
[ERROR] [Help 1] http://cwiki.apache.org/confluence/display/MAVEN/PluginExecutionException
[ERROR] 
[ERROR] After correcting the problems, you can resume the build with the command
[ERROR]   mvn <goals> -rf :torque-runtime
[JENKINS] Archiving <https://builds.apache.org/job/Torque4-trunk/ws/torque4-trunk/torque-maven-plugin/pom.xml> to org.apache.torque/torque-maven-plugin/4.1-SNAPSHOT/torque-maven-plugin-4.1-SNAPSHOT.pom
[JENKINS] Archiving <https://builds.apache.org/job/Torque4-trunk/ws/torque4-trunk/pom.xml> to org.apache.torque/torque/4.1-SNAPSHOT/torque-4.1-SNAPSHOT.pom
<https://builds.apache.org/job/Torque4-trunk/ws/torque4-trunk/pom.xml> is not inside <https://builds.apache.org/job/Torque4-trunk/ws/torque4-trunk/torque4-trunk/;> will archive in a separate pass
[JENKINS] Archiving <https://builds.apache.org/job/Torque4-trunk/ws/torque4-trunk/torque-site/pom.xml> to org.apache.torque/torque-site/4.1-SNAPSHOT/torque-site-4.1-SNAPSHOT.pom
[JENKINS] Archiving <https://builds.apache.org/job/Torque4-trunk/ws/torque4-trunk/torque-generator/pom.xml> to org.apache.torque/torque-generator/4.1-SNAPSHOT/torque-generator-4.1-SNAPSHOT.pom
[JENKINS] Archiving <https://builds.apache.org/job/Torque4-trunk/ws/torque4-trunk/torque-templates/pom.xml> to org.apache.torque/torque-templates/4.1-SNAPSHOT/torque-templates-4.1-SNAPSHOT.pom
[JENKINS] Archiving <https://builds.apache.org/job/Torque4-trunk/ws/torque4-trunk/torque-runtime/pom.xml> to org.apache.torque/torque-runtime/4.1-SNAPSHOT/torque-runtime-4.1-SNAPSHOT.pom
[JENKINS] Archiving <https://builds.apache.org/job/Torque4-trunk/ws/torque4-trunk/torque-runtime/target/torque-runtime-4.1-SNAPSHOT.jar> to org.apache.torque/torque-runtime/4.1-SNAPSHOT/torque-runtime-4.1-SNAPSHOT.jar
[JENKINS] Archiving <https://builds.apache.org/job/Torque4-trunk/ws/torque4-trunk/torque-runtime/target/torque-runtime-4.1-SNAPSHOT-sources.jar> to org.apache.torque/torque-runtime/4.1-SNAPSHOT/torque-runtime-4.1-SNAPSHOT-sources.jar
[JENKINS] Archiving <https://builds.apache.org/job/Torque4-trunk/ws/torque4-trunk/torque-ant-tasks/pom.xml> to org.apache.torque/torque-ant-tasks/4.1-SNAPSHOT/torque-ant-tasks-4.1-SNAPSHOT.pom
Sending e-mails to: torque-dev@db.apache.org
channel stopped
Skipping Cobertura coverage report as build was not UNSTABLE or better ...

---------------------------------------------------------------------
To unsubscribe, e-mail: torque-dev-unsubscribe@db.apache.org
For additional commands, e-mail: torque-dev-help@db.apache.org


Build failed in Jenkins: Torque4-trunk #573

Posted by Apache Jenkins Server <je...@builds.apache.org>.
See <https://builds.apache.org/job/Torque4-trunk/573/changes>

Changes:

[tv] Update commons-jcs to 2.0-beta-2

------------------------------------------
[...truncated 2345 lines...]
Nov 17, 2016 7:24:24 PM org.apache.commons.jcs.engine.control.CompositeCacheManager doConfigure
INFO: setting defaultCompositeCacheAttributes to [ useLateral = true, useRemote = true, useDisk = true, maxObjs = 1000, maxSpoolPerRun = -1, diskUsagePattern = SWAP, spoolChunkSize = 2 ]
Nov 17, 2016 7:24:24 PM org.apache.commons.jcs.engine.control.CompositeCacheConfigurator parseElementAttributes
INFO: No special ElementAttribute class defined for key [jcs.default.elementattributes], using default class.
Nov 17, 2016 7:24:24 PM org.apache.commons.jcs.engine.control.CompositeCacheManager doConfigure
INFO: setting defaultElementAttributes to [ IS_LATERAL = true, IS_SPOOL = true, IS_REMOTE = true, IS_ETERNAL = true, MaxLifeSeconds = -1, IdleTime = -1, CreateTime = 1479410664832, LastAccessTime = 1479410664832, getTimeToLiveSeconds() = -1, createTime = 1479410664832 ]
Nov 17, 2016 7:24:24 PM org.apache.commons.jcs.engine.control.CompositeCacheConfigurator parseElementAttributes
INFO: No special ElementAttribute class defined for key [jcs.region.testCache1.elementattributes], using default class.
Nov 17, 2016 7:24:24 PM org.apache.commons.jcs.engine.memory.AbstractDoubleLinkedListMemoryCache initialize
INFO: initialized MemoryCache for testCache1
Nov 17, 2016 7:24:24 PM org.apache.commons.jcs.engine.control.CompositeCache <init>
INFO: Constructed cache with name [testCache1] and cache attributes [ useLateral = true, useRemote = true, useDisk = true, maxObjs = 1000, maxSpoolPerRun = -1, diskUsagePattern = SWAP, spoolChunkSize = 2 ]
Nov 17, 2016 7:24:24 PM org.apache.commons.jcs.engine.control.CompositeCacheConfigurator parseRegions
INFO: Parsed regions [testCache1]
Nov 17, 2016 7:24:24 PM org.apache.commons.jcs.engine.control.CompositeCacheManager doConfigure
INFO: Finished configuration in 29 ms.
Tests run: 9, Failures: 0, Errors: 0, Skipped: 0, Time elapsed: 0.309 sec - in org.apache.torque.manager.AbstractBaseManagerTest
Running org.apache.torque.manager.TestManager
Tests run: 0, Failures: 0, Errors: 0, Skipped: 0, Time elapsed: 0 sec - in org.apache.torque.manager.TestManager
Running org.apache.torque.manager.TestPersistent
Tests run: 0, Failures: 0, Errors: 0, Skipped: 0, Time elapsed: 0.001 sec - in org.apache.torque.manager.TestPersistent
Running org.apache.torque.manager.MethodResultCacheTest
Nov 17, 2016 7:24:26 PM org.apache.commons.jcs.engine.control.CompositeCacheManager getInstance
INFO: Instance is null, creating with config [/cache.ccf]
Nov 17, 2016 7:24:27 PM org.apache.commons.jcs.engine.control.CompositeCacheManager configure
INFO: Creating cache manager from config file: /cache.ccf
Nov 17, 2016 7:24:27 PM org.apache.commons.jcs.utils.threadpool.ThreadPoolManager loadConfig
INFO: thread_pool.default PoolConfiguration = useBoundary = [false] boundarySize = [2000] maximumPoolSize = [150] minimumPoolSize = [4] keepAliveTime = [300000] whenBlockedPolicy = [RUN] startUpSize = [4]
Nov 17, 2016 7:24:27 PM org.apache.commons.jcs.engine.control.CompositeCacheManager doConfigure
INFO: Setting default auxiliaries to 
Nov 17, 2016 7:24:27 PM org.apache.commons.jcs.engine.control.CompositeCacheManager doConfigure
INFO: setting defaultCompositeCacheAttributes to [ useLateral = true, useRemote = true, useDisk = true, maxObjs = 1000, maxSpoolPerRun = -1, diskUsagePattern = SWAP, spoolChunkSize = 2 ]
Nov 17, 2016 7:24:27 PM org.apache.commons.jcs.engine.control.CompositeCacheConfigurator parseElementAttributes
INFO: No special ElementAttribute class defined for key [jcs.default.elementattributes], using default class.
Nov 17, 2016 7:24:27 PM org.apache.commons.jcs.engine.control.CompositeCacheManager doConfigure
INFO: setting defaultElementAttributes to [ IS_LATERAL = true, IS_SPOOL = true, IS_REMOTE = true, IS_ETERNAL = true, MaxLifeSeconds = -1, IdleTime = -1, CreateTime = 1479410667024, LastAccessTime = 1479410667024, getTimeToLiveSeconds() = -1, createTime = 1479410667024 ]
Nov 17, 2016 7:24:27 PM org.apache.commons.jcs.engine.control.CompositeCacheConfigurator parseElementAttributes
INFO: No special ElementAttribute class defined for key [jcs.region.testCache1.elementattributes], using default class.
Nov 17, 2016 7:24:27 PM org.apache.commons.jcs.engine.memory.AbstractDoubleLinkedListMemoryCache initialize
INFO: initialized MemoryCache for testCache1
Nov 17, 2016 7:24:27 PM org.apache.commons.jcs.engine.control.CompositeCache <init>
INFO: Constructed cache with name [testCache1] and cache attributes [ useLateral = true, useRemote = true, useDisk = true, maxObjs = 1000, maxSpoolPerRun = -1, diskUsagePattern = SWAP, spoolChunkSize = 2 ]
Nov 17, 2016 7:24:27 PM org.apache.commons.jcs.engine.control.CompositeCacheConfigurator parseRegions
INFO: Parsed regions [testCache1]
Nov 17, 2016 7:24:27 PM org.apache.commons.jcs.engine.control.CompositeCacheManager doConfigure
INFO: Finished configuration in 30 ms.
Tests run: 3, Failures: 0, Errors: 0, Skipped: 0, Time elapsed: 0.311 sec - in org.apache.torque.manager.MethodResultCacheTest
Running org.apache.torque.TorqueInstanceTest
Tests run: 5, Failures: 0, Errors: 0, Skipped: 0, Time elapsed: 0.154 sec - in org.apache.torque.TorqueInstanceTest
Running org.apache.torque.map.ColumnMapTest
Tests run: 3, Failures: 0, Errors: 0, Skipped: 0, Time elapsed: 0.157 sec - in org.apache.torque.map.ColumnMapTest
Running org.apache.torque.om.mapper.LongMapperTest
Tests run: 3, Failures: 0, Errors: 0, Skipped: 0, Time elapsed: 0.37 sec - in org.apache.torque.om.mapper.LongMapperTest
Running org.apache.torque.om.mapper.StringMapperTest
Tests run: 3, Failures: 0, Errors: 0, Skipped: 0, Time elapsed: 0.368 sec - in org.apache.torque.om.mapper.StringMapperTest
Running org.apache.torque.om.mapper.IntegerMapperTest
Tests run: 3, Failures: 0, Errors: 0, Skipped: 0, Time elapsed: 0.385 sec - in org.apache.torque.om.mapper.IntegerMapperTest
Running org.apache.torque.om.mapper.CompositeMapperTest
Tests run: 2, Failures: 0, Errors: 0, Skipped: 0, Time elapsed: 0.341 sec - in org.apache.torque.om.mapper.CompositeMapperTest
Running org.apache.torque.om.mapper.BigDecimalMapperTest
Tests run: 3, Failures: 0, Errors: 0, Skipped: 0, Time elapsed: 0.35 sec - in org.apache.torque.om.mapper.BigDecimalMapperTest
Running org.apache.torque.om.mapper.DateMapperTest
Tests run: 3, Failures: 0, Errors: 0, Skipped: 0, Time elapsed: 0.351 sec - in org.apache.torque.om.mapper.DateMapperTest
Running org.apache.torque.om.mapper.ObjectListMapperTest
Tests run: 12, Failures: 0, Errors: 0, Skipped: 0, Time elapsed: 0.484 sec - in org.apache.torque.om.mapper.ObjectListMapperTest
Running org.apache.torque.om.NumberKeyTest
Tests run: 23, Failures: 0, Errors: 0, Skipped: 0, Time elapsed: 0.034 sec - in org.apache.torque.om.NumberKeyTest
Running org.apache.torque.om.ComboKeyTest
Tests run: 9, Failures: 0, Errors: 0, Skipped: 0, Time elapsed: 0.025 sec - in org.apache.torque.om.ComboKeyTest
Running org.apache.torque.criteria.CriterionTest
Tests run: 10, Failures: 0, Errors: 0, Skipped: 0, Time elapsed: 0.175 sec - in org.apache.torque.criteria.CriterionTest
Running org.apache.torque.criteria.CriteriaTest
Tests run: 33, Failures: 0, Errors: 0, Skipped: 0, Time elapsed: 0.348 sec - in org.apache.torque.criteria.CriteriaTest
Running org.apache.torque.criteria.JoinTest
Tests run: 2, Failures: 0, Errors: 0, Skipped: 0, Time elapsed: 0.141 sec - in org.apache.torque.criteria.JoinTest
Running org.apache.torque.TorqueRuntimeExceptionTest
Tests run: 1, Failures: 0, Errors: 0, Skipped: 0, Time elapsed: 0.124 sec - in org.apache.torque.TorqueRuntimeExceptionTest
Running org.apache.torque.ColumnImplTest
Tests run: 41, Failures: 0, Errors: 0, Skipped: 0, Time elapsed: 0.222 sec - in org.apache.torque.ColumnImplTest

Results :

Tests run: 365, Failures: 0, Errors: 0, Skipped: 0

[JENKINS] Recording test results
[INFO] 
[INFO] --- maven-jar-plugin:3.0.0:jar (default-jar) @ torque-runtime ---
[INFO] Building jar: <https://builds.apache.org/job/Torque4-trunk/ws/torque4-trunk/torque-runtime/target/torque-runtime-4.1-SNAPSHOT.jar>
[INFO] 
[INFO] --- maven-site-plugin:3.5.1:attach-descriptor (attach-descriptor) @ torque-runtime ---
[INFO] 
[INFO] --- maven-source-plugin:3.0.0:jar-no-fork (attach-sources) @ torque-runtime ---
[INFO] Building jar: <https://builds.apache.org/job/Torque4-trunk/ws/torque4-trunk/torque-runtime/target/torque-runtime-4.1-SNAPSHOT-sources.jar>
[INFO] 
[INFO] --- apache-rat-plugin:0.11:check (default) @ torque-runtime ---
[INFO] 51 implicit excludes (use -debug for more details).
[INFO] Exclude: velocity.log
[INFO] Exclude: .checkstyle
[INFO] Exclude: checkstyle-cache.ccf
[INFO] Exclude: derby.log
[INFO] Exclude: LICENSE-EDL.txt
[INFO] Exclude: DEPENDENCIES
[INFO] Exclude: torque-test/target/**/*
[INFO] Exclude: torque-test/.classpath
[INFO] Exclude: torque-test/.project
[INFO] Exclude: torque-test/.settings/**
[INFO] Exclude: torque-test/src/main/generated-java/**/*
[INFO] Exclude: torque-test/derby.log
[INFO] 182 resources included (use -debug for more details)
[INFO] Rat check: Summary of files. Unapproved: 0 unknown: 0 generated: 0 approved: 180 licence.
[CHECKSTYLE] No report found for mojo check
[PMD] No report found for mojo check[INFO] 
[INFO] --- maven-install-plugin:2.5.2:install (default-install) @ torque-runtime ---
[INFO] Installing <https://builds.apache.org/job/Torque4-trunk/ws/torque4-trunk/torque-runtime/target/torque-runtime-4.1-SNAPSHOT.jar> to /home/jenkins/jenkins-slave/maven-repositories/0/org/apache/torque/torque-runtime/4.1-SNAPSHOT/torque-runtime-4.1-SNAPSHOT.jar
[INFO] Installing <https://builds.apache.org/job/Torque4-trunk/ws/torque4-trunk/torque-runtime/pom.xml> to /home/jenkins/jenkins-slave/maven-repositories/0/org/apache/torque/torque-runtime/4.1-SNAPSHOT/torque-runtime-4.1-SNAPSHOT.pom

[INFO] Installing <https://builds.apache.org/job/Torque4-trunk/ws/torque4-trunk/torque-runtime/target/torque-runtime-4.1-SNAPSHOT-sources.jar> to /home/jenkins/jenkins-slave/maven-repositories/0/org/apache/torque/torque-runtime/4.1-SNAPSHOT/torque-runtime-4.1-SNAPSHOT-sources.jar
[INFO] 
[INFO] >>> cobertura-maven-plugin:2.3:cobertura (default-cli) > [cobertura]test @ torque-runtime >>>
[INFO] 
[INFO] --- maven-remote-resources-plugin:1.5:process (process-resource-bundles) @ torque-runtime ---
[INFO] 
[INFO] --- maven-resources-plugin:2.7:resources (default-resources) @ torque-runtime ---
[INFO] Using 'ISO-8859-1' encoding to copy filtered resources.
[INFO] skip non existing resourceDirectory <https://builds.apache.org/job/Torque4-trunk/ws/torque4-trunk/torque-runtime/src/main/resources>
[INFO] Copying 3 resources
[INFO] Copying 3 resources
[INFO] 
[INFO] --- maven-compiler-plugin:3.5.1:compile (default-compile) @ torque-runtime ---
[INFO] Nothing to compile - all classes are up to date
[INFO] 
[INFO] --- cobertura-maven-plugin:2.3:instrument (default-cli) @ torque-runtime ---
[INFO] Cobertura 1.9.2 - GNU GPL License (NO WARRANTY) - See COPYRIGHT file
Instrumenting 122 files to <https://builds.apache.org/job/Torque4-trunk/ws/torque4-trunk/torque-runtime/target/generated-classes/cobertura>
Cobertura: Saved information on 122 classes.
Instrument time: 412ms

[INFO] Instrumentation was successful.
[INFO] 
[INFO] --- maven-resources-plugin:2.7:testResources (default-testResources) @ torque-runtime ---
[INFO] Using 'ISO-8859-1' encoding to copy filtered resources.
[INFO] Copying 5 resources
[INFO] Copying 3 resources
[INFO] Copying 3 resources
[INFO] 
[INFO] --- maven-compiler-plugin:3.5.1:testCompile (default-testCompile) @ torque-runtime ---
[INFO] Nothing to compile - all classes are up to date
[INFO] 
[INFO] --- maven-surefire-plugin:2.19.1:test (default-test) @ torque-runtime ---

-------------------------------------------------------
 T E S T S
-------------------------------------------------------

Results :

Tests run: 0, Failures: 0, Errors: 0, Skipped: 0

[JENKINS] Recording test results
[INFO] ------------------------------------------------------------------------
[INFO] Reactor Summary:
[INFO] 
[INFO] Torque Maven Parent ................................ SUCCESS [ 18.877 s]
[INFO] Torque Runtime ..................................... FAILURE [ 39.615 s]
[INFO] Torque Generator ................................... SKIPPED
[INFO] Torque Templates ................................... SKIPPED
[INFO] Torque Generator Maven 2 Plugin .................... SKIPPED
[INFO] Torque Generator Ant tasks ......................... SKIPPED
[INFO] Torque Site ........................................ SKIPPED
[INFO] ------------------------------------------------------------------------
[INFO] BUILD FAILURE
[INFO] ------------------------------------------------------------------------
[INFO] Total time: 01:04 min
[INFO] Finished at: 2016-11-17T19:24:51+00:00
[INFO] Final Memory: 62M/797M
[INFO] ------------------------------------------------------------------------
Waiting for Jenkins to finish collecting data[ERROR] Failed to execute goal org.apache.maven.plugins:maven-surefire-plugin:2.19.1:test (default-test) on project torque-runtime: Execution default-test of goal org.apache.maven.plugins:maven-surefire-plugin:2.19.1:test failed: There was an error in the forked process
[ERROR] java.lang.VerifyError:
[ERROR] Expecting a stackmap frame at branch target 107
[ERROR] Exception Details:
[ERROR] Location:
[ERROR] org/apache/torque/manager/AbstractBaseManager.dispose()V @32: ifnull
[ERROR] Reason:
[ERROR] Expected stackmap frame at this location.
[ERROR] Bytecode:
[ERROR] 0x0000000: 033c 11ff ff3d b800 2e12 30b6 0034 1101
[ERROR] 0x0000010: 17b6 003a 2ab4 00c0 1101 173c 1100 003d
[ERROR] 0x0000020: c600 4b1b 1101 17a0 001c 1c11 0000 a000
[ERROR] 0x0000030: 15b8 002e 1230 b600 341b 1c04 b600 9c11
[ERROR] 0x0000040: ffff 3db8 002e 1230 b600 3411 0119 b600
[ERROR] 0x0000050: 3a2a b400 c0b6 00d3 b800 2e12 30b6 0034
[ERROR] 0x0000060: 1101 1ab6 003a 2a01 b500 c01c 9b00 15b8
[ERROR] 0x0000070: 002e 1230 b600 341b 1c03 b600 9c11 ffff
[ERROR] 0x0000080: 3db8 002e 1230 b600 3411 011d b600 3a2a
[ERROR] 0x0000090: b400 d511 011d 3c11 0000 3dc6 004b 1b11
[ERROR] 0x00000a0: 011d a000 1c1c 1100 00a0 0015 b800 2e12
[ERROR] 0x00000b0: 30b6 0034 1b1c 04b6 009c 11ff ff3d b800
[ERROR] 0x00000c0: 2e12 30b6 0034 1101 1fb6 003a 2ab4 00d5
[ERROR] 0x00000d0: b600 d8b8 002e 1230 b600 3411 0120 b600
[ERROR] 0x00000e0: 3a2a 01b5 00d5 1c9b 0015 b800 2e12 30b6
[ERROR] 0x00000f0: 0034 1b1c 03b6 009c 11ff ff3d b800 2e12
[ERROR] 0x0000100: 30b6 0034 1101 23b6 003a 2ab4 0043 b600
[ERROR] 0x0000110: d9b8 002e 1230 b600 3411 0124 b600 3a2a
[ERROR] 0x0000120: b400 48b9 00dc 0100 b800 2e12 30b6 0034
[ERROR] 0x0000130: 1101 25b6 003a b1
[ERROR] Stackmap Table:
[ERROR] same_frame_extended(@143)
[ERROR] same_frame_extended(@266)
[ERROR] 
[ERROR] at java.lang.Class.getDeclaredMethods0(Native Method)
[ERROR] at java.lang.Class.privateGetDeclaredMethods(Class.java:2701)
[ERROR] at java.lang.Class.privateGetMethodRecursive(Class.java:3048)
[ERROR] at java.lang.Class.getMethod0(Class.java:3018)
[ERROR] at java.lang.Class.getMethod(Class.java:1784)
[ERROR] at org.apache.maven.surefire.util.ReflectionUtils.tryGetMethod(ReflectionUtils.java:61)
[ERROR] at org.apache.maven.surefire.common.junit3.JUnit3TestChecker.isSuiteOnly(JUnit3TestChecker.java:64)
[ERROR] at org.apache.maven.surefire.common.junit3.JUnit3TestChecker.isValidJUnit3Test(JUnit3TestChecker.java:59)
[ERROR] at org.apache.maven.surefire.common.junit3.JUnit3TestChecker.accept(JUnit3TestChecker.java:54)
[ERROR] at org.apache.maven.surefire.junit.PojoAndJUnit3Checker.accept(PojoAndJUnit3Checker.java:43)
[ERROR] at org.apache.maven.surefire.util.DefaultScanResult.applyFilter(DefaultScanResult.java:98)
[ERROR] at org.apache.maven.surefire.junit.JUnit3Provider.scanClassPath(JUnit3Provider.java:143)
[ERROR] at org.apache.maven.surefire.junit.JUnit3Provider.invoke(JUnit3Provider.java:87)
[ERROR] at org.apache.maven.surefire.booter.ForkedBooter.invokeProviderInSameClassLoader(ForkedBooter.java:290)
[ERROR] at org.apache.maven.surefire.booter.ForkedBooter.runSuitesInProcess(ForkedBooter.java:242)
[ERROR] at org.apache.maven.surefire.booter.ForkedBooter.main(ForkedBooter.java:121)
[ERROR] -> [Help 1]
[ERROR] 
[ERROR] To see the full stack trace of the errors, re-run Maven with the -e switch.
[ERROR] Re-run Maven using the -X switch to enable full debug logging.
[ERROR] 
[ERROR] For more information about the errors and possible solutions, please read the following articles:
[ERROR] [Help 1] http://cwiki.apache.org/confluence/display/MAVEN/PluginExecutionException
[ERROR] 
[ERROR] After correcting the problems, you can resume the build with the command
[ERROR]   mvn <goals> -rf :torque-runtime

[JENKINS] Archiving <https://builds.apache.org/job/Torque4-trunk/ws/torque4-trunk/torque-maven-plugin/pom.xml> to org.apache.torque/torque-maven-plugin/4.1-SNAPSHOT/torque-maven-plugin-4.1-SNAPSHOT.pom
[JENKINS] Archiving <https://builds.apache.org/job/Torque4-trunk/ws/torque4-trunk/pom.xml> to org.apache.torque/torque/4.1-SNAPSHOT/torque-4.1-SNAPSHOT.pom
<https://builds.apache.org/job/Torque4-trunk/ws/torque4-trunk/pom.xml> is not inside <https://builds.apache.org/job/Torque4-trunk/ws/torque4-trunk/torque4-trunk/;> will archive in a separate pass
[JENKINS] Archiving <https://builds.apache.org/job/Torque4-trunk/ws/torque4-trunk/torque-site/pom.xml> to org.apache.torque/torque-site/4.1-SNAPSHOT/torque-site-4.1-SNAPSHOT.pom
[JENKINS] Archiving <https://builds.apache.org/job/Torque4-trunk/ws/torque4-trunk/torque-generator/pom.xml> to org.apache.torque/torque-generator/4.1-SNAPSHOT/torque-generator-4.1-SNAPSHOT.pom
[JENKINS] Archiving <https://builds.apache.org/job/Torque4-trunk/ws/torque4-trunk/torque-templates/pom.xml> to org.apache.torque/torque-templates/4.1-SNAPSHOT/torque-templates-4.1-SNAPSHOT.pom
[JENKINS] Archiving <https://builds.apache.org/job/Torque4-trunk/ws/torque4-trunk/torque-runtime/pom.xml> to org.apache.torque/torque-runtime/4.1-SNAPSHOT/torque-runtime-4.1-SNAPSHOT.pom
[JENKINS] Archiving <https://builds.apache.org/job/Torque4-trunk/ws/torque4-trunk/torque-runtime/target/torque-runtime-4.1-SNAPSHOT.jar> to org.apache.torque/torque-runtime/4.1-SNAPSHOT/torque-runtime-4.1-SNAPSHOT.jar
[JENKINS] Archiving <https://builds.apache.org/job/Torque4-trunk/ws/torque4-trunk/torque-runtime/target/torque-runtime-4.1-SNAPSHOT-sources.jar> to org.apache.torque/torque-runtime/4.1-SNAPSHOT/torque-runtime-4.1-SNAPSHOT-sources.jar
[JENKINS] Archiving <https://builds.apache.org/job/Torque4-trunk/ws/torque4-trunk/torque-ant-tasks/pom.xml> to org.apache.torque/torque-ant-tasks/4.1-SNAPSHOT/torque-ant-tasks-4.1-SNAPSHOT.pom
Sending e-mails to: torque-dev@db.apache.org
channel stopped
Skipping Cobertura coverage report as build was not UNSTABLE or better ...

---------------------------------------------------------------------
To unsubscribe, e-mail: torque-dev-unsubscribe@db.apache.org
For additional commands, e-mail: torque-dev-help@db.apache.org


Build failed in Jenkins: Torque4-trunk #572

Posted by Apache Jenkins Server <je...@builds.apache.org>.
See <https://builds.apache.org/job/Torque4-trunk/572/changes>

Changes:

[tv] TORQUE-347 Reduce synchronization

[tv] Avoid explicit synchronization

------------------------------------------
[...truncated 2231 lines...]
[DEBUG] Looking for /parameters.properties as absolute file location
[DEBUG] Looking for /parameters.properties using the class loader
[WARNING] Unable to find any resource with the name '/parameters.properties'
[DEBUG] Configuring the service component TorqueComponent
[DEBUG] Incarnating the service TorqueComponent
[DEBUG] Instantiating the implementation class for TorqueComponent
[DEBUG] Incarnating the service TorqueComponent
[DEBUG] LogEnabled.enableLogging() for TorqueComponent
[DEBUG] Contextualizable.contextualize() for TorqueComponent
[DEBUG] Configurable.configure() for TorqueComponent
[DEBUG] configure(TorqueComponent::<no value>:@null:20:22)
[DEBUG] Config File changes to src/test/resources/Torque.properties
[DEBUG] Config File is <https://builds.apache.org/job/Torque4-trunk/ws/torque4-trunk/torque-runtime/src/test/resources/Torque.properties>
[DEBUG] Initializable.initialize() for TorqueComponent
[DEBUG] initialize()
[DEBUG] YAAFI Avalon Service Container is up and running
[INFO] YaffiContainer ready.
[DEBUG] Located the service 'org.apache.torque.avalon.Torque' in the local container
[DEBUG] Disposing of container...
[DEBUG] Disposing all services
[DEBUG] Decommision the service TorqueComponent
[DEBUG] Decommisioning the service TorqueComponent
[DEBUG] Disposable.dispose() for TorqueComponent
[DEBUG] dispose()
[DEBUG] Disposing the service TorqueComponent
[DEBUG] All services are disposed
[INFO] YaffiContainer has been disposed.
Tests run: 2, Failures: 0, Errors: 0, Skipped: 0, Time elapsed: 0.269 sec - in org.apache.torque.avalon.AvalonTest
Running org.apache.torque.criteria.CriteriaTest
Tests run: 33, Failures: 0, Errors: 0, Skipped: 0, Time elapsed: 0.33 sec - in org.apache.torque.criteria.CriteriaTest
Running org.apache.torque.criteria.CriterionTest
Tests run: 10, Failures: 0, Errors: 0, Skipped: 0, Time elapsed: 0.166 sec - in org.apache.torque.criteria.CriterionTest
Running org.apache.torque.criteria.JoinTest
Tests run: 2, Failures: 0, Errors: 0, Skipped: 0, Time elapsed: 0.128 sec - in org.apache.torque.criteria.JoinTest
Running org.apache.torque.TorqueRuntimeExceptionTest
Tests run: 1, Failures: 0, Errors: 0, Skipped: 0, Time elapsed: 0.119 sec - in org.apache.torque.TorqueRuntimeExceptionTest
Running org.apache.torque.sql.SqlBuilderTest
Tests run: 130, Failures: 0, Errors: 0, Skipped: 0, Time elapsed: 0.394 sec - in org.apache.torque.sql.SqlBuilderTest
Running org.apache.torque.sql.QueryTest
Tests run: 2, Failures: 0, Errors: 0, Skipped: 0, Time elapsed: 0.125 sec - in org.apache.torque.sql.QueryTest
Running org.apache.torque.om.ComboKeyTest
Tests run: 9, Failures: 0, Errors: 0, Skipped: 0, Time elapsed: 0.025 sec - in org.apache.torque.om.ComboKeyTest
Running org.apache.torque.om.NumberKeyTest
Tests run: 23, Failures: 0, Errors: 0, Skipped: 0, Time elapsed: 0.024 sec - in org.apache.torque.om.NumberKeyTest
Running org.apache.torque.om.mapper.IntegerMapperTest
Tests run: 3, Failures: 0, Errors: 0, Skipped: 0, Time elapsed: 0.359 sec - in org.apache.torque.om.mapper.IntegerMapperTest
Running org.apache.torque.om.mapper.DateMapperTest
Tests run: 3, Failures: 0, Errors: 0, Skipped: 0, Time elapsed: 0.355 sec - in org.apache.torque.om.mapper.DateMapperTest
Running org.apache.torque.om.mapper.ObjectListMapperTest
Tests run: 12, Failures: 0, Errors: 0, Skipped: 0, Time elapsed: 0.492 sec - in org.apache.torque.om.mapper.ObjectListMapperTest
Running org.apache.torque.om.mapper.CompositeMapperTest
Tests run: 2, Failures: 0, Errors: 0, Skipped: 0, Time elapsed: 0.363 sec - in org.apache.torque.om.mapper.CompositeMapperTest
Running org.apache.torque.om.mapper.LongMapperTest
Tests run: 3, Failures: 0, Errors: 0, Skipped: 0, Time elapsed: 0.336 sec - in org.apache.torque.om.mapper.LongMapperTest
Running org.apache.torque.om.mapper.StringMapperTest
Tests run: 3, Failures: 0, Errors: 0, Skipped: 0, Time elapsed: 0.365 sec - in org.apache.torque.om.mapper.StringMapperTest
Running org.apache.torque.om.mapper.BigDecimalMapperTest
Tests run: 3, Failures: 0, Errors: 0, Skipped: 0, Time elapsed: 0.405 sec - in org.apache.torque.om.mapper.BigDecimalMapperTest
Running org.apache.torque.util.UniqueListTest
Tests run: 2, Failures: 0, Errors: 0, Skipped: 0, Time elapsed: 0.012 sec - in org.apache.torque.util.UniqueListTest
Running org.apache.torque.util.functions.AggregateFunctionTest
Tests run: 12, Failures: 0, Errors: 0, Skipped: 0, Time elapsed: 0.024 sec - in org.apache.torque.util.functions.AggregateFunctionTest
Running org.apache.torque.util.functions.MinTest
Tests run: 4, Failures: 0, Errors: 0, Skipped: 0, Time elapsed: 0.02 sec - in org.apache.torque.util.functions.MinTest
Running org.apache.torque.util.functions.MaxTest
Tests run: 4, Failures: 0, Errors: 0, Skipped: 0, Time elapsed: 0.02 sec - in org.apache.torque.util.functions.MaxTest
Running org.apache.torque.util.functions.AbstractFunctionTest
Tests run: 11, Failures: 0, Errors: 0, Skipped: 0, Time elapsed: 0.026 sec - in org.apache.torque.util.functions.AbstractFunctionTest
Running org.apache.torque.util.functions.CountTest
Tests run: 4, Failures: 0, Errors: 0, Skipped: 0, Time elapsed: 0.02 sec - in org.apache.torque.util.functions.CountTest
Running org.apache.torque.util.functions.SumTest
Tests run: 4, Failures: 0, Errors: 0, Skipped: 0, Time elapsed: 0.019 sec - in org.apache.torque.util.functions.SumTest
Running org.apache.torque.util.functions.AvgTest
Tests run: 4, Failures: 0, Errors: 0, Skipped: 0, Time elapsed: 0.022 sec - in org.apache.torque.util.functions.AvgTest
Running org.apache.torque.util.BasePeerImplTest
Tests run: 16, Failures: 0, Errors: 0, Skipped: 0, Time elapsed: 0.499 sec - in org.apache.torque.util.BasePeerImplTest
Running org.apache.torque.util.SummaryHelperTest
Tests run: 1, Failures: 0, Errors: 0, Skipped: 0, Time elapsed: 0.409 sec - in org.apache.torque.util.SummaryHelperTest

Results :

Tests run: 365, Failures: 0, Errors: 0, Skipped: 0

[JENKINS] Recording test results
[INFO] 
[INFO] --- maven-jar-plugin:3.0.0:jar (default-jar) @ torque-runtime ---
[INFO] Building jar: <https://builds.apache.org/job/Torque4-trunk/ws/torque4-trunk/torque-runtime/target/torque-runtime-4.1-SNAPSHOT.jar>
[INFO] 
[INFO] --- maven-site-plugin:3.5.1:attach-descriptor (attach-descriptor) @ torque-runtime ---
[INFO] 
[INFO] --- maven-source-plugin:3.0.0:jar-no-fork (attach-sources) @ torque-runtime ---
[INFO] Building jar: <https://builds.apache.org/job/Torque4-trunk/ws/torque4-trunk/torque-runtime/target/torque-runtime-4.1-SNAPSHOT-sources.jar>
[INFO] 
[INFO] --- apache-rat-plugin:0.11:check (default) @ torque-runtime ---
[INFO] 51 implicit excludes (use -debug for more details).
[INFO] Exclude: velocity.log
[INFO] Exclude: .checkstyle
[INFO] Exclude: checkstyle-cache.ccf
[INFO] Exclude: derby.log
[INFO] Exclude: LICENSE-EDL.txt
[INFO] Exclude: DEPENDENCIES
[INFO] Exclude: torque-test/target/**/*
[INFO] Exclude: torque-test/.classpath
[INFO] Exclude: torque-test/.project
[INFO] Exclude: torque-test/.settings/**
[INFO] Exclude: torque-test/src/main/generated-java/**/*
[INFO] Exclude: torque-test/derby.log
[INFO] 182 resources included (use -debug for more details)
[INFO] Rat check: Summary of files. Unapproved: 0 unknown: 0 generated: 0 approved: 180 licence.
[CHECKSTYLE] No report found for mojo check
[PMD] No report found for mojo check[INFO] 
[INFO] --- maven-install-plugin:2.5.2:install (default-install) @ torque-runtime ---
[INFO] Installing <https://builds.apache.org/job/Torque4-trunk/ws/torque4-trunk/torque-runtime/target/torque-runtime-4.1-SNAPSHOT.jar> to /home/jenkins/jenkins-slave/maven-repositories/1/org/apache/torque/torque-runtime/4.1-SNAPSHOT/torque-runtime-4.1-SNAPSHOT.jar
[INFO] Installing <https://builds.apache.org/job/Torque4-trunk/ws/torque4-trunk/torque-runtime/pom.xml> to /home/jenkins/jenkins-slave/maven-repositories/1/org/apache/torque/torque-runtime/4.1-SNAPSHOT/torque-runtime-4.1-SNAPSHOT.pom
[INFO] Installing <https://builds.apache.org/job/Torque4-trunk/ws/torque4-trunk/torque-runtime/target/torque-runtime-4.1-SNAPSHOT-sources.jar> to /home/jenkins/jenkins-slave/maven-repositories/1/org/apache/torque/torque-runtime/4.1-SNAPSHOT/torque-runtime-4.1-SNAPSHOT-sources.jar

[INFO] 
[INFO] >>> cobertura-maven-plugin:2.3:cobertura (default-cli) > [cobertura]test @ torque-runtime >>>
[INFO] 
[INFO] --- maven-remote-resources-plugin:1.5:process (process-resource-bundles) @ torque-runtime ---
[INFO] 
[INFO] --- maven-resources-plugin:2.7:resources (default-resources) @ torque-runtime ---
[INFO] Using 'ISO-8859-1' encoding to copy filtered resources.
[INFO] skip non existing resourceDirectory <https://builds.apache.org/job/Torque4-trunk/ws/torque4-trunk/torque-runtime/src/main/resources>
[INFO] Copying 3 resources
[INFO] Copying 3 resources
[INFO] 
[INFO] --- maven-compiler-plugin:3.5.1:compile (default-compile) @ torque-runtime ---
[INFO] Nothing to compile - all classes are up to date
[INFO] 
[INFO] --- cobertura-maven-plugin:2.3:instrument (default-cli) @ torque-runtime ---
[INFO] Cobertura 1.9.2 - GNU GPL License (NO WARRANTY) - See COPYRIGHT file
Instrumenting 122 files to <https://builds.apache.org/job/Torque4-trunk/ws/torque4-trunk/torque-runtime/target/generated-classes/cobertura>
Cobertura: Saved information on 122 classes.
Instrument time: 516ms

[INFO] Instrumentation was successful.
[INFO] 
[INFO] --- maven-resources-plugin:2.7:testResources (default-testResources) @ torque-runtime ---
[INFO] Using 'ISO-8859-1' encoding to copy filtered resources.
[INFO] Copying 5 resources
[INFO] Copying 3 resources
[INFO] Copying 3 resources
[INFO] 
[INFO] --- maven-compiler-plugin:3.5.1:testCompile (default-testCompile) @ torque-runtime ---
[INFO] Nothing to compile - all classes are up to date
[INFO] 
[INFO] --- maven-surefire-plugin:2.19.1:test (default-test) @ torque-runtime ---

-------------------------------------------------------
 T E S T S
-------------------------------------------------------

Results :

Tests run: 0, Failures: 0, Errors: 0, Skipped: 0

[JENKINS] Recording test results
[INFO] ------------------------------------------------------------------------
[INFO] Reactor Summary:
[INFO] 
[INFO] Torque Maven Parent ................................ SUCCESS [ 19.089 s]
[INFO] Torque Runtime ..................................... FAILURE [ 37.758 s]
[INFO] Torque Generator ................................... SKIPPED
[INFO] Torque Templates ................................... SKIPPED
[INFO] Torque Generator Maven 2 Plugin .................... SKIPPED
[INFO] Torque Generator Ant tasks ......................... SKIPPED
[INFO] Torque Site ........................................ SKIPPED
[INFO] ------------------------------------------------------------------------
[INFO] BUILD FAILURE
[INFO] ------------------------------------------------------------------------
[INFO] Total time: 01:02 min
[INFO] Finished at: 2016-11-17T16:24:46+00:00
[INFO] Final Memory: 60M/978M
[INFO] ------------------------------------------------------------------------
[ERROR] Failed to execute goal org.apache.maven.plugins:maven-surefire-plugin:2.19.1:test (default-test) on project torque-runtime: Execution default-test of goal org.apache.maven.plugins:maven-surefire-plugin:2.19.1:test failed: There was an error in the forked process
[ERROR] java.lang.VerifyError:
[ERROR] Expecting a stackmap frame at branch target 107
[ERROR] Exception Details:
[ERROR] Location:
[ERROR] org/apache/torque/manager/AbstractBaseManager.getOMInstance(Lorg/apache/torque/om/ObjectKey;Z)Lorg/apache/torque/om/Persistent; @48: ifeq
[ERROR] Reason:
[ERROR] Expected stackmap frame at this location.
[ERROR] Bytecode:
[ERROR] 0x0000000: 033e 11ff ff36 04b8 002e 1230 b600 3411
[ERROR] 0x0000010: 00d7 b600 3a01 3a05 b800 2e12 30b6 0034
[ERROR] 0x0000020: 1100 d8b6 003a 1c11 00d8 3e11 0000 3604
[ERROR] 0x0000030: 9900 3b1d 1100 d8a0 001f 1504 1100 00a0
[ERROR] 0x0000040: 0017 b800 2e12 30b6 0034 1d15 0404 b600
[ERROR] 0x0000050: 9c11 ffff 3604 b800 2e12 30b6 0034 1100
[ERROR] 0x0000060: dab6 003a 2a2b b600 b23a 0515 049b 0017
[ERROR] 0x0000070: b800 2e12 30b6 0034 1d15 0403 b600 9c11
[ERROR] 0x0000080: ffff 3604 b800 2e12 30b6 0034 1100 ddb6
[ERROR] 0x0000090: 003a 1905 1100 dd3e 1100 0036 04c7 008e
[ERROR] 0x00000a0: 1d11 00dd a000 1f15 0411 0000 a000 17b8
[ERROR] 0x00000b0: 002e 1230 b600 341d 1504 04b6 009c 11ff
[ERROR] 0x00000c0: ff36 04b8 002e 1230 b600 3411 00df b600
[ERROR] 0x00000d0: 3a2a 2bb6 00b5 3a05 b800 2e12 30b6 0034
[ERROR] 0x00000e0: 1100 e0b6 003a 1c11 00e0 3e11 0000 3604
[ERROR] 0x00000f0: 9900 3b1d 1100 e0a0 001f 1504 1100 00a0
[ERROR] 0x0000100: 0017 b800 2e12 30b6 0034 1d15 0404 b600
[ERROR] 0x0000110: 9c11 ffff 3604 b800 2e12 30b6 0034 1100
[ERROR] 0x0000120: e2b6 003a 2a19 05b6 00b9 5715 049b 0017
[ERROR] 0x0000130: b800 2e12 30b6 0034 1d15 0403 b600 9c11
[ERROR] 0x0000140: ffff 3604 b800 2e12 30b6 0034 1100 e6b6
[ERROR] 0x0000150: 003a 1905 b0
[ERROR] Stackmap Table:
[ERROR] append_frame(@146,Object[#114])
[ERROR] same_frame_extended(@338)
[ERROR] 
[ERROR] at java.lang.Class.getDeclaredMethods0(Native Method)
[ERROR] at java.lang.Class.privateGetDeclaredMethods(Class.java:2701)
[ERROR] at java.lang.Class.privateGetMethodRecursive(Class.java:3048)
[ERROR] at java.lang.Class.getMethod0(Class.java:3018)
[ERROR] at java.lang.Class.getMethod(Class.java:1784)
[ERROR] at org.apache.maven.surefire.util.ReflectionUtils.tryGetMethod(ReflectionUtils.java:61)
[ERROR] at org.apache.maven.surefire.common.junit3.JUnit3TestChecker.isSuiteOnly(JUnit3TestChecker.java:64)
[ERROR] at org.apache.maven.surefire.common.junit3.JUnit3TestChecker.isValidJUnit3Test(JUnit3TestChecker.java:59)
[ERROR] at org.apache.maven.surefire.common.junit3.JUnit3TestChecker.accept(JUnit3TestChecker.java:54)
[ERROR] at org.apache.maven.surefire.junit.PojoAndJUnit3Checker.accept(PojoAndJUnit3Checker.java:43)
[ERROR] at org.apache.maven.surefire.util.DefaultScanResult.applyFilter(DefaultScanResult.java:98)
[ERROR] at org.apache.maven.surefire.junit.JUnit3Provider.scanClassPath(JUnit3Provider.java:143)
[ERROR] at org.apache.maven.surefire.junit.JUnit3Provider.invoke(JUnit3Provider.java:87)
[ERROR] at org.apache.maven.surefire.booter.ForkedBooter.invokeProviderInSameClassLoader(ForkedBooter.java:290)
[ERROR] at org.apache.maven.surefire.booter.ForkedBooter.runSuitesInProcess(ForkedBooter.java:242)
[ERROR] at org.apache.maven.surefire.booter.ForkedBooter.main(ForkedBooter.java:121)
[ERROR] -> [Help 1]
[ERROR] 
[ERROR] To see the full stack trace of the errors, re-run Maven with the -e switch.
[ERROR] Re-run Maven using the -X switch to enable full debug logging.
[ERROR] 
[ERROR] For more information about the errors and possible solutions, please read the following articles:
[ERROR] [Help 1] http://cwiki.apache.org/confluence/display/MAVEN/PluginExecutionException
[ERROR] 
[ERROR] After correcting the problems, you can resume the build with the command
[ERROR]   mvn <goals> -rf :torque-runtime
[JENKINS] Archiving <https://builds.apache.org/job/Torque4-trunk/ws/torque4-trunk/torque-maven-plugin/pom.xml> to org.apache.torque/torque-maven-plugin/4.1-SNAPSHOT/torque-maven-plugin-4.1-SNAPSHOT.pom
[JENKINS] Archiving <https://builds.apache.org/job/Torque4-trunk/ws/torque4-trunk/pom.xml> to org.apache.torque/torque/4.1-SNAPSHOT/torque-4.1-SNAPSHOT.pom
<https://builds.apache.org/job/Torque4-trunk/ws/torque4-trunk/pom.xml> is not inside <https://builds.apache.org/job/Torque4-trunk/ws/torque4-trunk/torque4-trunk/;> will archive in a separate pass
[JENKINS] Archiving <https://builds.apache.org/job/Torque4-trunk/ws/torque4-trunk/torque-site/pom.xml> to org.apache.torque/torque-site/4.1-SNAPSHOT/torque-site-4.1-SNAPSHOT.pom
[JENKINS] Archiving <https://builds.apache.org/job/Torque4-trunk/ws/torque4-trunk/torque-generator/pom.xml> to org.apache.torque/torque-generator/4.1-SNAPSHOT/torque-generator-4.1-SNAPSHOT.pom
[JENKINS] Archiving <https://builds.apache.org/job/Torque4-trunk/ws/torque4-trunk/torque-templates/pom.xml> to org.apache.torque/torque-templates/4.1-SNAPSHOT/torque-templates-4.1-SNAPSHOT.pom
[JENKINS] Archiving <https://builds.apache.org/job/Torque4-trunk/ws/torque4-trunk/torque-runtime/pom.xml> to org.apache.torque/torque-runtime/4.1-SNAPSHOT/torque-runtime-4.1-SNAPSHOT.pom
[JENKINS] Archiving <https://builds.apache.org/job/Torque4-trunk/ws/torque4-trunk/torque-runtime/target/torque-runtime-4.1-SNAPSHOT.jar> to org.apache.torque/torque-runtime/4.1-SNAPSHOT/torque-runtime-4.1-SNAPSHOT.jar
[JENKINS] Archiving <https://builds.apache.org/job/Torque4-trunk/ws/torque4-trunk/torque-runtime/target/torque-runtime-4.1-SNAPSHOT-sources.jar> to org.apache.torque/torque-runtime/4.1-SNAPSHOT/torque-runtime-4.1-SNAPSHOT-sources.jar
[JENKINS] Archiving <https://builds.apache.org/job/Torque4-trunk/ws/torque4-trunk/torque-ant-tasks/pom.xml> to org.apache.torque/torque-ant-tasks/4.1-SNAPSHOT/torque-ant-tasks-4.1-SNAPSHOT.pom
Sending e-mails to: torque-dev@db.apache.org
channel stopped
Skipping Cobertura coverage report as build was not UNSTABLE or better ...

---------------------------------------------------------------------
To unsubscribe, e-mail: torque-dev-unsubscribe@db.apache.org
For additional commands, e-mail: torque-dev-help@db.apache.org


Build failed in Jenkins: Torque4-trunk #571

Posted by Apache Jenkins Server <je...@builds.apache.org>.
See <https://builds.apache.org/job/Torque4-trunk/571/>

------------------------------------------
[...truncated 281 lines...]
[DEBUG] Configuring the service component TorqueComponent
[DEBUG] Incarnating the service TorqueComponent
[DEBUG] Instantiating the implementation class for TorqueComponent
[DEBUG] Incarnating the service TorqueComponent
[DEBUG] LogEnabled.enableLogging() for TorqueComponent
[DEBUG] Contextualizable.contextualize() for TorqueComponent
[DEBUG] Configurable.configure() for TorqueComponent
[DEBUG] configure(TorqueComponent::<no value>:@null:20:22)
[DEBUG] Config File changes to src/test/resources/Torque.properties
[DEBUG] Config File is <https://builds.apache.org/job/Torque4-trunk/ws/torque4-trunk/torque-runtime/src/test/resources/Torque.properties>
[DEBUG] Initializable.initialize() for TorqueComponent
[DEBUG] initialize()
[DEBUG] YAAFI Avalon Service Container is up and running
[INFO] YaffiContainer ready.
[DEBUG] Located the service 'org.apache.torque.avalon.Torque' in the local container
[DEBUG] Disposing of container...
[DEBUG] Disposing all services
[DEBUG] Decommision the service TorqueComponent
[DEBUG] Decommisioning the service TorqueComponent
[DEBUG] Disposable.dispose() for TorqueComponent
[DEBUG] dispose()
[DEBUG] Disposing the service TorqueComponent
[DEBUG] All services are disposed
[INFO] YaffiContainer has been disposed.
Tests run: 2, Failures: 0, Errors: 0, Skipped: 0, Time elapsed: 0.333 sec - in org.apache.torque.avalon.AvalonTest
Running org.apache.torque.TorqueRuntimeExceptionTest
Tests run: 1, Failures: 0, Errors: 0, Skipped: 0, Time elapsed: 0.166 sec - in org.apache.torque.TorqueRuntimeExceptionTest
Running org.apache.torque.ColumnImplTest
Tests run: 41, Failures: 0, Errors: 0, Skipped: 0, Time elapsed: 0.267 sec - in org.apache.torque.ColumnImplTest
Running org.apache.torque.util.UniqueListTest
Tests run: 2, Failures: 0, Errors: 0, Skipped: 0, Time elapsed: 0.02 sec - in org.apache.torque.util.UniqueListTest
Running org.apache.torque.util.SummaryHelperTest
Tests run: 1, Failures: 0, Errors: 0, Skipped: 0, Time elapsed: 0.513 sec - in org.apache.torque.util.SummaryHelperTest
Running org.apache.torque.util.functions.MaxTest
Tests run: 4, Failures: 0, Errors: 0, Skipped: 0, Time elapsed: 0.03 sec - in org.apache.torque.util.functions.MaxTest
Running org.apache.torque.util.functions.CountTest
Tests run: 4, Failures: 0, Errors: 0, Skipped: 0, Time elapsed: 0.027 sec - in org.apache.torque.util.functions.CountTest
Running org.apache.torque.util.functions.AbstractFunctionTest
Tests run: 11, Failures: 0, Errors: 0, Skipped: 0, Time elapsed: 0.032 sec - in org.apache.torque.util.functions.AbstractFunctionTest
Running org.apache.torque.util.functions.SumTest
Tests run: 4, Failures: 0, Errors: 0, Skipped: 0, Time elapsed: 0.027 sec - in org.apache.torque.util.functions.SumTest
Running org.apache.torque.util.functions.AvgTest
Tests run: 4, Failures: 0, Errors: 0, Skipped: 0, Time elapsed: 0.027 sec - in org.apache.torque.util.functions.AvgTest
Running org.apache.torque.util.functions.MinTest
Tests run: 4, Failures: 0, Errors: 0, Skipped: 0, Time elapsed: 0.029 sec - in org.apache.torque.util.functions.MinTest
Running org.apache.torque.util.functions.AggregateFunctionTest
Tests run: 12, Failures: 0, Errors: 0, Skipped: 0, Time elapsed: 0.03 sec - in org.apache.torque.util.functions.AggregateFunctionTest
Running org.apache.torque.util.BasePeerImplTest
Tests run: 16, Failures: 0, Errors: 0, Skipped: 0, Time elapsed: 0.588 sec - in org.apache.torque.util.BasePeerImplTest
Running org.apache.torque.sql.QueryTest
Tests run: 2, Failures: 0, Errors: 0, Skipped: 0, Time elapsed: 0.168 sec - in org.apache.torque.sql.QueryTest
Running org.apache.torque.sql.SqlBuilderTest
Tests run: 130, Failures: 0, Errors: 0, Skipped: 0, Time elapsed: 0.426 sec - in org.apache.torque.sql.SqlBuilderTest

Results :

Tests run: 365, Failures: 0, Errors: 0, Skipped: 0

[JENKINS] Recording test results
[INFO] 
[INFO] --- maven-jar-plugin:3.0.0:jar (default-jar) @ torque-runtime ---
[INFO] Building jar: <https://builds.apache.org/job/Torque4-trunk/ws/torque4-trunk/torque-runtime/target/torque-runtime-4.1-SNAPSHOT.jar>
[INFO] 
[INFO] --- maven-site-plugin:3.5.1:attach-descriptor (attach-descriptor) @ torque-runtime ---
[INFO] 
[INFO] --- maven-source-plugin:3.0.0:jar-no-fork (attach-sources) @ torque-runtime ---
[INFO] Building jar: <https://builds.apache.org/job/Torque4-trunk/ws/torque4-trunk/torque-runtime/target/torque-runtime-4.1-SNAPSHOT-sources.jar>
[INFO] 
[INFO] --- apache-rat-plugin:0.11:check (default) @ torque-runtime ---
[INFO] 51 implicit excludes (use -debug for more details).
[INFO] Exclude: velocity.log
[INFO] Exclude: .checkstyle
[INFO] Exclude: checkstyle-cache.ccf
[INFO] Exclude: derby.log
[INFO] Exclude: LICENSE-EDL.txt
[INFO] Exclude: DEPENDENCIES
[INFO] Exclude: torque-test/target/**/*
[INFO] Exclude: torque-test/.classpath
[INFO] Exclude: torque-test/.project
[INFO] Exclude: torque-test/.settings/**
[INFO] Exclude: torque-test/src/main/generated-java/**/*
[INFO] Exclude: torque-test/derby.log
[INFO] 182 resources included (use -debug for more details)
[INFO] Rat check: Summary of files. Unapproved: 0 unknown: 0 generated: 0 approved: 180 licence.
[CHECKSTYLE] No report found for mojo check
[PMD] No report found for mojo check[INFO] 

[INFO] --- maven-install-plugin:2.5.2:install (default-install) @ torque-runtime ---
[INFO] Installing <https://builds.apache.org/job/Torque4-trunk/ws/torque4-trunk/torque-runtime/target/torque-runtime-4.1-SNAPSHOT.jar> to /home/jenkins/jenkins-slave/maven-repositories/0/org/apache/torque/torque-runtime/4.1-SNAPSHOT/torque-runtime-4.1-SNAPSHOT.jar
[INFO] Installing <https://builds.apache.org/job/Torque4-trunk/ws/torque4-trunk/torque-runtime/pom.xml> to /home/jenkins/jenkins-slave/maven-repositories/0/org/apache/torque/torque-runtime/4.1-SNAPSHOT/torque-runtime-4.1-SNAPSHOT.pom
[INFO] Installing <https://builds.apache.org/job/Torque4-trunk/ws/torque4-trunk/torque-runtime/target/torque-runtime-4.1-SNAPSHOT-sources.jar> to /home/jenkins/jenkins-slave/maven-repositories/0/org/apache/torque/torque-runtime/4.1-SNAPSHOT/torque-runtime-4.1-SNAPSHOT-sources.jar
[INFO] 
[INFO] >>> cobertura-maven-plugin:2.3:cobertura (default-cli) > [cobertura]test @ torque-runtime >>>
[INFO] 
[INFO] --- maven-remote-resources-plugin:1.5:process (process-resource-bundles) @ torque-runtime ---
[INFO] 
[INFO] --- maven-resources-plugin:2.7:resources (default-resources) @ torque-runtime ---
[INFO] Using 'ISO-8859-1' encoding to copy filtered resources.
[INFO] skip non existing resourceDirectory <https://builds.apache.org/job/Torque4-trunk/ws/torque4-trunk/torque-runtime/src/main/resources>
[INFO] Copying 3 resources
[INFO] Copying 3 resources
[INFO] 
[INFO] --- maven-compiler-plugin:3.5.1:compile (default-compile) @ torque-runtime ---
[INFO] Nothing to compile - all classes are up to date
[INFO] 
[INFO] --- cobertura-maven-plugin:2.3:instrument (default-cli) @ torque-runtime ---
[INFO] Cobertura 1.9.2 - GNU GPL License (NO WARRANTY) - See COPYRIGHT file
Instrumenting 122 files to <https://builds.apache.org/job/Torque4-trunk/ws/torque4-trunk/torque-runtime/target/generated-classes/cobertura>
Cobertura: Saved information on 122 classes.
Instrument time: 726ms

[INFO] Instrumentation was successful.
[INFO] 
[INFO] --- maven-resources-plugin:2.7:testResources (default-testResources) @ torque-runtime ---
[INFO] Using 'ISO-8859-1' encoding to copy filtered resources.
[INFO] Copying 5 resources
[INFO] Copying 3 resources
[INFO] Copying 3 resources
[INFO] 
[INFO] --- maven-compiler-plugin:3.5.1:testCompile (default-testCompile) @ torque-runtime ---
[INFO] Nothing to compile - all classes are up to date
[INFO] 
[INFO] --- maven-surefire-plugin:2.19.1:test (default-test) @ torque-runtime ---

-------------------------------------------------------
 T E S T S
-------------------------------------------------------

Results :

Tests run: 0, Failures: 0, Errors: 0, Skipped: 0

[JENKINS] Recording test results
[INFO] ------------------------------------------------------------------------
[INFO] Reactor Summary:
[INFO] 
[INFO] Torque Maven Parent ................................ SUCCESS [ 42.084 s]
[INFO] Torque Runtime ..................................... FAILURE [ 49.194 s]
[INFO] Torque Generator ................................... SKIPPED
[INFO] Torque Templates ................................... SKIPPED
[INFO] Torque Generator Maven 2 Plugin .................... SKIPPED
[INFO] Torque Generator Ant tasks ......................... SKIPPED
[INFO] Torque Site ........................................ SKIPPED
[INFO] ------------------------------------------------------------------------
[INFO] BUILD FAILURE
[INFO] ------------------------------------------------------------------------
[INFO] Total time: 01:38 min
[INFO] Finished at: 2016-09-21T01:11:01+00:00
[INFO] Final Memory: 63M/720M
[INFO] ------------------------------------------------------------------------
[ERROR] Failed to execute goal org.apache.maven.plugins:maven-surefire-plugin:2.19.1:test (default-test) on project torque-runtime: Execution default-test of goal org.apache.maven.plugins:maven-surefire-plugin:2.19.1:test failed: There was an error in the forked process
[ERROR] java.lang.VerifyError:
[ERROR] Expecting a stackmap frame at branch target 449
[ERROR] Exception Details:
[ERROR] Location:
[ERROR] org/apache/torque/manager/AbstractBaseManager.setRegion(Ljava/lang/String;)V @25: invokestatic
[ERROR] Reason:
[ERROR] Expected stackmap frame at this location.
[ERROR] Bytecode:
[ERROR] 0x0000000: 033d 11ff ff3e b800 2e12 30b6 0034 1101
[ERROR] 0x0000010: eab6 003a 2a2b b501 44b8 002e 1230 b600
[ERROR] 0x0000020: 3411 01ed b600 3ab8 014b 1301 4d03 b901
[ERROR] 0x0000030: 5303 0011 01ed 3d11 0000 3e99 0145 1c11
[ERROR] 0x0000040: 01ed a000 1c1d 1100 00a0 0015 b800 2e12
[ERROR] 0x0000050: 30b6 0034 1c1d 04b6 009c 11ff ff3e b800
[ERROR] 0x0000060: 2e12 30b6 0034 1101 efb6 003a 2ab4 00c0
[ERROR] 0x0000070: 1101 ef3d 1100 003e c600 381c 1101 efa0
[ERROR] 0x0000080: 001c 1d11 0000 a000 15b8 002e 1230 b600
[ERROR] 0x0000090: 341c 1d04 b600 9c11 ffff 3eb8 002e 1230
[ERROR] 0x00000a0: b600 3411 01f1 b600 3a2a b400 c0b6 00d3
[ERROR] 0x00000b0: 1d9b 0015 b800 2e12 30b6 0034 1c1d 03b6
[ERROR] 0x00000c0: 009c 11ff ff3e b800 2e12 30b6 0034 1101
[ERROR] 0x00000d0: f3b6 003a 2ab4 00d5 1101 f33d 1100 003e
[ERROR] 0x00000e0: c600 381c 1101 f3a0 001c 1d11 0000 a000
[ERROR] 0x00000f0: 15b8 002e 1230 b600 341c 1d04 b600 9c11
[ERROR] 0x0000100: ffff 3eb8 002e 1230 b600 3411 01f5 b600
[ERROR] 0x0000110: 3a2a b400 d5b6 00d8 1d9b 0015 b800 2e12
[ERROR] 0x0000120: 30b6 0034 1c1d 03b6 009c 11ff ff3e b800
[ERROR] 0x0000130: 2e12 30b6 0034 1101 f7b6 003a 2a2a b601
[ERROR] 0x0000140: 55b8 015b b500 c0b8 002e 1230 b600 3411
[ERROR] 0x0000150: 01f9 b600 3a2a 2ab6 0155 b801 5fb5 00d5
[ERROR] 0x0000160: b800 2e12 30b6 0034 1101 fab6 003a 2abb
[ERROR] 0x0000170: 0161 592a b400 d5b7 0164 b501 66a7 0033
[ERROR] 0x0000180: 1d9b 0015 b800 2e12 30b6 0034 1c1d 03b6
[ERROR] 0x0000190: 009c 11ff ff3e b800 2e12 30b6 0034 1101
[ERROR] 0x00001a0: feb6 003a 2abb 0168 5901 b701 69b5 0166
[ERROR] 0x00001b0: b800 2e12 30b6 0034 1102 04b6 003a a700
[ERROR] 0x00001c0: 2eb8 002e 1230 b600 3411 0201 b600 3a3a
[ERROR] 0x00001d0: 04b8 002e 1230 b600 3411 0203 b600 3abb
[ERROR] 0x00001e0: 0066 5913 016b 1904 b700 85bf b800 2e12
[ERROR] 0x00001f0: 30b6 0034 1102 06b6 003a 2ab4 00c0 1102
[ERROR] 0x0000200: 063d 1100 003e c700 4d1c 1102 06a0 001c
[ERROR] 0x0000210: 1d11 0000 a000 15b8 002e 1230 b600 341c
[ERROR] 0x0000220: 1d04 b600 9c11 ffff 3eb8 002e 1230 b600
[ERROR] 0x0000230: 3411 0208 b600 3ab2 016d bb00 7459 b700
[ERROR] 0x0000240: 7513 016f b600 7b2b b600 7bb6 0082 b901
[ERROR] 0x0000250: 7402 001d 9b00 15b8 002e 1230 b600 341c
[ERROR] 0x0000260: 1d03 b600 9c11 ffff 3eb8 002e 1230 b600
[ERROR] 0x0000270: 3411 020a b600 3ab1
[ERROR] Exception Handler Table:
[ERROR] bci [25, 432] => handler: 449
[ERROR] Stackmap Table:
[ERROR] same_frame_extended(@212)
[ERROR] same_frame_extended(@316)
[ERROR] same_frame_extended(@420)
[ERROR] same_frame(@446)
[ERROR] same_locals_1_stack_item_frame(@463,Object[#201])
[ERROR] same_frame(@506)
[ERROR] same_frame_extended(@631)
[ERROR] 
[ERROR] at java.lang.Class.getDeclaredMethods0(Native Method)
[ERROR] at java.lang.Class.privateGetDeclaredMethods(Class.java:2701)
[ERROR] at java.lang.Class.privateGetMethodRecursive(Class.java:3048)
[ERROR] at java.lang.Class.getMethod0(Class.java:3018)
[ERROR] at java.lang.Class.getMethod(Class.java:1784)
[ERROR] at org.apache.maven.surefire.util.ReflectionUtils.tryGetMethod(ReflectionUtils.java:61)
[ERROR] at org.apache.maven.surefire.common.junit3.JUnit3TestChecker.isSuiteOnly(JUnit3TestChecker.java:64)
[ERROR] at org.apache.maven.surefire.common.junit3.JUnit3TestChecker.isValidJUnit3Test(JUnit3TestChecker.java:59)
[ERROR] at org.apache.maven.surefire.common.junit3.JUnit3TestChecker.accept(JUnit3TestChecker.java:54)
[ERROR] at org.apache.maven.surefire.junit.PojoAndJUnit3Checker.accept(PojoAndJUnit3Checker.java:43)
[ERROR] at org.apache.maven.surefire.util.DefaultScanResult.applyFilter(DefaultScanResult.java:98)
[ERROR] at org.apache.maven.surefire.junit.JUnit3Provider.scanClassPath(JUnit3Provider.java:143)
[ERROR] at org.apache.maven.surefire.junit.JUnit3Provider.invoke(JUnit3Provider.java:87)
[ERROR] at org.apache.maven.surefire.booter.ForkedBooter.invokeProviderInSameClassLoader(ForkedBooter.java:290)
[ERROR] at org.apache.maven.surefire.booter.ForkedBooter.runSuitesInProcess(ForkedBooter.java:242)
[ERROR] at org.apache.maven.surefire.booter.ForkedBooter.main(ForkedBooter.java:121)
[ERROR] -> [Help 1]
[ERROR] 
[ERROR] To see the full stack trace of the errors, re-run Maven with the -e switch.
[ERROR] Re-run Maven using the -X switch to enable full debug logging.
[ERROR] 
[ERROR] For more information about the errors and possible solutions, please read the following articles:
[ERROR] [Help 1] http://cwiki.apache.org/confluence/display/MAVEN/PluginExecutionException
[ERROR] 
[ERROR] After correcting the problems, you can resume the build with the command
[ERROR]   mvn <goals> -rf :torque-runtime
[JENKINS] Archiving <https://builds.apache.org/job/Torque4-trunk/ws/torque4-trunk/torque-maven-plugin/pom.xml> to org.apache.torque/torque-maven-plugin/4.1-SNAPSHOT/torque-maven-plugin-4.1-SNAPSHOT.pom
[JENKINS] Archiving <https://builds.apache.org/job/Torque4-trunk/ws/torque4-trunk/pom.xml> to org.apache.torque/torque/4.1-SNAPSHOT/torque-4.1-SNAPSHOT.pom
<https://builds.apache.org/job/Torque4-trunk/ws/torque4-trunk/pom.xml> is not inside <https://builds.apache.org/job/Torque4-trunk/ws/torque4-trunk/torque4-trunk/;> will archive in a separate pass
[JENKINS] Archiving <https://builds.apache.org/job/Torque4-trunk/ws/torque4-trunk/torque-site/pom.xml> to org.apache.torque/torque-site/4.1-SNAPSHOT/torque-site-4.1-SNAPSHOT.pom
[JENKINS] Archiving <https://builds.apache.org/job/Torque4-trunk/ws/torque4-trunk/torque-generator/pom.xml> to org.apache.torque/torque-generator/4.1-SNAPSHOT/torque-generator-4.1-SNAPSHOT.pom
[JENKINS] Archiving <https://builds.apache.org/job/Torque4-trunk/ws/torque4-trunk/torque-templates/pom.xml> to org.apache.torque/torque-templates/4.1-SNAPSHOT/torque-templates-4.1-SNAPSHOT.pom
[JENKINS] Archiving <https://builds.apache.org/job/Torque4-trunk/ws/torque4-trunk/torque-runtime/pom.xml> to org.apache.torque/torque-runtime/4.1-SNAPSHOT/torque-runtime-4.1-SNAPSHOT.pom
[JENKINS] Archiving <https://builds.apache.org/job/Torque4-trunk/ws/torque4-trunk/torque-runtime/target/torque-runtime-4.1-SNAPSHOT.jar> to org.apache.torque/torque-runtime/4.1-SNAPSHOT/torque-runtime-4.1-SNAPSHOT.jar
[JENKINS] Archiving <https://builds.apache.org/job/Torque4-trunk/ws/torque4-trunk/torque-runtime/target/torque-runtime-4.1-SNAPSHOT-sources.jar> to org.apache.torque/torque-runtime/4.1-SNAPSHOT/torque-runtime-4.1-SNAPSHOT-sources.jar
[JENKINS] Archiving <https://builds.apache.org/job/Torque4-trunk/ws/torque4-trunk/torque-ant-tasks/pom.xml> to org.apache.torque/torque-ant-tasks/4.1-SNAPSHOT/torque-ant-tasks-4.1-SNAPSHOT.pom
Sending e-mails to: torque-dev@db.apache.org
channel stopped
Skipping Cobertura coverage report as build was not UNSTABLE or better ...

---------------------------------------------------------------------
To unsubscribe, e-mail: torque-dev-unsubscribe@db.apache.org
For additional commands, e-mail: torque-dev-help@db.apache.org


Build failed in Jenkins: Torque4-trunk #570

Posted by Apache Jenkins Server <je...@builds.apache.org>.
See <https://builds.apache.org/job/Torque4-trunk/570/>

------------------------------------------
[...truncated 4172 lines...]
[DEBUG] Located the service 'org.apache.torque.avalon.Torque' in the local container
[DEBUG] Disposing of container...
[DEBUG] Disposing all services
[DEBUG] Decommision the service TorqueComponent
[DEBUG] Decommisioning the service TorqueComponent
[DEBUG] Disposable.dispose() for TorqueComponent
[DEBUG] dispose()
[DEBUG] Disposing the service TorqueComponent
[DEBUG] All services are disposed
[INFO] YaffiContainer has been disposed.
Tests run: 2, Failures: 0, Errors: 0, Skipped: 0, Time elapsed: 0.349 sec - in org.apache.torque.avalon.AvalonTest
Running org.apache.torque.TorqueRuntimeExceptionTest
Tests run: 1, Failures: 0, Errors: 0, Skipped: 0, Time elapsed: 0.165 sec - in org.apache.torque.TorqueRuntimeExceptionTest
Running org.apache.torque.ColumnImplTest
Tests run: 41, Failures: 0, Errors: 0, Skipped: 0, Time elapsed: 0.263 sec - in org.apache.torque.ColumnImplTest
Running org.apache.torque.util.UniqueListTest
Tests run: 2, Failures: 0, Errors: 0, Skipped: 0, Time elapsed: 0.019 sec - in org.apache.torque.util.UniqueListTest
Running org.apache.torque.util.SummaryHelperTest
Tests run: 1, Failures: 0, Errors: 0, Skipped: 0, Time elapsed: 0.507 sec - in org.apache.torque.util.SummaryHelperTest
Running org.apache.torque.util.functions.MaxTest
Tests run: 4, Failures: 0, Errors: 0, Skipped: 0, Time elapsed: 0.029 sec - in org.apache.torque.util.functions.MaxTest
Running org.apache.torque.util.functions.CountTest
Tests run: 4, Failures: 0, Errors: 0, Skipped: 0, Time elapsed: 0.027 sec - in org.apache.torque.util.functions.CountTest
Running org.apache.torque.util.functions.AbstractFunctionTest
Tests run: 11, Failures: 0, Errors: 0, Skipped: 0, Time elapsed: 0.033 sec - in org.apache.torque.util.functions.AbstractFunctionTest
Running org.apache.torque.util.functions.SumTest
Tests run: 4, Failures: 0, Errors: 0, Skipped: 0, Time elapsed: 0.026 sec - in org.apache.torque.util.functions.SumTest
Running org.apache.torque.util.functions.AvgTest
Tests run: 4, Failures: 0, Errors: 0, Skipped: 0, Time elapsed: 0.027 sec - in org.apache.torque.util.functions.AvgTest
Running org.apache.torque.util.functions.MinTest
Tests run: 4, Failures: 0, Errors: 0, Skipped: 0, Time elapsed: 0.028 sec - in org.apache.torque.util.functions.MinTest
Running org.apache.torque.util.functions.AggregateFunctionTest
Tests run: 12, Failures: 0, Errors: 0, Skipped: 0, Time elapsed: 0.033 sec - in org.apache.torque.util.functions.AggregateFunctionTest
Running org.apache.torque.util.BasePeerImplTest
Tests run: 16, Failures: 0, Errors: 0, Skipped: 0, Time elapsed: 0.589 sec - in org.apache.torque.util.BasePeerImplTest
Running org.apache.torque.sql.QueryTest
Tests run: 2, Failures: 0, Errors: 0, Skipped: 0, Time elapsed: 0.166 sec - in org.apache.torque.sql.QueryTest
Running org.apache.torque.sql.SqlBuilderTest
Tests run: 130, Failures: 0, Errors: 0, Skipped: 0, Time elapsed: 0.434 sec - in org.apache.torque.sql.SqlBuilderTest

Results :

Tests run: 365, Failures: 0, Errors: 0, Skipped: 0

[JENKINS] Recording test results
[INFO] 
[INFO] --- maven-jar-plugin:3.0.0:jar (default-jar) @ torque-runtime ---
[INFO] Downloading: https://repo.maven.apache.org/maven2/org/apache/maven/maven-archiver/3.0.2/maven-archiver-3.0.2.pom
[INFO] Downloaded: https://repo.maven.apache.org/maven2/org/apache/maven/maven-archiver/3.0.2/maven-archiver-3.0.2.pom (5 KB at 449.5 KB/sec)
[INFO] Downloading: https://repo.maven.apache.org/maven2/org/apache/maven/shared/maven-shared-components/22/maven-shared-components-22.pom
[INFO] Downloaded: https://repo.maven.apache.org/maven2/org/apache/maven/shared/maven-shared-components/22/maven-shared-components-22.pom (5 KB at 624.3 KB/sec)
[INFO] Downloading: https://repo.maven.apache.org/maven2/org/codehaus/plexus/plexus-archiver/3.1.1/plexus-archiver-3.1.1.pom
[INFO] Downloaded: https://repo.maven.apache.org/maven2/org/codehaus/plexus/plexus-archiver/3.1.1/plexus-archiver-3.1.1.pom (5 KB at 540.3 KB/sec)
[INFO] Downloading: https://repo.maven.apache.org/maven2/org/codehaus/plexus/plexus-io/2.7.1/plexus-io-2.7.1.pom
[INFO] Downloaded: https://repo.maven.apache.org/maven2/org/codehaus/plexus/plexus-io/2.7.1/plexus-io-2.7.1.pom (5 KB at 686.1 KB/sec)
[INFO] Downloading: https://repo.maven.apache.org/maven2/org/apache/maven/maven-archiver/3.0.2/maven-archiver-3.0.2.jar
[INFO] Downloading: https://repo.maven.apache.org/maven2/org/codehaus/plexus/plexus-archiver/3.1.1/plexus-archiver-3.1.1.jar
[INFO] Downloading: https://repo.maven.apache.org/maven2/org/codehaus/plexus/plexus-io/2.7.1/plexus-io-2.7.1.jar
[INFO] Downloaded: https://repo.maven.apache.org/maven2/org/apache/maven/maven-archiver/3.0.2/maven-archiver-3.0.2.jar (23 KB at 1897.0 KB/sec)
[INFO] Downloaded: https://repo.maven.apache.org/maven2/org/codehaus/plexus/plexus-io/2.7.1/plexus-io-2.7.1.jar (84 KB at 5587.3 KB/sec)
[INFO] Downloaded: https://repo.maven.apache.org/maven2/org/codehaus/plexus/plexus-archiver/3.1.1/plexus-archiver-3.1.1.jar (175 KB at 8704.5 KB/sec)
[INFO] Building jar: <https://builds.apache.org/job/Torque4-trunk/ws/torque4-trunk/torque-runtime/target/torque-runtime-4.1-SNAPSHOT.jar>
[INFO] 
[INFO] --- maven-site-plugin:3.5.1:attach-descriptor (attach-descriptor) @ torque-runtime ---
[INFO] 
[INFO] --- maven-source-plugin:3.0.0:jar-no-fork (attach-sources) @ torque-runtime ---
[INFO] Building jar: <https://builds.apache.org/job/Torque4-trunk/ws/torque4-trunk/torque-runtime/target/torque-runtime-4.1-SNAPSHOT-sources.jar>
[INFO] 
[INFO] --- apache-rat-plugin:0.11:check (default) @ torque-runtime ---
[INFO] 51 implicit excludes (use -debug for more details).
[INFO] Exclude: velocity.log
[INFO] Exclude: .checkstyle
[INFO] Exclude: checkstyle-cache.ccf
[INFO] Exclude: derby.log
[INFO] Exclude: LICENSE-EDL.txt
[INFO] Exclude: DEPENDENCIES
[INFO] Exclude: torque-test/target/**/*
[INFO] Exclude: torque-test/.classpath
[INFO] Exclude: torque-test/.project
[INFO] Exclude: torque-test/.settings/**
[INFO] Exclude: torque-test/src/main/generated-java/**/*
[INFO] Exclude: torque-test/derby.log
[INFO] 182 resources included (use -debug for more details)
[INFO] Rat check: Summary of files. Unapproved: 0 unknown: 0 generated: 0 approved: 180 licence.
[CHECKSTYLE] No report found for mojo check
[PMD] No report found for mojo check[INFO] 

[INFO] --- maven-install-plugin:2.5.2:install (default-install) @ torque-runtime ---
[INFO] Installing <https://builds.apache.org/job/Torque4-trunk/ws/torque4-trunk/torque-runtime/target/torque-runtime-4.1-SNAPSHOT.jar> to /home/jenkins/jenkins-slave/maven-repositories/0/org/apache/torque/torque-runtime/4.1-SNAPSHOT/torque-runtime-4.1-SNAPSHOT.jar
[INFO] Installing <https://builds.apache.org/job/Torque4-trunk/ws/torque4-trunk/torque-runtime/pom.xml> to /home/jenkins/jenkins-slave/maven-repositories/0/org/apache/torque/torque-runtime/4.1-SNAPSHOT/torque-runtime-4.1-SNAPSHOT.pom
[INFO] Installing <https://builds.apache.org/job/Torque4-trunk/ws/torque4-trunk/torque-runtime/target/torque-runtime-4.1-SNAPSHOT-sources.jar> to /home/jenkins/jenkins-slave/maven-repositories/0/org/apache/torque/torque-runtime/4.1-SNAPSHOT/torque-runtime-4.1-SNAPSHOT-sources.jar
[INFO] 
[INFO] >>> cobertura-maven-plugin:2.3:cobertura (default-cli) > [cobertura]test @ torque-runtime >>>
[INFO] 
[INFO] --- maven-remote-resources-plugin:1.5:process (process-resource-bundles) @ torque-runtime ---
[INFO] 
[INFO] --- maven-resources-plugin:2.7:resources (default-resources) @ torque-runtime ---
[INFO] Using 'ISO-8859-1' encoding to copy filtered resources.
[INFO] skip non existing resourceDirectory <https://builds.apache.org/job/Torque4-trunk/ws/torque4-trunk/torque-runtime/src/main/resources>
[INFO] Copying 3 resources
[INFO] Copying 3 resources
[INFO] 
[INFO] --- maven-compiler-plugin:3.5.1:compile (default-compile) @ torque-runtime ---
[INFO] Nothing to compile - all classes are up to date
[INFO] 
[INFO] --- cobertura-maven-plugin:2.3:instrument (default-cli) @ torque-runtime ---
[INFO] Cobertura 1.9.2 - GNU GPL License (NO WARRANTY) - See COPYRIGHT file
Instrumenting 122 files to <https://builds.apache.org/job/Torque4-trunk/ws/torque4-trunk/torque-runtime/target/generated-classes/cobertura>
Cobertura: Saved information on 122 classes.
Instrument time: 749ms

[INFO] Instrumentation was successful.
[INFO] 
[INFO] --- maven-resources-plugin:2.7:testResources (default-testResources) @ torque-runtime ---
[INFO] Using 'ISO-8859-1' encoding to copy filtered resources.
[INFO] Copying 5 resources
[INFO] Copying 3 resources
[INFO] Copying 3 resources
[INFO] 
[INFO] --- maven-compiler-plugin:3.5.1:testCompile (default-testCompile) @ torque-runtime ---
[INFO] Nothing to compile - all classes are up to date
[INFO] 
[INFO] --- maven-surefire-plugin:2.19.1:test (default-test) @ torque-runtime ---

-------------------------------------------------------
 T E S T S
-------------------------------------------------------

Results :

Tests run: 0, Failures: 0, Errors: 0, Skipped: 0

[JENKINS] Recording test results
[INFO] ------------------------------------------------------------------------
[INFO] Reactor Summary:
[INFO] 
[INFO] Torque Maven Parent ................................ SUCCESS [ 48.118 s]
[INFO] Torque Runtime ..................................... FAILURE [ 47.586 s]
[INFO] Torque Generator ................................... SKIPPED
[INFO] Torque Templates ................................... SKIPPED
[INFO] Torque Generator Maven 2 Plugin .................... SKIPPED
[INFO] Torque Generator Ant tasks ......................... SKIPPED
[INFO] Torque Site ........................................ SKIPPED
[INFO] ------------------------------------------------------------------------
[INFO] BUILD FAILURE
[INFO] ------------------------------------------------------------------------
[INFO] Total time: 01:44 min
[INFO] Finished at: 2016-09-21T01:05:18+00:00
[INFO] Final Memory: 66M/825M
[INFO] ------------------------------------------------------------------------
[ERROR] Failed to execute goal org.apache.maven.plugins:maven-surefire-plugin:2.19.1:test (default-test) on project torque-runtime: Execution default-test of goal org.apache.maven.plugins:maven-surefire-plugin:2.19.1:test failed: There was an error in the forked process
[ERROR] java.lang.VerifyError:
[ERROR] Expecting a stackmap frame at branch target 449
[ERROR] Exception Details:
[ERROR] Location:
[ERROR] org/apache/torque/manager/AbstractBaseManager.setRegion(Ljava/lang/String;)V @25: invokestatic
[ERROR] Reason:
[ERROR] Expected stackmap frame at this location.
[ERROR] Bytecode:
[ERROR] 0x0000000: 033d 11ff ff3e b800 2e12 30b6 0034 1101
[ERROR] 0x0000010: eab6 003a 2a2b b501 44b8 002e 1230 b600
[ERROR] 0x0000020: 3411 01ed b600 3ab8 014b 1301 4d03 b901
[ERROR] 0x0000030: 5303 0011 01ed 3d11 0000 3e99 0145 1c11
[ERROR] 0x0000040: 01ed a000 1c1d 1100 00a0 0015 b800 2e12
[ERROR] 0x0000050: 30b6 0034 1c1d 04b6 009c 11ff ff3e b800
[ERROR] 0x0000060: 2e12 30b6 0034 1101 efb6 003a 2ab4 00c0
[ERROR] 0x0000070: 1101 ef3d 1100 003e c600 381c 1101 efa0
[ERROR] 0x0000080: 001c 1d11 0000 a000 15b8 002e 1230 b600
[ERROR] 0x0000090: 341c 1d04 b600 9c11 ffff 3eb8 002e 1230
[ERROR] 0x00000a0: b600 3411 01f1 b600 3a2a b400 c0b6 00d3
[ERROR] 0x00000b0: 1d9b 0015 b800 2e12 30b6 0034 1c1d 03b6
[ERROR] 0x00000c0: 009c 11ff ff3e b800 2e12 30b6 0034 1101
[ERROR] 0x00000d0: f3b6 003a 2ab4 00d5 1101 f33d 1100 003e
[ERROR] 0x00000e0: c600 381c 1101 f3a0 001c 1d11 0000 a000
[ERROR] 0x00000f0: 15b8 002e 1230 b600 341c 1d04 b600 9c11
[ERROR] 0x0000100: ffff 3eb8 002e 1230 b600 3411 01f5 b600
[ERROR] 0x0000110: 3a2a b400 d5b6 00d8 1d9b 0015 b800 2e12
[ERROR] 0x0000120: 30b6 0034 1c1d 03b6 009c 11ff ff3e b800
[ERROR] 0x0000130: 2e12 30b6 0034 1101 f7b6 003a 2a2a b601
[ERROR] 0x0000140: 55b8 015b b500 c0b8 002e 1230 b600 3411
[ERROR] 0x0000150: 01f9 b600 3a2a 2ab6 0155 b801 5fb5 00d5
[ERROR] 0x0000160: b800 2e12 30b6 0034 1101 fab6 003a 2abb
[ERROR] 0x0000170: 0161 592a b400 d5b7 0164 b501 66a7 0033
[ERROR] 0x0000180: 1d9b 0015 b800 2e12 30b6 0034 1c1d 03b6
[ERROR] 0x0000190: 009c 11ff ff3e b800 2e12 30b6 0034 1101
[ERROR] 0x00001a0: feb6 003a 2abb 0168 5901 b701 69b5 0166
[ERROR] 0x00001b0: b800 2e12 30b6 0034 1102 04b6 003a a700
[ERROR] 0x00001c0: 2eb8 002e 1230 b600 3411 0201 b600 3a3a
[ERROR] 0x00001d0: 04b8 002e 1230 b600 3411 0203 b600 3abb
[ERROR] 0x00001e0: 0066 5913 016b 1904 b700 85bf b800 2e12
[ERROR] 0x00001f0: 30b6 0034 1102 06b6 003a 2ab4 00c0 1102
[ERROR] 0x0000200: 063d 1100 003e c700 4d1c 1102 06a0 001c
[ERROR] 0x0000210: 1d11 0000 a000 15b8 002e 1230 b600 341c
[ERROR] 0x0000220: 1d04 b600 9c11 ffff 3eb8 002e 1230 b600
[ERROR] 0x0000230: 3411 0208 b600 3ab2 016d bb00 7459 b700
[ERROR] 0x0000240: 7513 016f b600 7b2b b600 7bb6 0082 b901
[ERROR] 0x0000250: 7402 001d 9b00 15b8 002e 1230 b600 341c
[ERROR] 0x0000260: 1d03 b600 9c11 ffff 3eb8 002e 1230 b600
[ERROR] 0x0000270: 3411 020a b600 3ab1
[ERROR] Exception Handler Table:
[ERROR] bci [25, 432] => handler: 449
[ERROR] Stackmap Table:
[ERROR] same_frame_extended(@212)
[ERROR] same_frame_extended(@316)
[ERROR] same_frame_extended(@420)
[ERROR] same_frame(@446)
[ERROR] same_locals_1_stack_item_frame(@463,Object[#201])
[ERROR] same_frame(@506)
[ERROR] same_frame_extended(@631)
[ERROR] 
[ERROR] at java.lang.Class.getDeclaredMethods0(Native Method)
[ERROR] at java.lang.Class.privateGetDeclaredMethods(Class.java:2701)
[ERROR] at java.lang.Class.privateGetMethodRecursive(Class.java:3048)
[ERROR] at java.lang.Class.getMethod0(Class.java:3018)
[ERROR] at java.lang.Class.getMethod(Class.java:1784)
[ERROR] at org.apache.maven.surefire.util.ReflectionUtils.tryGetMethod(ReflectionUtils.java:61)
[ERROR] at org.apache.maven.surefire.common.junit3.JUnit3TestChecker.isSuiteOnly(JUnit3TestChecker.java:64)
[ERROR] at org.apache.maven.surefire.common.junit3.JUnit3TestChecker.isValidJUnit3Test(JUnit3TestChecker.java:59)
[ERROR] at org.apache.maven.surefire.common.junit3.JUnit3TestChecker.accept(JUnit3TestChecker.java:54)
[ERROR] at org.apache.maven.surefire.junit.PojoAndJUnit3Checker.accept(PojoAndJUnit3Checker.java:43)
[ERROR] at org.apache.maven.surefire.util.DefaultScanResult.applyFilter(DefaultScanResult.java:98)
[ERROR] at org.apache.maven.surefire.junit.JUnit3Provider.scanClassPath(JUnit3Provider.java:143)
[ERROR] at org.apache.maven.surefire.junit.JUnit3Provider.invoke(JUnit3Provider.java:87)
[ERROR] at org.apache.maven.surefire.booter.ForkedBooter.invokeProviderInSameClassLoader(ForkedBooter.java:290)
[ERROR] at org.apache.maven.surefire.booter.ForkedBooter.runSuitesInProcess(ForkedBooter.java:242)
[ERROR] at org.apache.maven.surefire.booter.ForkedBooter.main(ForkedBooter.java:121)
[ERROR] -> [Help 1]
[ERROR] 
[ERROR] To see the full stack trace of the errors, re-run Maven with the -e switch.
[ERROR] Re-run Maven using the -X switch to enable full debug logging.
[ERROR] 
[ERROR] For more information about the errors and possible solutions, please read the following articles:
[ERROR] [Help 1] http://cwiki.apache.org/confluence/display/MAVEN/PluginExecutionException
[ERROR] 
[ERROR] After correcting the problems, you can resume the build with the command
[ERROR]   mvn <goals> -rf :torque-runtime
[JENKINS] Archiving <https://builds.apache.org/job/Torque4-trunk/ws/torque4-trunk/torque-maven-plugin/pom.xml> to org.apache.torque/torque-maven-plugin/4.1-SNAPSHOT/torque-maven-plugin-4.1-SNAPSHOT.pom
[JENKINS] Archiving <https://builds.apache.org/job/Torque4-trunk/ws/torque4-trunk/pom.xml> to org.apache.torque/torque/4.1-SNAPSHOT/torque-4.1-SNAPSHOT.pom
<https://builds.apache.org/job/Torque4-trunk/ws/torque4-trunk/pom.xml> is not inside <https://builds.apache.org/job/Torque4-trunk/ws/torque4-trunk/torque4-trunk/;> will archive in a separate pass
[JENKINS] Archiving <https://builds.apache.org/job/Torque4-trunk/ws/torque4-trunk/torque-site/pom.xml> to org.apache.torque/torque-site/4.1-SNAPSHOT/torque-site-4.1-SNAPSHOT.pom
[JENKINS] Archiving <https://builds.apache.org/job/Torque4-trunk/ws/torque4-trunk/torque-generator/pom.xml> to org.apache.torque/torque-generator/4.1-SNAPSHOT/torque-generator-4.1-SNAPSHOT.pom
[JENKINS] Archiving <https://builds.apache.org/job/Torque4-trunk/ws/torque4-trunk/torque-templates/pom.xml> to org.apache.torque/torque-templates/4.1-SNAPSHOT/torque-templates-4.1-SNAPSHOT.pom
[JENKINS] Archiving <https://builds.apache.org/job/Torque4-trunk/ws/torque4-trunk/torque-runtime/pom.xml> to org.apache.torque/torque-runtime/4.1-SNAPSHOT/torque-runtime-4.1-SNAPSHOT.pom
[JENKINS] Archiving <https://builds.apache.org/job/Torque4-trunk/ws/torque4-trunk/torque-runtime/target/torque-runtime-4.1-SNAPSHOT.jar> to org.apache.torque/torque-runtime/4.1-SNAPSHOT/torque-runtime-4.1-SNAPSHOT.jar
[JENKINS] Archiving <https://builds.apache.org/job/Torque4-trunk/ws/torque4-trunk/torque-runtime/target/torque-runtime-4.1-SNAPSHOT-sources.jar> to org.apache.torque/torque-runtime/4.1-SNAPSHOT/torque-runtime-4.1-SNAPSHOT-sources.jar
[JENKINS] Archiving <https://builds.apache.org/job/Torque4-trunk/ws/torque4-trunk/torque-ant-tasks/pom.xml> to org.apache.torque/torque-ant-tasks/4.1-SNAPSHOT/torque-ant-tasks-4.1-SNAPSHOT.pom
Sending e-mails to: torque-dev@db.apache.org
channel stopped
Skipping Cobertura coverage report as build was not UNSTABLE or better ...

---------------------------------------------------------------------
To unsubscribe, e-mail: torque-dev-unsubscribe@db.apache.org
For additional commands, e-mail: torque-dev-help@db.apache.org


Build failed in Jenkins: Torque4-trunk #569

Posted by Apache Jenkins Server <je...@builds.apache.org>.
See <https://builds.apache.org/job/Torque4-trunk/569/>

------------------------------------------
[...truncated 4172 lines...]
[DEBUG] Located the service 'org.apache.torque.avalon.Torque' in the local container
[DEBUG] Disposing of container...
[DEBUG] Disposing all services
[DEBUG] Decommision the service TorqueComponent
[DEBUG] Decommisioning the service TorqueComponent
[DEBUG] Disposable.dispose() for TorqueComponent
[DEBUG] dispose()
[DEBUG] Disposing the service TorqueComponent
[DEBUG] All services are disposed
[INFO] YaffiContainer has been disposed.
Tests run: 2, Failures: 0, Errors: 0, Skipped: 0, Time elapsed: 0.333 sec - in org.apache.torque.avalon.AvalonTest
Running org.apache.torque.TorqueRuntimeExceptionTest
Tests run: 1, Failures: 0, Errors: 0, Skipped: 0, Time elapsed: 0.161 sec - in org.apache.torque.TorqueRuntimeExceptionTest
Running org.apache.torque.ColumnImplTest
Tests run: 41, Failures: 0, Errors: 0, Skipped: 0, Time elapsed: 0.257 sec - in org.apache.torque.ColumnImplTest
Running org.apache.torque.util.UniqueListTest
Tests run: 2, Failures: 0, Errors: 0, Skipped: 0, Time elapsed: 0.018 sec - in org.apache.torque.util.UniqueListTest
Running org.apache.torque.util.SummaryHelperTest
Tests run: 1, Failures: 0, Errors: 0, Skipped: 0, Time elapsed: 0.529 sec - in org.apache.torque.util.SummaryHelperTest
Running org.apache.torque.util.functions.MaxTest
Tests run: 4, Failures: 0, Errors: 0, Skipped: 0, Time elapsed: 0.028 sec - in org.apache.torque.util.functions.MaxTest
Running org.apache.torque.util.functions.CountTest
Tests run: 4, Failures: 0, Errors: 0, Skipped: 0, Time elapsed: 0.027 sec - in org.apache.torque.util.functions.CountTest
Running org.apache.torque.util.functions.AbstractFunctionTest
Tests run: 11, Failures: 0, Errors: 0, Skipped: 0, Time elapsed: 0.034 sec - in org.apache.torque.util.functions.AbstractFunctionTest
Running org.apache.torque.util.functions.SumTest
Tests run: 4, Failures: 0, Errors: 0, Skipped: 0, Time elapsed: 0.029 sec - in org.apache.torque.util.functions.SumTest
Running org.apache.torque.util.functions.AvgTest
Tests run: 4, Failures: 0, Errors: 0, Skipped: 0, Time elapsed: 0.027 sec - in org.apache.torque.util.functions.AvgTest
Running org.apache.torque.util.functions.MinTest
Tests run: 4, Failures: 0, Errors: 0, Skipped: 0, Time elapsed: 0.028 sec - in org.apache.torque.util.functions.MinTest
Running org.apache.torque.util.functions.AggregateFunctionTest
Tests run: 12, Failures: 0, Errors: 0, Skipped: 0, Time elapsed: 0.03 sec - in org.apache.torque.util.functions.AggregateFunctionTest
Running org.apache.torque.util.BasePeerImplTest
Tests run: 16, Failures: 0, Errors: 0, Skipped: 0, Time elapsed: 0.578 sec - in org.apache.torque.util.BasePeerImplTest
Running org.apache.torque.sql.QueryTest
Tests run: 2, Failures: 0, Errors: 0, Skipped: 0, Time elapsed: 0.163 sec - in org.apache.torque.sql.QueryTest
Running org.apache.torque.sql.SqlBuilderTest
Tests run: 130, Failures: 0, Errors: 0, Skipped: 0, Time elapsed: 0.431 sec - in org.apache.torque.sql.SqlBuilderTest

Results :

Tests run: 365, Failures: 0, Errors: 0, Skipped: 0

[JENKINS] Recording test results
[INFO] 
[INFO] --- maven-jar-plugin:3.0.0:jar (default-jar) @ torque-runtime ---
[INFO] Downloading: https://repo.maven.apache.org/maven2/org/apache/maven/maven-archiver/3.0.2/maven-archiver-3.0.2.pom
[INFO] Downloaded: https://repo.maven.apache.org/maven2/org/apache/maven/maven-archiver/3.0.2/maven-archiver-3.0.2.pom (5 KB at 505.7 KB/sec)
[INFO] Downloading: https://repo.maven.apache.org/maven2/org/apache/maven/shared/maven-shared-components/22/maven-shared-components-22.pom
[INFO] Downloaded: https://repo.maven.apache.org/maven2/org/apache/maven/shared/maven-shared-components/22/maven-shared-components-22.pom (5 KB at 713.4 KB/sec)
[INFO] Downloading: https://repo.maven.apache.org/maven2/org/codehaus/plexus/plexus-archiver/3.1.1/plexus-archiver-3.1.1.pom
[INFO] Downloaded: https://repo.maven.apache.org/maven2/org/codehaus/plexus/plexus-archiver/3.1.1/plexus-archiver-3.1.1.pom (5 KB at 694.6 KB/sec)
[INFO] Downloading: https://repo.maven.apache.org/maven2/org/codehaus/plexus/plexus-io/2.7.1/plexus-io-2.7.1.pom
[INFO] Downloaded: https://repo.maven.apache.org/maven2/org/codehaus/plexus/plexus-io/2.7.1/plexus-io-2.7.1.pom (5 KB at 800.5 KB/sec)
[INFO] Downloading: https://repo.maven.apache.org/maven2/org/apache/maven/maven-archiver/3.0.2/maven-archiver-3.0.2.jar
[INFO] Downloading: https://repo.maven.apache.org/maven2/org/codehaus/plexus/plexus-archiver/3.1.1/plexus-archiver-3.1.1.jar
[INFO] Downloading: https://repo.maven.apache.org/maven2/org/codehaus/plexus/plexus-io/2.7.1/plexus-io-2.7.1.jar
[INFO] Downloaded: https://repo.maven.apache.org/maven2/org/codehaus/plexus/plexus-io/2.7.1/plexus-io-2.7.1.jar (84 KB at 5587.3 KB/sec)
[INFO] Downloaded: https://repo.maven.apache.org/maven2/org/apache/maven/maven-archiver/3.0.2/maven-archiver-3.0.2.jar (23 KB at 1339.0 KB/sec)
[INFO] Downloaded: https://repo.maven.apache.org/maven2/org/codehaus/plexus/plexus-archiver/3.1.1/plexus-archiver-3.1.1.jar (175 KB at 8290.0 KB/sec)
[INFO] Building jar: <https://builds.apache.org/job/Torque4-trunk/ws/torque4-trunk/torque-runtime/target/torque-runtime-4.1-SNAPSHOT.jar>
[INFO] 
[INFO] --- maven-site-plugin:3.5.1:attach-descriptor (attach-descriptor) @ torque-runtime ---
[INFO] 
[INFO] --- maven-source-plugin:3.0.0:jar-no-fork (attach-sources) @ torque-runtime ---
[INFO] Building jar: <https://builds.apache.org/job/Torque4-trunk/ws/torque4-trunk/torque-runtime/target/torque-runtime-4.1-SNAPSHOT-sources.jar>
[INFO] 
[INFO] --- apache-rat-plugin:0.11:check (default) @ torque-runtime ---
[INFO] 51 implicit excludes (use -debug for more details).
[INFO] Exclude: velocity.log
[INFO] Exclude: .checkstyle
[INFO] Exclude: checkstyle-cache.ccf
[INFO] Exclude: derby.log
[INFO] Exclude: LICENSE-EDL.txt
[INFO] Exclude: DEPENDENCIES
[INFO] Exclude: torque-test/target/**/*
[INFO] Exclude: torque-test/.classpath
[INFO] Exclude: torque-test/.project
[INFO] Exclude: torque-test/.settings/**
[INFO] Exclude: torque-test/src/main/generated-java/**/*
[INFO] Exclude: torque-test/derby.log
[INFO] 182 resources included (use -debug for more details)
[INFO] Rat check: Summary of files. Unapproved: 0 unknown: 0 generated: 0 approved: 180 licence.
[CHECKSTYLE] No report found for mojo check
[PMD] No report found for mojo check
[INFO] 
[INFO] --- maven-install-plugin:2.5.2:install (default-install) @ torque-runtime ---
[INFO] Installing <https://builds.apache.org/job/Torque4-trunk/ws/torque4-trunk/torque-runtime/target/torque-runtime-4.1-SNAPSHOT.jar> to /home/jenkins/jenkins-slave/maven-repositories/0/org/apache/torque/torque-runtime/4.1-SNAPSHOT/torque-runtime-4.1-SNAPSHOT.jar
[INFO] Installing <https://builds.apache.org/job/Torque4-trunk/ws/torque4-trunk/torque-runtime/pom.xml> to /home/jenkins/jenkins-slave/maven-repositories/0/org/apache/torque/torque-runtime/4.1-SNAPSHOT/torque-runtime-4.1-SNAPSHOT.pom
[INFO] Installing <https://builds.apache.org/job/Torque4-trunk/ws/torque4-trunk/torque-runtime/target/torque-runtime-4.1-SNAPSHOT-sources.jar> to /home/jenkins/jenkins-slave/maven-repositories/0/org/apache/torque/torque-runtime/4.1-SNAPSHOT/torque-runtime-4.1-SNAPSHOT-sources.jar
[INFO] 
[INFO] >>> cobertura-maven-plugin:2.3:cobertura (default-cli) > [cobertura]test @ torque-runtime >>>
[INFO] 
[INFO] --- maven-remote-resources-plugin:1.5:process (process-resource-bundles) @ torque-runtime ---
[INFO] 
[INFO] --- maven-resources-plugin:2.7:resources (default-resources) @ torque-runtime ---
[INFO] Using 'ISO-8859-1' encoding to copy filtered resources.
[INFO] skip non existing resourceDirectory <https://builds.apache.org/job/Torque4-trunk/ws/torque4-trunk/torque-runtime/src/main/resources>
[INFO] Copying 3 resources
[INFO] Copying 3 resources
[INFO] 
[INFO] --- maven-compiler-plugin:3.5.1:compile (default-compile) @ torque-runtime ---
[INFO] Nothing to compile - all classes are up to date
[INFO] 
[INFO] --- cobertura-maven-plugin:2.3:instrument (default-cli) @ torque-runtime ---
[INFO] Cobertura 1.9.2 - GNU GPL License (NO WARRANTY) - See COPYRIGHT file
Instrumenting 122 files to <https://builds.apache.org/job/Torque4-trunk/ws/torque4-trunk/torque-runtime/target/generated-classes/cobertura>
Cobertura: Saved information on 122 classes.
Instrument time: 722ms

[INFO] Instrumentation was successful.
[INFO] 
[INFO] --- maven-resources-plugin:2.7:testResources (default-testResources) @ torque-runtime ---
[INFO] Using 'ISO-8859-1' encoding to copy filtered resources.
[INFO] Copying 5 resources
[INFO] Copying 3 resources
[INFO] Copying 3 resources
[INFO] 
[INFO] --- maven-compiler-plugin:3.5.1:testCompile (default-testCompile) @ torque-runtime ---
[INFO] Nothing to compile - all classes are up to date
[INFO] 
[INFO] --- maven-surefire-plugin:2.19.1:test (default-test) @ torque-runtime ---

-------------------------------------------------------
 T E S T S
-------------------------------------------------------

Results :

Tests run: 0, Failures: 0, Errors: 0, Skipped: 0

[JENKINS] Recording test results
[INFO] ------------------------------------------------------------------------
[INFO] Reactor Summary:
[INFO] 
[INFO] Torque Maven Parent ................................ SUCCESS [ 49.351 s]
[INFO] Torque Runtime ..................................... FAILURE [ 46.816 s]
[INFO] Torque Generator ................................... SKIPPED
[INFO] Torque Templates ................................... SKIPPED
[INFO] Torque Generator Maven 2 Plugin .................... SKIPPED
[INFO] Torque Generator Ant tasks ......................... SKIPPED
[INFO] Torque Site ........................................ SKIPPED
[INFO] ------------------------------------------------------------------------
[INFO] BUILD FAILURE
[INFO] ------------------------------------------------------------------------
[INFO] Total time: 01:44 min
[INFO] Finished at: 2016-09-21T00:38:27+00:00
[INFO] Final Memory: 67M/810M
[INFO] ------------------------------------------------------------------------
[ERROR] Failed to execute goal org.apache.maven.plugins:maven-surefire-plugin:2.19.1:test (default-test) on project torque-runtime: Execution default-test of goal org.apache.maven.plugins:maven-surefire-plugin:2.19.1:test failed: There was an error in the forked process
[ERROR] java.lang.VerifyError:
[ERROR] Expecting a stackmap frame at branch target 449
[ERROR] Exception Details:
[ERROR] Location:
[ERROR] org/apache/torque/manager/AbstractBaseManager.setRegion(Ljava/lang/String;)V @25: invokestatic
[ERROR] Reason:
[ERROR] Expected stackmap frame at this location.
[ERROR] Bytecode:
[ERROR] 0x0000000: 033d 11ff ff3e b800 2e12 30b6 0034 1101
[ERROR] 0x0000010: eab6 003a 2a2b b501 44b8 002e 1230 b600
[ERROR] 0x0000020: 3411 01ed b600 3ab8 014b 1301 4d03 b901
[ERROR] 0x0000030: 5303 0011 01ed 3d11 0000 3e99 0145 1c11
[ERROR] 0x0000040: 01ed a000 1c1d 1100 00a0 0015 b800 2e12
[ERROR] 0x0000050: 30b6 0034 1c1d 04b6 009c 11ff ff3e b800
[ERROR] 0x0000060: 2e12 30b6 0034 1101 efb6 003a 2ab4 00c0
[ERROR] 0x0000070: 1101 ef3d 1100 003e c600 381c 1101 efa0
[ERROR] 0x0000080: 001c 1d11 0000 a000 15b8 002e 1230 b600
[ERROR] 0x0000090: 341c 1d04 b600 9c11 ffff 3eb8 002e 1230
[ERROR] 0x00000a0: b600 3411 01f1 b600 3a2a b400 c0b6 00d3
[ERROR] 0x00000b0: 1d9b 0015 b800 2e12 30b6 0034 1c1d 03b6
[ERROR] 0x00000c0: 009c 11ff ff3e b800 2e12 30b6 0034 1101
[ERROR] 0x00000d0: f3b6 003a 2ab4 00d5 1101 f33d 1100 003e
[ERROR] 0x00000e0: c600 381c 1101 f3a0 001c 1d11 0000 a000
[ERROR] 0x00000f0: 15b8 002e 1230 b600 341c 1d04 b600 9c11
[ERROR] 0x0000100: ffff 3eb8 002e 1230 b600 3411 01f5 b600
[ERROR] 0x0000110: 3a2a b400 d5b6 00d8 1d9b 0015 b800 2e12
[ERROR] 0x0000120: 30b6 0034 1c1d 03b6 009c 11ff ff3e b800
[ERROR] 0x0000130: 2e12 30b6 0034 1101 f7b6 003a 2a2a b601
[ERROR] 0x0000140: 55b8 015b b500 c0b8 002e 1230 b600 3411
[ERROR] 0x0000150: 01f9 b600 3a2a 2ab6 0155 b801 5fb5 00d5
[ERROR] 0x0000160: b800 2e12 30b6 0034 1101 fab6 003a 2abb
[ERROR] 0x0000170: 0161 592a b400 d5b7 0164 b501 66a7 0033
[ERROR] 0x0000180: 1d9b 0015 b800 2e12 30b6 0034 1c1d 03b6
[ERROR] 0x0000190: 009c 11ff ff3e b800 2e12 30b6 0034 1101
[ERROR] 0x00001a0: feb6 003a 2abb 0168 5901 b701 69b5 0166
[ERROR] 0x00001b0: b800 2e12 30b6 0034 1102 04b6 003a a700
[ERROR] 0x00001c0: 2eb8 002e 1230 b600 3411 0201 b600 3a3a
[ERROR] 0x00001d0: 04b8 002e 1230 b600 3411 0203 b600 3abb
[ERROR] 0x00001e0: 0066 5913 016b 1904 b700 85bf b800 2e12
[ERROR] 0x00001f0: 30b6 0034 1102 06b6 003a 2ab4 00c0 1102
[ERROR] 0x0000200: 063d 1100 003e c700 4d1c 1102 06a0 001c
[ERROR] 0x0000210: 1d11 0000 a000 15b8 002e 1230 b600 341c
[ERROR] 0x0000220: 1d04 b600 9c11 ffff 3eb8 002e 1230 b600
[ERROR] 0x0000230: 3411 0208 b600 3ab2 016d bb00 7459 b700
[ERROR] 0x0000240: 7513 016f b600 7b2b b600 7bb6 0082 b901
[ERROR] 0x0000250: 7402 001d 9b00 15b8 002e 1230 b600 341c
[ERROR] 0x0000260: 1d03 b600 9c11 ffff 3eb8 002e 1230 b600
[ERROR] 0x0000270: 3411 020a b600 3ab1
[ERROR] Exception Handler Table:
[ERROR] bci [25, 432] => handler: 449
[ERROR] Stackmap Table:
[ERROR] same_frame_extended(@212)
[ERROR] same_frame_extended(@316)
[ERROR] same_frame_extended(@420)
[ERROR] same_frame(@446)
[ERROR] same_locals_1_stack_item_frame(@463,Object[#201])
[ERROR] same_frame(@506)
[ERROR] same_frame_extended(@631)
[ERROR] 
[ERROR] at java.lang.Class.getDeclaredMethods0(Native Method)
[ERROR] at java.lang.Class.privateGetDeclaredMethods(Class.java:2701)
[ERROR] at java.lang.Class.privateGetMethodRecursive(Class.java:3048)
[ERROR] at java.lang.Class.getMethod0(Class.java:3018)
[ERROR] at java.lang.Class.getMethod(Class.java:1784)
[ERROR] at org.apache.maven.surefire.util.ReflectionUtils.tryGetMethod(ReflectionUtils.java:61)
[ERROR] at org.apache.maven.surefire.common.junit3.JUnit3TestChecker.isSuiteOnly(JUnit3TestChecker.java:64)
[ERROR] at org.apache.maven.surefire.common.junit3.JUnit3TestChecker.isValidJUnit3Test(JUnit3TestChecker.java:59)
[ERROR] at org.apache.maven.surefire.common.junit3.JUnit3TestChecker.accept(JUnit3TestChecker.java:54)
[ERROR] at org.apache.maven.surefire.junit.PojoAndJUnit3Checker.accept(PojoAndJUnit3Checker.java:43)
[ERROR] at org.apache.maven.surefire.util.DefaultScanResult.applyFilter(DefaultScanResult.java:98)
[ERROR] at org.apache.maven.surefire.junit.JUnit3Provider.scanClassPath(JUnit3Provider.java:143)
[ERROR] at org.apache.maven.surefire.junit.JUnit3Provider.invoke(JUnit3Provider.java:87)
[ERROR] at org.apache.maven.surefire.booter.ForkedBooter.invokeProviderInSameClassLoader(ForkedBooter.java:290)
[ERROR] at org.apache.maven.surefire.booter.ForkedBooter.runSuitesInProcess(ForkedBooter.java:242)
[ERROR] at org.apache.maven.surefire.booter.ForkedBooter.main(ForkedBooter.java:121)
[ERROR] -> [Help 1]
[ERROR] 
[ERROR] To see the full stack trace of the errors, re-run Maven with the -e switch.
[ERROR] Re-run Maven using the -X switch to enable full debug logging.
[ERROR] 
[ERROR] For more information about the errors and possible solutions, please read the following articles:
[ERROR] [Help 1] http://cwiki.apache.org/confluence/display/MAVEN/PluginExecutionException
[ERROR] 
[ERROR] After correcting the problems, you can resume the build with the command
[ERROR]   mvn <goals> -rf :torque-runtime
[JENKINS] Archiving <https://builds.apache.org/job/Torque4-trunk/ws/torque4-trunk/torque-maven-plugin/pom.xml> to org.apache.torque/torque-maven-plugin/4.1-SNAPSHOT/torque-maven-plugin-4.1-SNAPSHOT.pom
[JENKINS] Archiving <https://builds.apache.org/job/Torque4-trunk/ws/torque4-trunk/pom.xml> to org.apache.torque/torque/4.1-SNAPSHOT/torque-4.1-SNAPSHOT.pom
<https://builds.apache.org/job/Torque4-trunk/ws/torque4-trunk/pom.xml> is not inside <https://builds.apache.org/job/Torque4-trunk/ws/torque4-trunk/torque4-trunk/;> will archive in a separate pass
[JENKINS] Archiving <https://builds.apache.org/job/Torque4-trunk/ws/torque4-trunk/torque-site/pom.xml> to org.apache.torque/torque-site/4.1-SNAPSHOT/torque-site-4.1-SNAPSHOT.pom
[JENKINS] Archiving <https://builds.apache.org/job/Torque4-trunk/ws/torque4-trunk/torque-generator/pom.xml> to org.apache.torque/torque-generator/4.1-SNAPSHOT/torque-generator-4.1-SNAPSHOT.pom
[JENKINS] Archiving <https://builds.apache.org/job/Torque4-trunk/ws/torque4-trunk/torque-templates/pom.xml> to org.apache.torque/torque-templates/4.1-SNAPSHOT/torque-templates-4.1-SNAPSHOT.pom
[JENKINS] Archiving <https://builds.apache.org/job/Torque4-trunk/ws/torque4-trunk/torque-runtime/pom.xml> to org.apache.torque/torque-runtime/4.1-SNAPSHOT/torque-runtime-4.1-SNAPSHOT.pom
[JENKINS] Archiving <https://builds.apache.org/job/Torque4-trunk/ws/torque4-trunk/torque-runtime/target/torque-runtime-4.1-SNAPSHOT.jar> to org.apache.torque/torque-runtime/4.1-SNAPSHOT/torque-runtime-4.1-SNAPSHOT.jar
[JENKINS] Archiving <https://builds.apache.org/job/Torque4-trunk/ws/torque4-trunk/torque-runtime/target/torque-runtime-4.1-SNAPSHOT-sources.jar> to org.apache.torque/torque-runtime/4.1-SNAPSHOT/torque-runtime-4.1-SNAPSHOT-sources.jar
[JENKINS] Archiving <https://builds.apache.org/job/Torque4-trunk/ws/torque4-trunk/torque-ant-tasks/pom.xml> to org.apache.torque/torque-ant-tasks/4.1-SNAPSHOT/torque-ant-tasks-4.1-SNAPSHOT.pom
Sending e-mails to: torque-dev@db.apache.org
channel stopped
Skipping Cobertura coverage report as build was not UNSTABLE or better ...

---------------------------------------------------------------------
To unsubscribe, e-mail: torque-dev-unsubscribe@db.apache.org
For additional commands, e-mail: torque-dev-help@db.apache.org