You are viewing a plain text version of this content. The canonical link for it is here.
Posted to dev@openmeetings.apache.org by Apache Jenkins Server <je...@builds.apache.org> on 2018/07/30 06:48:02 UTC

Build failed in Jenkins: OpenMeetings 4.0.x #377

See <https://builds.apache.org/job/OpenMeetings%204.0.x/377/display/redirect?page=changes>

Changes:

[solomax666] [OPENMEETINGS-1897] compiler plugin version is updated

------------------------------------------
[...truncated 4.18 MB...]
  Currently in standby mode.
  Number of jobs executed: 0
  Using thread pool 'org.quartz.simpl.SimpleThreadPool' - with 10 threads.
  Using job-store 'org.quartz.simpl.RAMJobStore' - which does not support persistence. and is not clustered.

INFO  07-30 06:46:11.171 o.q.i.StdSchedulerFactory:1362 [main] - Quartz scheduler 'org.springframework.scheduling.quartz.SchedulerFactoryBean#0' initialized from an externally provided properties instance.
INFO  07-30 06:46:11.171 o.q.i.StdSchedulerFactory:1366 [main] - Quartz scheduler version: 2.3.0
INFO  07-30 06:46:11.175 o.q.c.QuartzScheduler:2287 [main] - JobFactory set to: org.springframework.scheduling.quartz.AdaptableJobFactory@5b62b4d1
INFO  07-30 06:46:11.226 o.s.c.s.DefaultLifecycleProcessor:341 [main] - Starting beans in phase 2147483647
INFO  07-30 06:46:11.227 o.s.s.q.SchedulerFactoryBean:684 [main] - Starting Quartz Scheduler now
INFO  07-30 06:46:11.227 o.q.c.QuartzScheduler:547 [main] - Scheduler org.springframework.scheduling.quartz.SchedulerFactoryBean#0_$_NON_CLUSTERED started.
[INFO] Running org.apache.openmeetings.userdata.TestLogin
ERROR 07-30 06:46:15.201 o.a.o.d.d.b.ConfigurationDao:537 [main] - Unexpected exception while reloading room settings: 
java.io.FileNotFoundException: <https://builds.apache.org/job/OpenMeetings%204.0.x/ws/openmeetings-web/conf/red5.properties> (No such file or directory)
	at java.io.FileInputStream.open0(Native Method)
	at java.io.FileInputStream.open(FileInputStream.java:195)
	at java.io.FileInputStream.<init>(FileInputStream.java:138)
	at org.apache.openmeetings.db.dao.basic.ConfigurationDao.reloadRoomSettings(ConfigurationDao.java:516)
	at org.apache.openmeetings.db.dao.basic.ConfigurationDao.reinit(ConfigurationDao.java:503)
	at org.apache.openmeetings.db.dao.basic.ConfigurationDao$$FastClassBySpringCGLIB$$2f9526f2.invoke(<generated>)
	at org.springframework.cglib.proxy.MethodProxy.invoke(MethodProxy.java:204)
	at org.springframework.aop.framework.CglibAopProxy$CglibMethodInvocation.invokeJoinpoint(CglibAopProxy.java:736)
	at org.springframework.aop.framework.ReflectiveMethodInvocation.proceed(ReflectiveMethodInvocation.java:157)
	at org.springframework.transaction.interceptor.TransactionInterceptor$1.proceedWithInvocation(TransactionInterceptor.java:99)
	at org.springframework.transaction.interceptor.TransactionAspectSupport.invokeWithinTransaction(TransactionAspectSupport.java:282)
	at org.springframework.transaction.interceptor.TransactionInterceptor.invoke(TransactionInterceptor.java:96)
	at org.springframework.aop.framework.ReflectiveMethodInvocation.proceed(ReflectiveMethodInvocation.java:179)
	at org.springframework.aop.framework.CglibAopProxy$DynamicAdvisedInterceptor.intercept(CglibAopProxy.java:671)
	at org.apache.openmeetings.db.dao.basic.ConfigurationDao$$EnhancerBySpringCGLIB$$3c3b077a.reinit(<generated>)
	at org.apache.openmeetings.AbstractJUnitDefaults.setUp(AbstractJUnitDefaults.java:72)
	at sun.reflect.NativeMethodAccessorImpl.invoke0(Native Method)
	at sun.reflect.NativeMethodAccessorImpl.invoke(NativeMethodAccessorImpl.java:62)
	at sun.reflect.DelegatingMethodAccessorImpl.invoke(DelegatingMethodAccessorImpl.java:43)
	at java.lang.reflect.Method.invoke(Method.java:498)
	at org.junit.runners.model.FrameworkMethod$1.runReflectiveCall(FrameworkMethod.java:50)
	at org.junit.internal.runners.model.ReflectiveCallable.run(ReflectiveCallable.java:12)
	at org.junit.runners.model.FrameworkMethod.invokeExplosively(FrameworkMethod.java:47)
	at org.junit.internal.runners.statements.RunBefores.evaluate(RunBefores.java:24)
	at org.springframework.test.context.junit4.statements.RunBeforeTestMethodCallbacks.evaluate(RunBeforeTestMethodCallbacks.java:75)
	at org.springframework.test.context.junit4.statements.RunAfterTestMethodCallbacks.evaluate(RunAfterTestMethodCallbacks.java:86)
	at org.springframework.test.context.junit4.statements.SpringRepeat.evaluate(SpringRepeat.java:84)
	at org.junit.runners.ParentRunner.runLeaf(ParentRunner.java:325)
	at org.springframework.test.context.junit4.SpringJUnit4ClassRunner.runChild(SpringJUnit4ClassRunner.java:252)
	at org.springframework.test.context.junit4.SpringJUnit4ClassRunner.runChild(SpringJUnit4ClassRunner.java:94)
	at org.junit.runners.ParentRunner$3.run(ParentRunner.java:290)
	at org.junit.runners.ParentRunner$1.schedule(ParentRunner.java:71)
	at org.junit.runners.ParentRunner.runChildren(ParentRunner.java:288)
	at org.junit.runners.ParentRunner.access$000(ParentRunner.java:58)
	at org.junit.runners.ParentRunner$2.evaluate(ParentRunner.java:268)
	at org.junit.internal.runners.statements.RunBefores.evaluate(RunBefores.java:26)
	at org.springframework.test.context.junit4.statements.RunBeforeTestClassCallbacks.evaluate(RunBeforeTestClassCallbacks.java:61)
	at org.springframework.test.context.junit4.statements.RunAfterTestClassCallbacks.evaluate(RunAfterTestClassCallbacks.java:70)
	at org.junit.runners.ParentRunner.run(ParentRunner.java:363)
	at org.springframework.test.context.junit4.SpringJUnit4ClassRunner.run(SpringJUnit4ClassRunner.java:191)
	at org.junit.runners.Suite.runChild(Suite.java:128)
	at org.junit.runners.Suite.runChild(Suite.java:27)
	at org.junit.runners.ParentRunner$3.run(ParentRunner.java:290)
	at org.junit.runners.ParentRunner$1.schedule(ParentRunner.java:71)
	at org.junit.runners.ParentRunner.runChildren(ParentRunner.java:288)
	at org.junit.runners.ParentRunner.access$000(ParentRunner.java:58)
	at org.junit.runners.ParentRunner$2.evaluate(ParentRunner.java:268)
	at org.junit.runners.ParentRunner.run(ParentRunner.java:363)
	at org.apache.maven.surefire.junitcore.JUnitCore.run(JUnitCore.java:55)
	at org.apache.maven.surefire.junitcore.JUnitCoreWrapper.createRequestAndRun(JUnitCoreWrapper.java:137)
	at org.apache.maven.surefire.junitcore.JUnitCoreWrapper.executeEager(JUnitCoreWrapper.java:107)
	at org.apache.maven.surefire.junitcore.JUnitCoreWrapper.execute(JUnitCoreWrapper.java:83)
	at org.apache.maven.surefire.junitcore.JUnitCoreWrapper.execute(JUnitCoreWrapper.java:75)
	at org.apache.maven.surefire.junitcore.JUnitCoreProvider.invoke(JUnitCoreProvider.java:158)
	at org.apache.maven.surefire.booter.ForkedBooter.invokeProviderInSameClassLoader(ForkedBooter.java:383)
	at org.apache.maven.surefire.booter.ForkedBooter.runSuitesInProcess(ForkedBooter.java:344)
	at org.apache.maven.surefire.booter.ForkedBooter.execute(ForkedBooter.java:125)
	at org.apache.maven.surefire.booter.ForkedBooter.main(ForkedBooter.java:417)
INFO  07-30 06:46:15.360 o.a.o.AbstractJUnitDefaults:82 [main] - Default scheme already created
DEBUG 07-30 06:46:15.517 o.a.o.d.d.u.UserDao:654 [main] - login:: 1 users were found
DEBUG 07-30 06:46:15.539 o.a.o.u.c.CryptProvider:39 [main] - getInstanceOfCrypt:: configKeyCryptClassName: org.apache.openmeetings.util.crypt.SCryptImplementation
DEBUG 07-30 06:46:16.848 o.a.o.d.u.AuthLevelUtil:42 [main] - Level Login :: [GRANTED]
DEBUG 07-30 06:46:16.927 o.a.o.d.d.u.UserDao:671 [main] - loginUser [GroupUser [id=1, moderator=false, group=Group [id=1, name=smoketest, deleted=false], user=User [id=1, firstname=firstname, lastname=lastname, login=admin, pictureuri=null, deleted=false, languageId=1, address=Address [id=1, country=US, street=null, town=null, zip=null, deleted=false, email=junit@openmeetings.apache.org, phone=null], externalId=null, externalType=null, type=user]], GroupUser [id=501, moderator=false, group=Group [id=301, name=default, deleted=false], user=User [id=1, firstname=firstname, lastname=lastname, login=admin, pictureuri=null, deleted=false, languageId=1, address=Address [id=1, country=US, street=null, town=null, zip=null, deleted=false, email=junit@openmeetings.apache.org, phone=null], externalId=null, externalType=null, type=user]]]
[INFO] Tests run: 1, Failures: 0, Errors: 0, Skipped: 0, Time elapsed: 5.772 s - in org.apache.openmeetings.userdata.TestLogin
INFO  07-30 06:46:17.045 o.s.c.s.GenericApplicationContext:984 [Thread-2] - Closing org.springframework.context.support.GenericApplicationContext@29c1249a: startup date [Mon Jul 30 06:46:05 UTC 2018]; root of context hierarchy
Jul 30, 2018 6:46:17 AM com.hazelcast.instance.Node
INFO: [172.18.0.1]:5701 [dev] [3.10.1] Running shutdown hook... Current state: ACTIVE
INFO  07-30 06:46:17.048 o.s.c.s.DefaultLifecycleProcessor:356 [Thread-2] - Stopping beans in phase 2147483647
INFO  07-30 06:46:17.144 o.q.c.QuartzScheduler:585 [Thread-2] - Scheduler org.springframework.scheduling.quartz.SchedulerFactoryBean#0_$_NON_CLUSTERED paused.
INFO  07-30 06:46:17.145 o.s.s.q.SchedulerFactoryBean:806 [Thread-2] - Shutting down Quartz Scheduler
INFO  07-30 06:46:17.146 o.q.c.QuartzScheduler:666 [Thread-2] - Scheduler org.springframework.scheduling.quartz.SchedulerFactoryBean#0_$_NON_CLUSTERED shutting down.
INFO  07-30 06:46:17.146 o.q.c.QuartzScheduler:585 [Thread-2] - Scheduler org.springframework.scheduling.quartz.SchedulerFactoryBean#0_$_NON_CLUSTERED paused.
INFO  07-30 06:46:17.147 o.q.c.QuartzScheduler:740 [Thread-2] - Scheduler org.springframework.scheduling.quartz.SchedulerFactoryBean#0_$_NON_CLUSTERED shutdown complete.
INFO  07-30 06:46:17.167 o.s.s.c.ThreadPoolTaskExecutor:202 [Thread-2] - Shutting down ExecutorService 'taskExecutor'
INFO  07-30 06:46:17.168 o.s.o.j.LocalEntityManagerFactoryBean:590 [Thread-2] - Closing JPA EntityManagerFactory for persistence unit 'openmeetings'
[INFO] 
[INFO] Results:
[INFO] 
[INFO] Tests run: 145, Failures: 0, Errors: 0, Skipped: 0
[INFO] 
[JENKINS] Recording test results
[INFO] 
[INFO] --- maven-war-plugin:3.2.1:exploded (create-war) @ openmeetings-web ---
[INFO] Exploding webapp
[INFO] Assembling webapp [openmeetings-web] in [<https://builds.apache.org/job/OpenMeetings%204.0.x/ws/openmeetings-web/target/openmeetings-web-4.0.5-SNAPSHOT]>
[INFO] Processing war project
[INFO] Copying webapp webResources [<https://builds.apache.org/job/OpenMeetings%204.0.x/ws/openmeetings-web/target/generated-res]> to [<https://builds.apache.org/job/OpenMeetings%204.0.x/ws/openmeetings-web/target/openmeetings-web-4.0.5-SNAPSHOT]>
[INFO] Copying webapp resources [<https://builds.apache.org/job/OpenMeetings%204.0.x/ws/openmeetings-web/src/main/webapp]>
[INFO] Building jar: <https://builds.apache.org/job/OpenMeetings%204.0.x/ws/openmeetings-web/target/openmeetings-web-4.0.5-SNAPSHOT/WEB-INF/lib/openmeetings-web-4.0.5-SNAPSHOT.jar>
[INFO] Webapp assembled in [530 msecs]
[INFO] 
[INFO] --- maven-dependency-plugin:3.1.0:copy-dependencies (copy-dependencies) @ openmeetings-web ---
[INFO] Copying spring-orm-4.3.18.RELEASE.jar to <https://builds.apache.org/job/OpenMeetings%204.0.x/ws/openmeetings-web/target/lib/spring-orm-4.3.18.RELEASE.jar>
[INFO] Copying openmeetings-db-4.0.5-SNAPSHOT.jar to <https://builds.apache.org/job/OpenMeetings%204.0.x/ws/openmeetings-web/target/lib/openmeetings-db-4.0.5-SNAPSHOT.jar>
[INFO] Copying tomcat-catalina-ha-9.0.10.jar to <https://builds.apache.org/job/OpenMeetings%204.0.x/ws/openmeetings-web/target/lib/tomcat-catalina-ha-9.0.10.jar>
[INFO] Copying tomcat-embed-websocket-9.0.10.jar to <https://builds.apache.org/job/OpenMeetings%204.0.x/ws/openmeetings-web/target/lib/tomcat-embed-websocket-9.0.10.jar>
[INFO] Copying commons-lang3-3.7.jar to <https://builds.apache.org/job/OpenMeetings%204.0.x/ws/openmeetings-web/target/lib/commons-lang3-3.7.jar>
[INFO] Copying openmeetings-core-4.0.5-SNAPSHOT-tests.jar to <https://builds.apache.org/job/OpenMeetings%204.0.x/ws/openmeetings-web/target/lib/openmeetings-core-4.0.5-SNAPSHOT-tests.jar>
[INFO] Copying openmeetings-install-4.0.5-SNAPSHOT.jar to <https://builds.apache.org/job/OpenMeetings%204.0.x/ws/openmeetings-web/target/lib/openmeetings-install-4.0.5-SNAPSHOT.jar>
[INFO] Copying cxf-rt-rs-client-3.2.5.jar to <https://builds.apache.org/job/OpenMeetings%204.0.x/ws/openmeetings-web/target/lib/cxf-rt-rs-client-3.2.5.jar>
[INFO] Copying derbynet-10.14.2.0.jar to <https://builds.apache.org/job/OpenMeetings%204.0.x/ws/openmeetings-web/target/lib/derbynet-10.14.2.0.jar>
[INFO] Copying openmeetings-webservice-4.0.5-SNAPSHOT.jar to <https://builds.apache.org/job/OpenMeetings%204.0.x/ws/openmeetings-web/target/lib/openmeetings-webservice-4.0.5-SNAPSHOT.jar>
[INFO] Copying wicket-kendo-ui-8.0.0.jar to <https://builds.apache.org/job/OpenMeetings%204.0.x/ws/openmeetings-web/target/lib/wicket-kendo-ui-8.0.0.jar>
[INFO] Copying spring-core-4.3.18.RELEASE.jar to <https://builds.apache.org/job/OpenMeetings%204.0.x/ws/openmeetings-web/target/lib/spring-core-4.3.18.RELEASE.jar>
[INFO] Copying wicket-kendo-ui-theme-default-8.0.0.jar to <https://builds.apache.org/job/OpenMeetings%204.0.x/ws/openmeetings-web/target/lib/wicket-kendo-ui-theme-default-8.0.0.jar>
[INFO] Copying wicket-auth-roles-8.0.0.jar to <https://builds.apache.org/job/OpenMeetings%204.0.x/ws/openmeetings-web/target/lib/wicket-auth-roles-8.0.0.jar>
[INFO] Copying openmeetings-util-4.0.5-SNAPSHOT.jar to <https://builds.apache.org/job/OpenMeetings%204.0.x/ws/openmeetings-web/target/lib/openmeetings-util-4.0.5-SNAPSHOT.jar>
[INFO] Copying wicketstuff-dashboard-core-8.0.0.jar to <https://builds.apache.org/job/OpenMeetings%204.0.x/ws/openmeetings-web/target/lib/wicketstuff-dashboard-core-8.0.0.jar>
[INFO] Copying wicket-jquery-ui-8.0.0.jar to <https://builds.apache.org/job/OpenMeetings%204.0.x/ws/openmeetings-web/target/lib/wicket-jquery-ui-8.0.0.jar>
[INFO] Copying pdfbox-2.0.11.jar to <https://builds.apache.org/job/OpenMeetings%204.0.x/ws/openmeetings-web/target/lib/pdfbox-2.0.11.jar>
[INFO] Copying wicket-jquery-ui-plugins-8.0.0.jar to <https://builds.apache.org/job/OpenMeetings%204.0.x/ws/openmeetings-web/target/lib/wicket-jquery-ui-plugins-8.0.0.jar>
[INFO] Copying openmeetings-service-4.0.5-SNAPSHOT.jar to <https://builds.apache.org/job/OpenMeetings%204.0.x/ws/openmeetings-web/target/lib/openmeetings-service-4.0.5-SNAPSHOT.jar>
[INFO] Copying wicket-native-websocket-javax-8.0.0.jar to <https://builds.apache.org/job/OpenMeetings%204.0.x/ws/openmeetings-web/target/lib/wicket-native-websocket-javax-8.0.0.jar>
[INFO] Copying spring-test-4.3.18.RELEASE.jar to <https://builds.apache.org/job/OpenMeetings%204.0.x/ws/openmeetings-web/target/lib/spring-test-4.3.18.RELEASE.jar>
[INFO] Copying wicket-jquery-ui-core-8.0.0.jar to <https://builds.apache.org/job/OpenMeetings%204.0.x/ws/openmeetings-web/target/lib/wicket-jquery-ui-core-8.0.0.jar>
[INFO] Copying junit-4.12.jar to <https://builds.apache.org/job/OpenMeetings%204.0.x/ws/openmeetings-web/target/lib/junit-4.12.jar>
[INFO] Copying tomcat-servlet-api-9.0.10.jar to <https://builds.apache.org/job/OpenMeetings%204.0.x/ws/openmeetings-web/target/lib/tomcat-servlet-api-9.0.10.jar>
[INFO] Copying wicketstuff-select2-8.0.0.jar to <https://builds.apache.org/job/OpenMeetings%204.0.x/ws/openmeetings-web/target/lib/wicketstuff-select2-8.0.0.jar>
[INFO] Copying wicket-devutils-8.0.0.jar to <https://builds.apache.org/job/OpenMeetings%204.0.x/ws/openmeetings-web/target/lib/wicket-devutils-8.0.0.jar>
[INFO] Copying openmeetings-core-4.0.5-SNAPSHOT.jar to <https://builds.apache.org/job/OpenMeetings%204.0.x/ws/openmeetings-web/target/lib/openmeetings-core-4.0.5-SNAPSHOT.jar>
[INFO] Copying tomcat-embed-core-9.0.10.jar to <https://builds.apache.org/job/OpenMeetings%204.0.x/ws/openmeetings-web/target/lib/tomcat-embed-core-9.0.10.jar>
[INFO] Copying wicketstuff-urlfragment-8.0.0.jar to <https://builds.apache.org/job/OpenMeetings%204.0.x/ws/openmeetings-web/target/lib/wicketstuff-urlfragment-8.0.0.jar>
[INFO] Copying jqplot-8.0.0.jar to <https://builds.apache.org/job/OpenMeetings%204.0.x/ws/openmeetings-web/target/lib/jqplot-8.0.0.jar>
[INFO] Copying wicket-jquery-ui-calendar-8.0.0.jar to <https://builds.apache.org/job/OpenMeetings%204.0.x/ws/openmeetings-web/target/lib/wicket-jquery-ui-calendar-8.0.0.jar>
[INFO] Copying spring-context-support-4.3.18.RELEASE.jar to <https://builds.apache.org/job/OpenMeetings%204.0.x/ws/openmeetings-web/target/lib/spring-context-support-4.3.18.RELEASE.jar>
[INFO] Copying wicket-kendo-ui-culture-8.0.0.jar to <https://builds.apache.org/job/OpenMeetings%204.0.x/ws/openmeetings-web/target/lib/wicket-kendo-ui-culture-8.0.0.jar>
[INFO] Copying openmeetings-util-4.0.5-SNAPSHOT-tests.jar to <https://builds.apache.org/job/OpenMeetings%204.0.x/ws/openmeetings-web/target/lib/openmeetings-util-4.0.5-SNAPSHOT-tests.jar>
[INFO] Copying tomcat-embed-jasper-9.0.10.jar to <https://builds.apache.org/job/OpenMeetings%204.0.x/ws/openmeetings-web/target/lib/tomcat-embed-jasper-9.0.10.jar>
[INFO] Copying selenium-java-3.13.0.jar to <https://builds.apache.org/job/OpenMeetings%204.0.x/ws/openmeetings-web/target/lib/selenium-java-3.13.0.jar>
[INFO] 
[INFO] --- maven-war-plugin:3.2.1:war (default-war) @ openmeetings-web ---
[INFO] Packaging webapp
[INFO] Assembling webapp [openmeetings-web] in [<https://builds.apache.org/job/OpenMeetings%204.0.x/ws/openmeetings-web/target/openmeetings-web-4.0.5-SNAPSHOT]>
[INFO] Processing war project
[INFO] Copying webapp webResources [<https://builds.apache.org/job/OpenMeetings%204.0.x/ws/openmeetings-web/target/generated-res]> to [<https://builds.apache.org/job/OpenMeetings%204.0.x/ws/openmeetings-web/target/openmeetings-web-4.0.5-SNAPSHOT]>
[INFO] Copying webapp resources [<https://builds.apache.org/job/OpenMeetings%204.0.x/ws/openmeetings-web/src/main/webapp]>
[INFO] Building jar: <https://builds.apache.org/job/OpenMeetings%204.0.x/ws/openmeetings-web/target/openmeetings-web-4.0.5-SNAPSHOT/WEB-INF/lib/openmeetings-web-4.0.5-SNAPSHOT.jar>
[INFO] Webapp assembled in [375 msecs]
[INFO] Building war: <https://builds.apache.org/job/OpenMeetings%204.0.x/ws/openmeetings-web/target/openmeetings-web-4.0.5-SNAPSHOT.war>
[INFO] 
[INFO] --- maven-site-plugin:3.7.1:attach-descriptor (attach-descriptor) @ openmeetings-web ---
[INFO] Skipping because packaging 'war' is not pom.
[INFO] 
[INFO] --- maven-install-plugin:2.5.2:install (default-install) @ openmeetings-web ---
[INFO] Installing <https://builds.apache.org/job/OpenMeetings%204.0.x/ws/openmeetings-web/target/openmeetings-web-4.0.5-SNAPSHOT.war> to /home/jenkins/jenkins-slave/maven-repositories/0/org/apache/openmeetings/openmeetings-web/4.0.5-SNAPSHOT/openmeetings-web-4.0.5-SNAPSHOT.war
[INFO] Installing <https://builds.apache.org/job/OpenMeetings%204.0.x/ws/openmeetings-web/pom.xml> to /home/jenkins/jenkins-slave/maven-repositories/0/org/apache/openmeetings/openmeetings-web/4.0.5-SNAPSHOT/openmeetings-web-4.0.5-SNAPSHOT.pom
[INFO]                                                                         
[INFO] ------------------------------------------------------------------------
[INFO] Building Openmeetings Flash 4.0.5-SNAPSHOT
[INFO] ------------------------------------------------------------------------
[INFO] 
[INFO] --- maven-clean-plugin:3.1.0:clean (default-clean) @ openmeetings-flash ---
[INFO] Deleting <https://builds.apache.org/job/OpenMeetings%204.0.x/ws/openmeetings-flash/target>
[INFO] 
[INFO] --- maven-enforcer-plugin:1.4.1:enforce (enforce-maven-version) @ openmeetings-flash ---
[INFO] 
[INFO] --- buildnumber-maven-plugin:1.4:create (default) @ openmeetings-flash ---
[INFO] 
[INFO] --- apache-rat-plugin:0.12:check (default) @ openmeetings-flash ---
[INFO] Added 1 additional default licenses.
[INFO] Enabled default license matchers.
[INFO] Added 1 custom approved licenses.
[INFO] Will parse SCM ignores for exclusions...
[INFO] Finished adding exclusions from SCM ignore files.
[INFO] 61 implicit excludes (use -debug for more details).
[INFO] Exclude: **/*.mp3
[INFO] 22 resources included (use -debug for more details)
[INFO] Rat check: Summary over all files. Unapproved: 0, unknown: 0, generated: 0, approved: 14 licenses.
[INFO] 
[INFO] --- jacoco-maven-plugin:0.8.1:prepare-agent (prepare-agent) @ openmeetings-flash ---
[INFO] argLine set to "-javaagent:/home/jenkins/jenkins-slave/maven-repositories/0/org/jacoco/org.jacoco.agent/0.8.1/org.jacoco.agent-0.8.1-runtime.jar=destfile=<https://builds.apache.org/job/OpenMeetings%204.0.x/ws/openmeetings-flash/../target/jacoco.exec,append=true">
[INFO] 
[INFO] --- flexmojos-maven-plugin:7.1.1:compile-swf (main-compile) @ openmeetings-flash ---
[INFO] Flexmojos 7.1.1
[INFO] 	 GPL License - Version 2.0 (NO WARRANTY) - See COPYRIGHT file
[WARNING] No themes are explicitly defined in the <theme> section or in any scope="theme" dependencies. Flexmojos is now attempting to figure out which themes to include. (to avoid this warning you should explicitly state your theme dependencies)
[WARNING] Adding spark theme because spark.swc was included as a dependency
[INFO] ------------------------------------------------------------------------
[INFO] Reactor Summary:
[INFO] 
[INFO] Openmeetings ....................................... SUCCESS [02:03 min]
[INFO] Openmeetings Util .................................. SUCCESS [04:45 min]
[INFO] Openmeetings DB .................................... SUCCESS [ 37.816 s]
[INFO] Openmeetings Core .................................. SUCCESS [ 45.918 s]
[INFO] Openmeetings Install ............................... SUCCESS [ 31.890 s]
[INFO] Openmeetings Service ............................... SUCCESS [ 30.896 s]
[INFO] Openmeetings Webservices ........................... SUCCESS [01:10 min]
[INFO] Openmeetings Web ................................... SUCCESS [22:43 min]
[INFO] Openmeetings Flash ................................. FAILURE [  2.996 s]
[INFO] Openmeetings Screen Sharing applet ................. SKIPPED
[INFO] Openmeetings Server ................................ SKIPPED
[INFO] ------------------------------------------------------------------------
[INFO] BUILD FAILURE
[INFO] ------------------------------------------------------------------------
[INFO] Total time: 34:02 min
[INFO] Finished at: 2018-07-30T06:46:44+00:00
[INFO] Final Memory: 141M/1351M
[INFO] ------------------------------------------------------------------------
[ERROR] Failed to execute goal net.flexmojos.oss:flexmojos-maven-plugin:7.1.1:compile-swf (main-compile) on project openmeetings-flash: java.lang.reflect.InvocationTargetException: Unable to retrieve flex default namespaces! /home/jenkins/jenkins-slave/maven-repositories/0/org/apache/flex/framework/framework/4.16.0/configs_zip/flex-config.xml (No such file or directory) -> [Help 1]
[ERROR] 
[ERROR] To see the full stack trace of the errors, re-run Maven with the -e switch.
[ERROR] Re-run Maven using the -X switch to enable full debug logging.
[ERROR] 
[ERROR] For more information about the errors and possible solutions, please read the following articles:
[ERROR] [Help 1] http://cwiki.apache.org/confluence/display/MAVEN/MojoExecutionException
[ERROR] 
[ERROR] After correcting the problems, you can resume the build with the command
[ERROR]   mvn <goals> -rf :openmeetings-flash
[JENKINS] Archiving <https://builds.apache.org/job/OpenMeetings%204.0.x/ws/openmeetings-server/pom.xml> to org.apache.openmeetings/openmeetings-server/4.0.5-SNAPSHOT/openmeetings-server-4.0.5-SNAPSHOT.pom
[JENKINS] Archiving <https://builds.apache.org/job/OpenMeetings%204.0.x/ws/openmeetings-screenshare/pom.xml> to org.apache.openmeetings/openmeetings-screenshare/4.0.5-SNAPSHOT/openmeetings-screenshare-4.0.5-SNAPSHOT.pom
[JENKINS] Archiving <https://builds.apache.org/job/OpenMeetings%204.0.x/ws/openmeetings-util/pom.xml> to org.apache.openmeetings/openmeetings-util/4.0.5-SNAPSHOT/openmeetings-util-4.0.5-SNAPSHOT.pom
[JENKINS] Archiving <https://builds.apache.org/job/OpenMeetings%204.0.x/ws/openmeetings-util/target/openmeetings-util-4.0.5-SNAPSHOT.jar> to org.apache.openmeetings/openmeetings-util/4.0.5-SNAPSHOT/openmeetings-util-4.0.5-SNAPSHOT.jar
[JENKINS] Archiving <https://builds.apache.org/job/OpenMeetings%204.0.x/ws/openmeetings-util/target/openmeetings-util-4.0.5-SNAPSHOT-tests.jar> to org.apache.openmeetings/openmeetings-util/4.0.5-SNAPSHOT/openmeetings-util-4.0.5-SNAPSHOT-tests.jar
[JENKINS] Archiving <https://builds.apache.org/job/OpenMeetings%204.0.x/ws/openmeetings-install/pom.xml> to org.apache.openmeetings/openmeetings-install/4.0.5-SNAPSHOT/openmeetings-install-4.0.5-SNAPSHOT.pom
[JENKINS] Archiving <https://builds.apache.org/job/OpenMeetings%204.0.x/ws/openmeetings-install/target/openmeetings-install-4.0.5-SNAPSHOT.jar> to org.apache.openmeetings/openmeetings-install/4.0.5-SNAPSHOT/openmeetings-install-4.0.5-SNAPSHOT.jar
[JENKINS] Archiving <https://builds.apache.org/job/OpenMeetings%204.0.x/ws/openmeetings-service/pom.xml> to org.apache.openmeetings/openmeetings-service/4.0.5-SNAPSHOT/openmeetings-service-4.0.5-SNAPSHOT.pom
[JENKINS] Archiving <https://builds.apache.org/job/OpenMeetings%204.0.x/ws/openmeetings-service/target/openmeetings-service-4.0.5-SNAPSHOT.jar> to org.apache.openmeetings/openmeetings-service/4.0.5-SNAPSHOT/openmeetings-service-4.0.5-SNAPSHOT.jar
[JENKINS] Archiving <https://builds.apache.org/job/OpenMeetings%204.0.x/ws/pom.xml> to org.apache.openmeetings/openmeetings-parent/4.0.5-SNAPSHOT/openmeetings-parent-4.0.5-SNAPSHOT.pom
[JENKINS] Archiving <https://builds.apache.org/job/OpenMeetings%204.0.x/ws/target/openmeetings-parent-4.0.5-SNAPSHOT-site.xml> to org.apache.openmeetings/openmeetings-parent/4.0.5-SNAPSHOT/openmeetings-parent-4.0.5-SNAPSHOT-site.xml
[JENKINS] Archiving <https://builds.apache.org/job/OpenMeetings%204.0.x/ws/openmeetings-db/pom.xml> to org.apache.openmeetings/openmeetings-db/4.0.5-SNAPSHOT/openmeetings-db-4.0.5-SNAPSHOT.pom
[JENKINS] Archiving <https://builds.apache.org/job/OpenMeetings%204.0.x/ws/openmeetings-db/target/openmeetings-db-4.0.5-SNAPSHOT.jar> to org.apache.openmeetings/openmeetings-db/4.0.5-SNAPSHOT/openmeetings-db-4.0.5-SNAPSHOT.jar
[JENKINS] Archiving <https://builds.apache.org/job/OpenMeetings%204.0.x/ws/openmeetings-web/pom.xml> to org.apache.openmeetings/openmeetings-web/4.0.5-SNAPSHOT/openmeetings-web-4.0.5-SNAPSHOT.pom
[JENKINS] Archiving <https://builds.apache.org/job/OpenMeetings%204.0.x/ws/openmeetings-web/target/openmeetings-web-4.0.5-SNAPSHOT.war> to org.apache.openmeetings/openmeetings-web/4.0.5-SNAPSHOT/openmeetings-web-4.0.5-SNAPSHOT.war
[Fast Archiver] Compressed 113.36 MB of artifacts by 93.0% relative to #375
[JENKINS] Archiving <https://builds.apache.org/job/OpenMeetings%204.0.x/ws/openmeetings-webservice/pom.xml> to org.apache.openmeetings/openmeetings-webservice/4.0.5-SNAPSHOT/openmeetings-webservice-4.0.5-SNAPSHOT.pom
[JENKINS] Archiving <https://builds.apache.org/job/OpenMeetings%204.0.x/ws/openmeetings-webservice/target/openmeetings-webservice-4.0.5-SNAPSHOT.jar> to org.apache.openmeetings/openmeetings-webservice/4.0.5-SNAPSHOT/openmeetings-webservice-4.0.5-SNAPSHOT.jar
[JENKINS] Archiving <https://builds.apache.org/job/OpenMeetings%204.0.x/ws/openmeetings-core/pom.xml> to org.apache.openmeetings/openmeetings-core/4.0.5-SNAPSHOT/openmeetings-core-4.0.5-SNAPSHOT.pom
[JENKINS] Archiving <https://builds.apache.org/job/OpenMeetings%204.0.x/ws/openmeetings-core/target/openmeetings-core-4.0.5-SNAPSHOT.jar> to org.apache.openmeetings/openmeetings-core/4.0.5-SNAPSHOT/openmeetings-core-4.0.5-SNAPSHOT.jar
[JENKINS] Archiving <https://builds.apache.org/job/OpenMeetings%204.0.x/ws/openmeetings-core/target/openmeetings-core-4.0.5-SNAPSHOT-tests.jar> to org.apache.openmeetings/openmeetings-core/4.0.5-SNAPSHOT/openmeetings-core-4.0.5-SNAPSHOT-tests.jar
[JENKINS] Archiving <https://builds.apache.org/job/OpenMeetings%204.0.x/ws/openmeetings-flash/pom.xml> to org.apache.openmeetings/openmeetings-flash/4.0.5-SNAPSHOT/openmeetings-flash-4.0.5-SNAPSHOT.pom
Sending e-mails to: dev@openmeetings.apache.org
channel stopped
Archiving artifacts
[Fast Archiver] Compressed 299.23 MB of artifacts by 38.5% relative to #375
Not sending mail to unregistered user solomax666@gmail.com