You are viewing a plain text version of this content. The canonical link for it is here.
Posted to commits@taverna.apache.org by Apache Jenkins Server <je...@builds.apache.org> on 2015/09/21 19:46:40 UTC

Build failed in Jenkins: incubator-taverna-common-activities #75

See <https://builds.apache.org/job/incubator-taverna-common-activities/75/changes>

Changes:

[redmitry] 2-incubating-SNAPSHOT

------------------------------------------
Started by an SCM change
[EnvInject] - Loading node environment variables.
Building remotely on H2 (Mapreduce zookeeper Hadoop Pig falcon Hdfs) in workspace <https://builds.apache.org/job/incubator-taverna-common-activities/ws/>
 > git rev-parse --is-inside-work-tree # timeout=10
Fetching changes from the remote Git repository
 > git config remote.origin.url https://git-wip-us.apache.org/repos/asf/incubator-taverna-common-activities.git # timeout=10
Fetching upstream changes from https://git-wip-us.apache.org/repos/asf/incubator-taverna-common-activities.git
 > git --version # timeout=10
 > git fetch --tags --progress https://git-wip-us.apache.org/repos/asf/incubator-taverna-common-activities.git +refs/heads/*:refs/remotes/origin/*
 > git rev-parse refs/remotes/origin/master^{commit} # timeout=10
 > git rev-parse refs/remotes/origin/origin/master^{commit} # timeout=10
Checking out Revision e4e20d7897b5da678ca7d2d636af85e0b452b4c6 (refs/remotes/origin/master)
 > git config core.sparsecheckout # timeout=10
 > git checkout -f e4e20d7897b5da678ca7d2d636af85e0b452b4c6
 > git rev-list 65284f6f79ae83997f84beb4aef6d4b0c69dc0ec # timeout=10
Parsing POMs
Downloaded artifact http://repository.apache.org/snapshots/org/apache/taverna/taverna-parent/2-incubating-SNAPSHOT/maven-metadata.xml
Downloaded artifact http://repository.apache.org/snapshots/org/apache/taverna/taverna-parent/2-incubating-SNAPSHOT/taverna-parent-2-incubating-20150920.221320-38.pom
Modules changed, recalculating dependency graph
maven31-agent.jar already up to date
maven31-interceptor.jar already up to date
maven3-interceptor-commons.jar already up to date
[incubator-taverna-common-activities] $ /home/jenkins/tools/java/latest1.7/bin/java -Xmx2g -Xms256m -XX:MaxPermSize=512m -cp /home/jenkins/jenkins-slave/maven31-agent.jar:/home/jenkins/jenkins-slave/tools/hudson.tasks.Maven_MavenInstallation/maven-3.2.1/boot/plexus-classworlds-2.5.1.jar:/home/jenkins/jenkins-slave/tools/hudson.tasks.Maven_MavenInstallation/maven-3.2.1/conf/logging jenkins.maven3.agent.Maven31Main /home/jenkins/jenkins-slave/tools/hudson.tasks.Maven_MavenInstallation/maven-3.2.1 /home/jenkins/jenkins-slave/slave.jar /home/jenkins/jenkins-slave/maven31-interceptor.jar /home/jenkins/jenkins-slave/maven3-interceptor-commons.jar 53203
<===[JENKINS REMOTING CAPACITY]===>   channel started
Executing Maven:  -B -f <https://builds.apache.org/job/incubator-taverna-common-activities/ws/pom.xml> -Dmaven.repo.local=<https://builds.apache.org/job/incubator-taverna-common-activities/ws/.repository> clean install -U -Drat.skip=true
[INFO] Scanning for projects...
[INFO] Downloading: http://repository.apache.org/snapshots/org/apache/taverna/taverna-parent/2-incubating-SNAPSHOT/maven-metadata.xml
[INFO] Downloaded: http://repository.apache.org/snapshots/org/apache/taverna/taverna-parent/2-incubating-SNAPSHOT/maven-metadata.xml (845 B at 4.6 KB/sec)
[INFO] ------------------------------------------------------------------------
[INFO] Reactor Build Order:
[INFO] 
[INFO] Apache Taverna Common Activities
[INFO] Apache Taverna Beanshell Activity
[INFO] Apache Taverna External Tool Activity
[INFO] Apache Taverna Interaction Activity
[INFO] Apache Taverna REST Activity
[INFO] Apache Taverna Spreadsheet Import Activity
[INFO] Apache Taverna WSDL-generic Library
[INFO] Apache Taverna WSDL Activity
[INFO] Apache Taverna XPath Activity
[INFO] 
[INFO] Using the builder org.apache.maven.lifecycle.internal.builder.singlethreaded.SingleThreadedBuilder with a thread count of 1
[INFO]                                                                         
[INFO] ------------------------------------------------------------------------
[INFO] Building Apache Taverna Common Activities 2.1.0-incubating-SNAPSHOT
[INFO] ------------------------------------------------------------------------
[INFO] 
[INFO] --- maven-clean-plugin:2.5:clean (default-clean) @ taverna-common-activities ---
[INFO] Deleting <https://builds.apache.org/job/incubator-taverna-common-activities/ws/target>
[INFO] 
[INFO] --- maven-remote-resources-plugin:1.5:process (default) @ taverna-common-activities ---
[INFO] 
[INFO] >>> maven-source-plugin:2.4:jar (default) @ taverna-common-activities >>>
[WARNING] Failed to getClass for org.apache.maven.plugin.source.SourceJarMojo
[INFO] 
[INFO] <<< maven-source-plugin:2.4:jar (default) @ taverna-common-activities <<<
[INFO] 
[INFO] --- maven-source-plugin:2.4:jar (default) @ taverna-common-activities ---
[INFO] 
[INFO] >>> maven-source-plugin:2.4:test-jar (default) @ taverna-common-activities >>>
[WARNING] Failed to getClass for org.apache.maven.plugin.source.TestSourceJarMojo
[INFO] 
[INFO] <<< maven-source-plugin:2.4:test-jar (default) @ taverna-common-activities <<<
[INFO] 
[INFO] --- maven-source-plugin:2.4:test-jar (default) @ taverna-common-activities ---
[INFO] 
[INFO] --- maven-jar-plugin:2.5:test-jar (default) @ taverna-common-activities ---
[WARNING] JAR will be empty - no content was marked for inclusion!
[INFO] Building jar: <https://builds.apache.org/job/incubator-taverna-common-activities/ws/target/taverna-common-activities-2.1.0-incubating-SNAPSHOT-tests.jar>
[INFO] 
[INFO] --- maven-site-plugin:3.4:attach-descriptor (attach-descriptor) @ taverna-common-activities ---
[INFO] 
[INFO] --- maven-install-plugin:2.5.2:install (default-install) @ taverna-common-activities ---
[INFO] Installing <https://builds.apache.org/job/incubator-taverna-common-activities/ws/pom.xml> to <https://builds.apache.org/job/incubator-taverna-common-activities/ws/.repository/org/apache/taverna/commonactivities/taverna-common-activities/2.1.0-incubating-SNAPSHOT/taverna-common-activities-2.1.0-incubating-SNAPSHOT.pom>
[INFO] Installing <https://builds.apache.org/job/incubator-taverna-common-activities/ws/target/taverna-common-activities-2.1.0-incubating-SNAPSHOT-tests.jar> to <https://builds.apache.org/job/incubator-taverna-common-activities/ws/.repository/org/apache/taverna/commonactivities/taverna-common-activities/2.1.0-incubating-SNAPSHOT/taverna-common-activities-2.1.0-incubating-SNAPSHOT-tests.jar>
[INFO]                                                                         
[INFO] ------------------------------------------------------------------------
[INFO] Building Apache Taverna Beanshell Activity 2.1.0-incubating-SNAPSHOT
[INFO] ------------------------------------------------------------------------
[INFO] Downloading: http://repository.apache.org/snapshots/org/apache/taverna/engine/taverna-reference-api/3.1.0-incubating-SNAPSHOT/maven-metadata.xml
[INFO] Downloaded: http://repository.apache.org/snapshots/org/apache/taverna/engine/taverna-reference-api/3.1.0-incubating-SNAPSHOT/maven-metadata.xml (2 KB at 1.9 KB/sec)
[INFO] Downloading: http://repository.apache.org/snapshots/org/apache/taverna/engine/taverna-engine/3.1.0-incubating-SNAPSHOT/maven-metadata.xml
[INFO] Downloaded: http://repository.apache.org/snapshots/org/apache/taverna/engine/taverna-engine/3.1.0-incubating-SNAPSHOT/maven-metadata.xml (864 B at 1.1 KB/sec)
[INFO] Downloading: http://repository.apache.org/snapshots/org/apache/taverna/taverna-parent/1-incubating-SNAPSHOT/maven-metadata.xml
[INFO] Downloading: http://repository.apache.org/snapshots/org/apache/taverna/taverna-parent/1-incubating-SNAPSHOT/taverna-parent-1-incubating-SNAPSHOT.pom
[INFO] Downloading: http://repository.apache.org/snapshots/org/apache/taverna/engine/taverna-workflowmodel-api/3.1.0-incubating-SNAPSHOT/maven-metadata.xml
[INFO] Downloaded: http://repository.apache.org/snapshots/org/apache/taverna/engine/taverna-workflowmodel-api/3.1.0-incubating-SNAPSHOT/maven-metadata.xml (2 KB at 2.6 KB/sec)
[INFO] Downloading: http://repository.apache.org/snapshots/org/apache/taverna/osgi/taverna-app-configuration-api/0.2.0-incubating-SNAPSHOT/maven-metadata.xml
[INFO] Downloaded: http://repository.apache.org/snapshots/org/apache/taverna/osgi/taverna-app-configuration-api/0.2.0-incubating-SNAPSHOT/maven-metadata.xml (2 KB at 2.5 KB/sec)
[INFO] Downloading: http://repository.apache.org/snapshots/org/apache/taverna/osgi/taverna-app-configuration-api/0.2.0-incubating-SNAPSHOT/taverna-app-configuration-api-0.2.0-incubating-20150920.221625-110.pom
[INFO] Downloaded: http://repository.apache.org/snapshots/org/apache/taverna/osgi/taverna-app-configuration-api/0.2.0-incubating-SNAPSHOT/taverna-app-configuration-api-0.2.0-incubating-20150920.221625-110.pom (753 B at 1.4 KB/sec)
[INFO] Downloading: http://repository.apache.org/snapshots/org/apache/taverna/osgi/taverna-osgi/0.2.0-incubating-SNAPSHOT/maven-metadata.xml
[INFO] Downloaded: http://repository.apache.org/snapshots/org/apache/taverna/osgi/taverna-osgi/0.2.0-incubating-SNAPSHOT/maven-metadata.xml (863 B at 0.7 KB/sec)
[INFO] Downloading: http://repository.apache.org/snapshots/org/apache/taverna/osgi/taverna-osgi/0.2.0-incubating-SNAPSHOT/taverna-osgi-0.2.0-incubating-20150920.221637-110.pom
[INFO] Downloaded: http://repository.apache.org/snapshots/org/apache/taverna/osgi/taverna-osgi/0.2.0-incubating-SNAPSHOT/taverna-osgi-0.2.0-incubating-20150920.221637-110.pom (2 KB at 11.1 KB/sec)
[INFO] Downloading: http://repository.apache.org/snapshots/org/apache/taverna/osgi/taverna-osgi-schemas/0.2.0-incubating-SNAPSHOT/maven-metadata.xml
[INFO] Downloaded: http://repository.apache.org/snapshots/org/apache/taverna/osgi/taverna-osgi-schemas/0.2.0-incubating-SNAPSHOT/maven-metadata.xml (2 KB at 2.3 KB/sec)
[INFO] Downloading: http://repository.apache.org/snapshots/org/apache/taverna/osgi/taverna-osgi-schemas/0.2.0-incubating-SNAPSHOT/taverna-osgi-schemas-0.2.0-incubating-20150920.221638-110.pom
[INFO] Downloaded: http://repository.apache.org/snapshots/org/apache/taverna/osgi/taverna-osgi-schemas/0.2.0-incubating-SNAPSHOT/taverna-osgi-schemas-0.2.0-incubating-20150920.221638-110.pom (821 B at 6.2 KB/sec)
[INFO] Downloading: http://repository.apache.org/snapshots/org/apache/taverna/engine/taverna-activity-test-utils/3.1.0-incubating-SNAPSHOT/maven-metadata.xml
[INFO] Downloaded: http://repository.apache.org/snapshots/org/apache/taverna/engine/taverna-activity-test-utils/3.1.0-incubating-SNAPSHOT/maven-metadata.xml (2 KB at 2.4 KB/sec)
[INFO] Downloading: http://repository.apache.org/snapshots/org/apache/taverna/engine/taverna-workflowmodel-impl/3.1.0-incubating-SNAPSHOT/maven-metadata.xml
[INFO] Downloaded: http://repository.apache.org/snapshots/org/apache/taverna/engine/taverna-workflowmodel-impl/3.1.0-incubating-SNAPSHOT/maven-metadata.xml (2 KB at 4.1 KB/sec)
[INFO] ------------------------------------------------------------------------
[INFO] Reactor Summary:
[INFO] 
[INFO] Apache Taverna Common Activities .................. SUCCESS [  7.472 s]
[INFO] Apache Taverna Beanshell Activity ................. FAILURE [  6.691 s]
[INFO] Apache Taverna External Tool Activity ............. SKIPPED
[INFO] Apache Taverna Interaction Activity ............... SKIPPED
[INFO] Apache Taverna REST Activity ...................... SKIPPED
[INFO] Apache Taverna Spreadsheet Import Activity ........ SKIPPED
[INFO] Apache Taverna WSDL-generic Library ............... SKIPPED
[INFO] Apache Taverna WSDL Activity ...................... SKIPPED
[INFO] Apache Taverna XPath Activity ..................... SKIPPED
[INFO] ------------------------------------------------------------------------
[INFO] BUILD FAILURE
[INFO] ------------------------------------------------------------------------
[INFO] Total time: 19.985 s
[INFO] Finished at: 2015-09-21T17:46:54+00:00
[INFO] Final Memory: 21M/252M
[INFO] ------------------------------------------------------------------------
[ERROR] Failed to execute goal on project taverna-beanshell-activity: Could not resolve dependencies for project org.apache.taverna.commonactivities:taverna-beanshell-activity:bundle:2.1.0-incubating-SNAPSHOT: Failed to collect dependencies at org.apache.taverna.engine:taverna-reference-api:jar:3.1.0-incubating-SNAPSHOT: Failed to read artifact descriptor for org.apache.taverna.engine:taverna-reference-api:jar:3.1.0-incubating-SNAPSHOT: Could not find artifact org.apache.taverna:taverna-parent:pom:1-incubating-SNAPSHOT in Nexus (http://repository.apache.org/snapshots) -> [Help 1]
[ERROR] 
[ERROR] To see the full stack trace of the errors, re-run Maven with the -e switch.
[ERROR] Re-run Maven using the -X switch to enable full debug logging.
[ERROR] 
[ERROR] For more information about the errors and possible solutions, please read the following articles:
[ERROR] [Help 1] http://cwiki.apache.org/confluence/display/MAVEN/DependencyResolutionException
[ERROR] 
[ERROR] After correcting the problems, you can resume the build with the command
[ERROR]   mvn <goals> -rf :taverna-beanshell-activity
[JENKINS] Archiving <https://builds.apache.org/job/incubator-taverna-common-activities/ws/taverna-wsdl-activity/pom.xml> to org.apache.taverna.commonactivities/taverna-wsdl-activity/2.1.0-incubating-SNAPSHOT/taverna-wsdl-activity-2.1.0-incubating-SNAPSHOT.pom
Sending artifact delta relative to incubator-taverna-common-activities » Apache Taverna WSDL Activity #15
Archived 1 artifacts
Archive block size is 32768
Received 0 blocks and 3979 bytes
Compression is 0.0%
Took 72 ms
[JENKINS] Archiving <https://builds.apache.org/job/incubator-taverna-common-activities/ws/taverna-wsdl-generic/pom.xml> to org.apache.taverna.commonactivities/taverna-wsdl-generic/2.1.0-incubating-SNAPSHOT/taverna-wsdl-generic-2.1.0-incubating-SNAPSHOT.pom
Sending artifact delta relative to incubator-taverna-common-activities » Apache Taverna WSDL-generic Library #15
Archived 1 artifacts
Archive block size is 32768
Received 0 blocks and 3249 bytes
Compression is 0.0%
Took 69 ms
[JENKINS] Archiving <https://builds.apache.org/job/incubator-taverna-common-activities/ws/taverna-rest-activity/pom.xml> to org.apache.taverna.commonactivities/taverna-rest-activity/2.1.0-incubating-SNAPSHOT/taverna-rest-activity-2.1.0-incubating-SNAPSHOT.pom
Sending artifact delta relative to incubator-taverna-common-activities » Apache Taverna REST Activity #72
Archived 1 artifacts
Archive block size is 32768
Received 0 blocks and 3679 bytes
Compression is 0.0%
Took 51 ms
[JENKINS] Archiving <https://builds.apache.org/job/incubator-taverna-common-activities/ws/taverna-spreadsheet-import-activity/pom.xml> to org.apache.taverna.commonactivities/taverna-spreadsheet-import-activity/2.1.0-incubating-SNAPSHOT/taverna-spreadsheet-import-activity-2.1.0-incubating-SNAPSHOT.pom
Sending artifact delta relative to incubator-taverna-common-activities » Apache Taverna Spreadsheet Import Activity #72
Archived 1 artifacts
Archive block size is 32768
Received 0 blocks and 4440 bytes
Compression is 0.0%
Took 0.23 sec
[JENKINS] Archiving <https://builds.apache.org/job/incubator-taverna-common-activities/ws/pom.xml> to org.apache.taverna.commonactivities/taverna-common-activities/2.1.0-incubating-SNAPSHOT/taverna-common-activities-2.1.0-incubating-SNAPSHOT.pom
[JENKINS] Archiving <https://builds.apache.org/job/incubator-taverna-common-activities/ws/target/taverna-common-activities-2.1.0-incubating-SNAPSHOT-tests.jar> to org.apache.taverna.commonactivities/taverna-common-activities/2.1.0-incubating-SNAPSHOT/taverna-common-activities-2.1.0-incubating-SNAPSHOT-tests.jar
Sending artifact delta relative to incubator-taverna-common-activities » Apache Taverna Common Activities #73
Archived 2 artifacts
Archive block size is 32768
Received 0 blocks and 4537 bytes
Compression is 0.0%
Took 39 ms
[JENKINS] Archiving <https://builds.apache.org/job/incubator-taverna-common-activities/ws/taverna-interaction-activity/pom.xml> to org.apache.taverna.commonactivities/taverna-interaction-activity/2.1.0-incubating-SNAPSHOT/taverna-interaction-activity-2.1.0-incubating-SNAPSHOT.pom
Sending artifact delta relative to incubator-taverna-common-activities » Apache Taverna Interaction Activity #72
Archived 1 artifacts
Archive block size is 32768
Received 0 blocks and 4544 bytes
Compression is 0.0%
Took 71 ms
[JENKINS] Archiving <https://builds.apache.org/job/incubator-taverna-common-activities/ws/taverna-beanshell-activity/pom.xml> to org.apache.taverna.commonactivities/taverna-beanshell-activity/2.1.0-incubating-SNAPSHOT/taverna-beanshell-activity-2.1.0-incubating-SNAPSHOT.pom
Sending artifact delta relative to incubator-taverna-common-activities » Apache Taverna Beanshell Activity #72
Archived 1 artifacts
Archive block size is 32768
Received 0 blocks and 2620 bytes
Compression is 0.0%
Took 44 ms
[JENKINS] Archiving <https://builds.apache.org/job/incubator-taverna-common-activities/ws/taverna-xpath-activity/pom.xml> to org.apache.taverna.commonactivities/taverna-xpath-activity/2.1.0-incubating-SNAPSHOT/taverna-xpath-activity-2.1.0-incubating-SNAPSHOT.pom
Sending artifact delta relative to incubator-taverna-common-activities » Apache Taverna XPath Activity #15
Archived 1 artifacts
Archive block size is 32768
Received 0 blocks and 1785 bytes
Compression is 0.0%
Took 91 ms
[JENKINS] Archiving <https://builds.apache.org/job/incubator-taverna-common-activities/ws/taverna-external-tool-activity/pom.xml> to org.apache.taverna.commonactivities/taverna-external-tool-activity/2.1.0-incubating-SNAPSHOT/taverna-external-tool-activity-2.1.0-incubating-SNAPSHOT.pom
Sending artifact delta relative to incubator-taverna-common-activities » Apache Taverna External Tool Activity #72
Archived 1 artifacts
Archive block size is 32768
Received 0 blocks and 3447 bytes
Compression is 0.0%
Took 51 ms
channel stopped

Jenkins build is back to normal : incubator-taverna-common-activities #77

Posted by Apache Jenkins Server <je...@builds.apache.org>.
See <https://builds.apache.org/job/incubator-taverna-common-activities/77/>