You are viewing a plain text version of this content. The canonical link for it is here.
Posted to notifications@maven.apache.org by Hudson <Hu...@sonatype.org> on 2009/05/29 01:19:10 UTC
Build failed in Hudson: maven-assembly-plugin-2.2-beta-4-ITs » 1.5,windows #18
See http://grid.sonatype.org/ci/job/maven-assembly-plugin-2.2-beta-4-ITs/./jdk=1.5,label=windows/18/changes
Changes:
[John Casey] [maven-release-plugin] prepare for next development iteration
[John Casey] [maven-release-plugin] prepare release maven-assembly-plugin-2.2-beta-4
[John Casey] [MASSEMBLY-416] Fixing standard descriptors, along with processing of project paths during the descriptor interpolation process to ensure that ${project.basedir}/src doesn't interpolate to /src.
------------------------------------------
[...truncated 386 lines...]
[INFO] 2K downloaded (maven-model-2.0.6.pom)
[INFO] Downloading: http://repository.sonatype.org:8081/content/groups/sonatype-grid/org/codehaus/plexus/plexus-container-default/1.0-alpha-9-stable-1/plexus-container-default-1.0-alpha-9-stable-1.pom
[INFO] 3K downloaded (plexus-container-default-1.0-alpha-9-stable-1.pom)
[INFO] Downloading: http://repository.sonatype.org:8081/content/groups/sonatype-grid/org/apache/maven/maven-profile/2.0.6/maven-profile-2.0.6.pom
[INFO] 1K downloaded (maven-profile-2.0.6.pom)
[INFO] Downloading: http://repository.sonatype.org:8081/content/groups/sonatype-grid/org/apache/maven/maven-artifact-manager/2.0.6/maven-artifact-manager-2.0.6.pom
[INFO] 2K downloaded (maven-artifact-manager-2.0.6.pom)
[INFO] Downloading: http://repository.sonatype.org:8081/content/groups/sonatype-grid/org/apache/maven/maven-repository-metadata/2.0.6/maven-repository-metadata-2.0.6.pom
[INFO] 1K downloaded (maven-repository-metadata-2.0.6.pom)
[INFO] Downloading: http://repository.sonatype.org:8081/content/groups/sonatype-grid/org/apache/maven/maven-artifact/2.0.6/maven-artifact-2.0.6.pom
[INFO] 1K downloaded (maven-artifact-2.0.6.pom)
[INFO] Downloading: http://repository.sonatype.org:8081/content/groups/sonatype-grid/org/apache/maven/maven-plugin-registry/2.0.6/maven-plugin-registry-2.0.6.pom
[INFO] 1K downloaded (maven-plugin-registry-2.0.6.pom)
[INFO] Downloading: http://repository.sonatype.org:8081/content/groups/sonatype-grid/org/codehaus/plexus/plexus-digest/1.0/plexus-digest-1.0.pom
[INFO] 1K downloaded (plexus-digest-1.0.pom)
[INFO] Downloading: http://repository.sonatype.org:8081/content/groups/sonatype-grid/org/codehaus/plexus/plexus-components/1.1.7/plexus-components-1.1.7.pom
[INFO] 4K downloaded (plexus-components-1.1.7.pom)
[INFO] Downloading: http://repository.sonatype.org:8081/content/groups/sonatype-grid/org/codehaus/plexus/plexus-utils/1.1/plexus-utils-1.1.jar
[INFO] 164K downloaded (plexus-utils-1.1.jar)
[INFO] Downloading: http://repository.sonatype.org:8081/content/groups/sonatype-grid/org/codehaus/plexus/plexus-digest/1.0/plexus-digest-1.0.jar
[INFO] 11K downloaded (plexus-digest-1.0.jar)
[INFO] [INFO] [install:install]
[INFO] [INFO] Installing C:\tmp\assembly-ITs\it-project-parent\target\pom-transformed.xml to C:\home\hudson\workspace\maven-assembly-plugin-2.2-beta-4-ITs\jdk\1.5\label\windows\maven-assembly-plugin-2.2-beta-4\target\local-repository\org\apache\maven\plugin\assembly\test\it-project-parent\1\it-project-parent-1.pom
[INFO] [INFO] ------------------------------------------------------------------------
[INFO] [INFO] BUILD SUCCESSFUL
[INFO] [INFO] ------------------------------------------------------------------------
[INFO] [INFO] Total time: 5 seconds
[INFO] [INFO] Finished at: Thu May 28 16:08:33 PDT 2009
[INFO] [INFO] Final Memory: 8M/16M
[INFO] [INFO] ------------------------------------------------------------------------
[INFO] [invoker:run {execution: integration-test}]
[INFO] Building: basic-features\descriptorDirectoryScan\pom.xml
[INFO] ...SUCCESS.
[INFO] Building: basic-features\ExecutionRoot\pom.xml
[INFO] ...SUCCESS.
[INFO] Building: basic-features\file-copyIntoTopDir\pom.xml
[INFO] ...SUCCESS.
[INFO] Building: basic-features\file-sameName\pom.xml
[INFO] ...SUCCESS.
[INFO] Building: basic-features\massembly-256-pomPropertiesInterp\pom.xml
[INFO] ...SUCCESS.
[INFO] Building: basic-features\massembly-351-projectPrefixInterp\pom.xml
[INFO] ...SUCCESS.
[INFO] Building: basic-features\outputFileNameMapping-simple\pom.xml
[INFO] ...SUCCESS.
[INFO] Building: basic-features\outputFileNameMapping-withArtifactBaseVersion\pom.xml
[INFO] ...SUCCESS.
[INFO] Building: basic-features\relative-project-paths\pom.xml
[INFO] ...SUCCESS.
[INFO] Building: bugs\massembly-190\pom.xml
[INFO] ...SUCCESS.
[INFO] Building: bugs\massembly-285\pom.xml
[INFO] ...SUCCESS.
[INFO] Building: bugs\massembly-306\pom.xml
[INFO] ...SUCCESS.
[INFO] Building: bugs\massembly-375\pom.xml
[INFO] ...SUCCESS.
[INFO] Building: container-descriptors\configured-handler\pom.xml
[INFO] ...SUCCESS.
[INFO] Building: container-descriptors\custom-containerDescriptorHandler\pom.xml
[INFO] ...SUCCESS.
[INFO] Building: container-descriptors\custom-handler-withFileEntries\pom.xml
[INFO] ...SUCCESS.
[INFO] Building: container-descriptors\custom-handler-withMixedEntries\pom.xml
[INFO] ...SUCCESS.
[INFO] Building: dependency-sets\dep-with-transitive-filter\pom.xml
[INFO] ...SUCCESS.
[INFO] Building: dependency-sets\dependencySet-matchScope\pom.xml
[INFO] ...SUCCESS.
[INFO] Building: dependency-sets\dependencySet-nonTransitive\pom.xml
[INFO] ...SUCCESS.
[INFO] Building: dependency-sets\dependencySet-notUnpacked\pom.xml
[INFO] ...SUCCESS.
[INFO] Building: dependency-sets\dependencySet-projectArtifactNotIncluded\pom.xml
[INFO] ...SUCCESS.
[INFO] Building: dependency-sets\dependencySet-unpacked\pom.xml
[INFO] ...SUCCESS.
[INFO] Building: dependency-sets\dependencySet-unpackedExcludingMetaInf\pom.xml
[INFO] ...SUCCESS.
[INFO] Building: dependency-sets\dependencySet-unpackedSubsetsTwice\pom.xml
[INFO] ...SUCCESS.
[INFO] Building: dependency-sets\dependencySet-withExecutedProject\pom.xml
[INFO] ...SUCCESS.
[INFO] Building: dependency-sets\include-project-artifact\pom.xml
[INFO] ...SUCCESS.
[INFO] Building: dependency-sets\include-project-attachments\pom.xml
[INFO] ...SUCCESS.
[INFO] Building: dependency-sets\include-provided\pom.xml
[INFO] ...SUCCESS.
[INFO] Building: dependency-sets\including-pom-dependency\pom.xml
[INFO] ...SUCCESS.
[INFO] Building: dependency-sets\including-sar-dependency\pom.xml
[INFO] ...SUCCESS.
[INFO] Building: dependency-sets\massembly-201\pom.xml
[INFO] ...SUCCESS.
[INFO] Building: dependency-sets\massembly-232\pom.xml
[INFO] ...SUCCESS.
[INFO] Building: dependency-sets\massembly-235\pom.xml
[INFO] ...SUCCESS.
[INFO] Building: dependency-sets\massembly-345\pom.xml
[INFO] ...SUCCESS.
[INFO] Building: dependency-sets\massembly-99\pom.xml
[INFO] ...SUCCESS.
[INFO] Building: dependency-sets\multiple-wildcard-includes\pom.xml
[INFO] ...SUCCESS.
[INFO] Building: dependency-sets\outputFileNameMappingWithUnpack\pom.xml
[INFO] ...SUCCESS.
[INFO] Building: dependency-sets\using-moduleSet-implied-depSet\pom.xml
[INFO] ...SUCCESS.
[INFO] Building: descriptor-refs\bin\jars-in-archive-root\pom.xml
[INFO] ...SUCCESS.
[INFO] Building: descriptor-refs\jar-with-dependencies\component-descriptors-merged\pom.xml
[INFO] ...SUCCESS.
[INFO] Building: descriptor-refs\jar-with-dependencies\deps-unpacked-to-root-dir\pom.xml
[INFO] ...SUCCESS.
[INFO] Building: descriptor-refs\jar-with-dependencies\no-target-dir\pom.xml
[INFO] ...SUCCESS.
[INFO] Building: descriptor-refs\project\multimodule-sources-copied\pom.xml
[INFO] ...SUCCESS.
[INFO] Building: descriptor-refs\project\no-target-dir\pom.xml
[INFO] ...SUCCESS.
[INFO] Building: descriptor-refs\project\no-target-dir-multimodule\pom.xml
[INFO] ...SUCCESS.
[INFO] Building: descriptor-refs\project\sources-copied\pom.xml
[INFO] ...SUCCESS.
[INFO] Building: descriptor-refs\src\no-target-dir\pom.xml
[INFO] ...SUCCESS.
[INFO] Building: descriptor-refs\src\src-dir-copied\pom.xml
[INFO] ...SUCCESS.
[INFO] Building: file-modes\file-set-fileMode\pom.xml
[INFO] ...SUCCESS.
[INFO] Building: file-modes\fileItem-fileMode\pom.xml
[INFO] ...SUCCESS.
[INFO] Building: file-sets\default-directory-unspecified\pom.xml
[INFO] ...SUCCESS.
[INFO] Building: file-sets\default-excludes-unspecified\pom.xml
[INFO] ...SUCCESS.
[INFO] Building: file-sets\dont-use-default-excludes\pom.xml
[INFO] ...SUCCESS.
[INFO] Building: file-sets\excludes-using-regex\pom.xml
[INFO] ...FAILED[code=1]. See C:\tmp\assembly-ITs\projects\file-sets\excludes-using-regex\build.log for details.
[INFO] Building: file-sets\excluding-svn-dirs\pom.xml
[INFO] ...SUCCESS.
[INFO] Building: file-sets\filtered-module-sources\pom.xml
[INFO] ...SUCCESS.
[INFO] Building: file-sets\filtered-multimodule\pom.xml
[INFO] ...SUCCESS.
[INFO] Building: file-sets\include-base-directory\pom.xml
[INFO] ...SUCCESS.
[INFO] Building: file-sets\include-parent-dir\pom.xml
[INFO] ...SUCCESS.
[INFO] Building: file-sets\multimodule-unix-lineEndings\pom.xml
[INFO] ...SUCCESS.
[INFO] Building: file-sets\multimodule-win-lineEndings\pom.xml
[INFO] ...SUCCESS.
[INFO] Building: file-sets\use-default-excludes\pom.xml
[INFO] ...SUCCESS.
[INFO] Building: filtering-feature\filtersDefinedInAssemblyPluginConfig\pom.xml
[INFO] ...SUCCESS.
[INFO] Building: forking-tests\assembly-assembly-with-module-binaries\pom.xml
[INFO] ...SUCCESS.
[INFO] Building: forking-tests\assembly-attached-with-module-binaries\pom.xml
[INFO] ...SUCCESS.
[INFO] Building: mojo-configuration\ignoreDirFormatExtensions\pom.xml
[INFO] ...SUCCESS.
[INFO] Building: mojo-configuration\manifest-with-customEntry\pom.xml
[INFO] ...SUCCESS.
[INFO] Building: mojo-configuration\manifest-with-mainClass\pom.xml
[INFO] ...SUCCESS.
[INFO] Building: mojo-configuration\massembly-291\pom.xml
[INFO] ...SUCCESS.
[INFO] Building: mojo-configuration\massembly-301\pom.xml
[INFO] ...SUCCESS.
[INFO] Building: mojo-configuration\no-appendAssemblyId-no-classifier\pom.xml
[INFO] ...SUCCESS.
[INFO] Building: mojo-configuration\skipAssemblyCLIPropertySet\pom.xml
[INFO] ...SUCCESS.
[INFO] Building: mojo-tests\single-in-one-project-hierarchy\pom.xml
[INFO] ...SUCCESS.
[INFO] Building: mojo-tests\single-twice-in-multimodule-hierarchy\pom.xml
[INFO] ...SUCCESS.
[INFO] Building: mojo-tests\single-twice-in-one-project-hierarchy\pom.xml
[INFO] ...SUCCESS.
[INFO] Building: multimodule\massembly-298\pom.xml
[INFO] ...SUCCESS.
[INFO] Building: multimodule\two-level-multimodule\pom.xml
[INFO] ...SUCCESS.
[INFO] Building: multimodule\two-level-multimodule-dontIncludeSubModules\pom.xml
[INFO] ...SUCCESS.
[INFO] Building: multimodule\two-levels-includeBaseDirectory-withBinaries\pom.xml
[INFO] ...SUCCESS.
[INFO] Building: multimodule\two-levels-includeBaseDirectory-withSources\pom.xml
[INFO] ...SUCCESS.
[INFO] Building: multimodule\twoLevel-dontIncludeSubModules-artifactIdExprOutDir\pom.xml
[INFO] ...SUCCESS.
[INFO] Building: multimodule\twoLevel-includeSubModules-excludeSubModuleSourceDirs\pom.xml
[INFO] ...SUCCESS.
[INFO] Building: repositories\basic-repository\pom.xml
[INFO] ...SUCCESS.
[INFO] Building: repositories\massembly-196\pom.xml
[INFO] ...SUCCESS.
[INFO]
---------------------------------------
Execution Summary:
Builds Passing: 84
Builds Failing: 1
---------------------------------------
The following builds failed:
* file-sets\excludes-using-regex\pom.xml
[INFO] Error for project: Maven Assembly Plugin (during install)
[INFO] ------------------------------------------------------------------------
[INFO] : org.apache.maven.plugin.invoker.InvokerMojo@1cba031
1 builds failed.
[INFO] ------------------------------------------------------------------------
[INFO] Trace
org.apache.maven.BuildFailureException: 1 builds failed.
at org.apache.maven.lifecycle.DefaultLifecycleExecutor.executeGoals(DefaultLifecycleExecutor.java:699)
at org.apache.maven.lifecycle.DefaultLifecycleExecutor.executeGoalWithLifecycle(DefaultLifecycleExecutor.java:540)
at org.apache.maven.lifecycle.DefaultLifecycleExecutor.executeGoal(DefaultLifecycleExecutor.java:519)
at org.apache.maven.lifecycle.DefaultLifecycleExecutor.executeGoalAndHandleFailures(DefaultLifecycleExecutor.java:371)
at org.apache.maven.lifecycle.DefaultLifecycleExecutor.executeTaskSegments(DefaultLifecycleExecutor.java:332)
at org.apache.maven.lifecycle.DefaultLifecycleExecutor.execute(DefaultLifecycleExecutor.java:181)
at org.apache.maven.DefaultMaven.doExecute(DefaultMaven.java:356)
at org.apache.maven.DefaultMaven.execute(DefaultMaven.java:137)
at org.apache.maven.cli.MavenCli.main(MavenCli.java:356)
at sun.reflect.NativeMethodAccessorImpl.invoke0(Native Method)
at sun.reflect.NativeMethodAccessorImpl.invoke(NativeMethodAccessorImpl.java:39)
at sun.reflect.DelegatingMethodAccessorImpl.invoke(DelegatingMethodAccessorImpl.java:25)
at java.lang.reflect.Method.invoke(Method.java:585)
at org.codehaus.classworlds.Launcher.launchEnhanced(Launcher.java:315)
at org.codehaus.classworlds.Launcher.launch(Launcher.java:255)
at org.codehaus.classworlds.Launcher.mainWithExitCode(Launcher.java:430)
at org.codehaus.classworlds.Launcher.main(Launcher.java:375)
Caused by: org.apache.maven.plugin.MojoFailureException: 1 builds failed.
at org.apache.maven.plugin.invoker.InvokerMojo.execute(InvokerMojo.java:493)
at org.apache.maven.plugin.DefaultPluginManager.executeMojo(DefaultPluginManager.java:483)
at org.apache.maven.lifecycle.DefaultLifecycleExecutor.executeGoals(DefaultLifecycleExecutor.java:678)
... 16 more
[INFO] ------------------------------------------------------------------------
[INFO] BUILD ERRORS
[INFO] ------------------------------------------------------------------------
[INFO] Total time: 11 minutes 58 seconds
[INFO] Finished at: Thu May 28 16:19:08 PDT 2009
[INFO] Final Memory: 34M/67M
[INFO] ------------------------------------------------------------------------
Hudson build is back to normal: maven-assembly-plugin-2.2-beta-4-ITs » 1.5,windows #22
Posted by Hudson <Hu...@sonatype.org>.
See http://grid.sonatype.org/ci/job/maven-assembly-plugin-2.2-beta-4-ITs/./jdk=1.5,label=windows/22/changes
Build failed in Hudson: maven-assembly-plugin-2.2-beta-4-ITs » 1.5,windows #21
Posted by Hudson <Hu...@sonatype.org>.
See http://grid.sonatype.org/ci/job/maven-assembly-plugin-2.2-beta-4-ITs/./jdk=1.5,label=windows/21/changes
Changes:
[John Casey] update to 1.5.11, and update the XSD versions on the index page.
------------------------------------------
[...truncated 314 lines...]
[INFO] 2K downloaded (maven-model-2.0.6.pom)
[INFO] Downloading: http://repository.sonatype.org:8081/content/groups/sonatype-grid/org/codehaus/plexus/plexus-container-default/1.0-alpha-9-stable-1/plexus-container-default-1.0-alpha-9-stable-1.pom
[INFO] 3K downloaded (plexus-container-default-1.0-alpha-9-stable-1.pom)
[INFO] Downloading: http://repository.sonatype.org:8081/content/groups/sonatype-grid/org/apache/maven/maven-profile/2.0.6/maven-profile-2.0.6.pom
[INFO] 1K downloaded (maven-profile-2.0.6.pom)
[INFO] Downloading: http://repository.sonatype.org:8081/content/groups/sonatype-grid/org/apache/maven/maven-artifact-manager/2.0.6/maven-artifact-manager-2.0.6.pom
[INFO] 2K downloaded (maven-artifact-manager-2.0.6.pom)
[INFO] Downloading: http://repository.sonatype.org:8081/content/groups/sonatype-grid/org/apache/maven/maven-repository-metadata/2.0.6/maven-repository-metadata-2.0.6.pom
[INFO] 1K downloaded (maven-repository-metadata-2.0.6.pom)
[INFO] Downloading: http://repository.sonatype.org:8081/content/groups/sonatype-grid/org/apache/maven/maven-artifact/2.0.6/maven-artifact-2.0.6.pom
[INFO] 1K downloaded (maven-artifact-2.0.6.pom)
[INFO] Downloading: http://repository.sonatype.org:8081/content/groups/sonatype-grid/org/apache/maven/maven-plugin-registry/2.0.6/maven-plugin-registry-2.0.6.pom
[INFO] 1K downloaded (maven-plugin-registry-2.0.6.pom)
[INFO] Downloading: http://repository.sonatype.org:8081/content/groups/sonatype-grid/org/codehaus/plexus/plexus-digest/1.0/plexus-digest-1.0.pom
[INFO] 1K downloaded (plexus-digest-1.0.pom)
[INFO] Downloading: http://repository.sonatype.org:8081/content/groups/sonatype-grid/org/codehaus/plexus/plexus-components/1.1.7/plexus-components-1.1.7.pom
[INFO] 4K downloaded (plexus-components-1.1.7.pom)
[INFO] Downloading: http://repository.sonatype.org:8081/content/groups/sonatype-grid/org/codehaus/plexus/plexus-utils/1.1/plexus-utils-1.1.jar
[INFO] 164K downloaded (plexus-utils-1.1.jar)
[INFO] Downloading: http://repository.sonatype.org:8081/content/groups/sonatype-grid/org/codehaus/plexus/plexus-digest/1.0/plexus-digest-1.0.jar
[INFO] 11K downloaded (plexus-digest-1.0.jar)
[INFO] [INFO] [install:install]
[INFO] [INFO] Installing C:\tmp\assembly-ITs\it-project-parent\target\pom-transformed.xml to C:\home\hudson\workspace\maven-assembly-plugin-2.2-beta-4-ITs\jdk\1.5\label\windows\maven-assembly-plugin-2.2-beta-4\target\local-repository\org\apache\maven\plugin\assembly\test\it-project-parent\1\it-project-parent-1.pom
[INFO] [INFO] ------------------------------------------------------------------------
[INFO] [INFO] BUILD SUCCESSFUL
[INFO] [INFO] ------------------------------------------------------------------------
[INFO] [INFO] Total time: 5 seconds
[INFO] [INFO] Finished at: Fri May 29 10:08:05 PDT 2009
[INFO] [INFO] Final Memory: 8M/16M
[INFO] [INFO] ------------------------------------------------------------------------
[INFO] [invoker:run {execution: integration-test}]
[INFO] Building: basic-features\descriptorDirectoryScan\pom.xml
[INFO] ...SUCCESS.
[INFO] Building: basic-features\ExecutionRoot\pom.xml
[INFO] ...SUCCESS.
[INFO] Building: basic-features\file-copyIntoTopDir\pom.xml
[INFO] ...SUCCESS.
[INFO] Building: basic-features\file-sameName\pom.xml
[INFO] ...SUCCESS.
[INFO] Building: basic-features\massembly-256-pomPropertiesInterp\pom.xml
[INFO] ...SUCCESS.
[INFO] Building: basic-features\massembly-351-projectPrefixInterp\pom.xml
[INFO] ...SUCCESS.
[INFO] Building: basic-features\outputFileNameMapping-simple\pom.xml
[INFO] ...SUCCESS.
[INFO] Building: basic-features\outputFileNameMapping-withArtifactBaseVersion\pom.xml
[INFO] ...SUCCESS.
[INFO] Building: basic-features\relative-project-paths\pom.xml
[INFO] ...SUCCESS.
[INFO] Building: bugs\massembly-190\pom.xml
[INFO] ...SUCCESS.
[INFO] Building: bugs\massembly-285\pom.xml
[INFO] ...SUCCESS.
[INFO] Building: bugs\massembly-306\pom.xml
[INFO] ...SUCCESS.
[INFO] Building: bugs\massembly-375\pom.xml
[INFO] ...SUCCESS.
[INFO] Building: container-descriptors\configured-handler\pom.xml
[INFO] ...SUCCESS.
[INFO] Building: container-descriptors\custom-containerDescriptorHandler\pom.xml
[INFO] ...SUCCESS.
[INFO] Building: container-descriptors\custom-handler-withFileEntries\pom.xml
[INFO] ...SUCCESS.
[INFO] Building: container-descriptors\custom-handler-withMixedEntries\pom.xml
[INFO] ...SUCCESS.
[INFO] Building: dependency-sets\dep-with-transitive-filter\pom.xml
[INFO] ...SUCCESS.
[INFO] Building: dependency-sets\dependencySet-matchScope\pom.xml
[INFO] ...SUCCESS.
[INFO] Building: dependency-sets\dependencySet-nonTransitive\pom.xml
[INFO] ...SUCCESS.
[INFO] Building: dependency-sets\dependencySet-notUnpacked\pom.xml
[INFO] ...SUCCESS.
[INFO] Building: dependency-sets\dependencySet-projectArtifactNotIncluded\pom.xml
[INFO] ...SUCCESS.
[INFO] Building: dependency-sets\dependencySet-unpacked\pom.xml
[INFO] ...SUCCESS.
[INFO] Building: dependency-sets\dependencySet-unpackedExcludingMetaInf\pom.xml
[INFO] ...SUCCESS.
[INFO] Building: dependency-sets\dependencySet-unpackedSubsetsTwice\pom.xml
[INFO] ...SUCCESS.
[INFO] Building: dependency-sets\dependencySet-withExecutedProject\pom.xml
[INFO] ...SUCCESS.
[INFO] Building: dependency-sets\include-project-artifact\pom.xml
[INFO] ...SUCCESS.
[INFO] Building: dependency-sets\include-project-attachments\pom.xml
[INFO] ...SUCCESS.
[INFO] Building: dependency-sets\include-provided\pom.xml
[INFO] ...SUCCESS.
[INFO] Building: dependency-sets\including-pom-dependency\pom.xml
[INFO] ...SUCCESS.
[INFO] Building: dependency-sets\including-sar-dependency\pom.xml
[INFO] ...SUCCESS.
[INFO] Building: dependency-sets\massembly-201\pom.xml
[INFO] ...SUCCESS.
[INFO] Building: dependency-sets\massembly-232\pom.xml
[INFO] ...SUCCESS.
[INFO] Building: dependency-sets\massembly-235\pom.xml
[INFO] ...SUCCESS.
[INFO] Building: dependency-sets\massembly-345\pom.xml
[INFO] ...SUCCESS.
[INFO] Building: dependency-sets\massembly-99\pom.xml
[INFO] ...SUCCESS.
[INFO] Building: dependency-sets\multiple-wildcard-includes\pom.xml
[INFO] ...SUCCESS.
[INFO] Building: dependency-sets\outputFileNameMappingWithUnpack\pom.xml
[INFO] ...SUCCESS.
[INFO] Building: dependency-sets\using-moduleSet-implied-depSet\pom.xml
[INFO] ...SUCCESS.
[INFO] Building: descriptor-refs\bin\jars-in-archive-root\pom.xml
[INFO] ...SUCCESS.
[INFO] Building: descriptor-refs\jar-with-dependencies\component-descriptors-merged\pom.xml
[INFO] ...SUCCESS.
[INFO] Building: descriptor-refs\jar-with-dependencies\deps-unpacked-to-root-dir\pom.xml
[INFO] ...SUCCESS.
[INFO] Building: descriptor-refs\jar-with-dependencies\no-target-dir\pom.xml
[INFO] ...SUCCESS.
[INFO] Building: descriptor-refs\project\multimodule-sources-copied\pom.xml
[INFO] ...SUCCESS.
[INFO] Building: descriptor-refs\project\no-target-dir\pom.xml
[INFO] ...SUCCESS.
[INFO] Building: descriptor-refs\project\no-target-dir-multimodule\pom.xml
[INFO] ...SUCCESS.
[INFO] Building: descriptor-refs\project\sources-copied\pom.xml
[INFO] ...SUCCESS.
[INFO] Building: descriptor-refs\src\no-target-dir\pom.xml
[INFO] ...SUCCESS.
[INFO] Building: descriptor-refs\src\src-dir-copied\pom.xml
[INFO] ...SUCCESS.
[INFO] Building: file-modes\file-set-fileMode\pom.xml
[INFO] ...SUCCESS.
[INFO] Building: file-modes\fileItem-fileMode\pom.xml
[INFO] ...SUCCESS.
[INFO] Building: file-sets\default-directory-unspecified\pom.xml
[INFO] ...SUCCESS.
[INFO] Building: file-sets\default-excludes-unspecified\pom.xml
[INFO] ...SUCCESS.
[INFO] Building: file-sets\dont-use-default-excludes\pom.xml
[INFO] ...SUCCESS.
[INFO] Building: file-sets\excludes-using-regex\pom.xml
[INFO] ...FAILED[verify script returned false].
[INFO] Building: file-sets\excluding-svn-dirs\pom.xml
[INFO] ...SUCCESS.
[INFO] Building: file-sets\filtered-module-sources\pom.xml
[INFO] ...SUCCESS.
[INFO] Building: file-sets\filtered-multimodule\pom.xml
[INFO] ...SUCCESS.
[INFO] Building: file-sets\include-base-directory\pom.xml
[INFO] ...SUCCESS.
[INFO] Building: file-sets\include-parent-dir\pom.xml
[INFO] ...SUCCESS.
[INFO] Building: file-sets\multimodule-unix-lineEndings\pom.xml
[INFO] ...SUCCESS.
[INFO] Building: file-sets\multimodule-win-lineEndings\pom.xml
[INFO] ...SUCCESS.
[INFO] Building: file-sets\use-default-excludes\pom.xml
[INFO] ...SUCCESS.
[INFO] Building: filtering-feature\filtersDefinedInAssemblyPluginConfig\pom.xml
[INFO] ...SUCCESS.
[INFO] Building: forking-tests\assembly-assembly-with-module-binaries\pom.xml
[INFO] ...SUCCESS.
[INFO] Building: forking-tests\assembly-attached-with-module-binaries\pom.xml
[INFO] ...SUCCESS.
[INFO] Building: mojo-configuration\ignoreDirFormatExtensions\pom.xml
[INFO] ...SUCCESS.
[INFO] Building: mojo-configuration\manifest-with-customEntry\pom.xml
[INFO] ...SUCCESS.
[INFO] Building: mojo-configuration\manifest-with-mainClass\pom.xml
[INFO] ...SUCCESS.
[INFO] Building: mojo-configuration\massembly-291\pom.xml
[INFO] ...SUCCESS.
[INFO] Building: mojo-configuration\massembly-301\pom.xml
[INFO] ...SUCCESS.
[INFO] Building: mojo-configuration\no-appendAssemblyId-no-classifier\pom.xml
[INFO] ...SUCCESS.
[INFO] Building: mojo-configuration\skipAssemblyCLIPropertySet\pom.xml
[INFO] ...SUCCESS.
[INFO] Building: mojo-tests\single-in-one-project-hierarchy\pom.xml
[INFO] ...SUCCESS.
[INFO] Building: mojo-tests\single-twice-in-multimodule-hierarchy\pom.xml
[INFO] ...SUCCESS.
[INFO] Building: mojo-tests\single-twice-in-one-project-hierarchy\pom.xml
[INFO] ...SUCCESS.
[INFO] Building: multimodule\massembly-298\pom.xml
[INFO] ...SUCCESS.
[INFO] Building: multimodule\two-level-multimodule\pom.xml
[INFO] ...SUCCESS.
[INFO] Building: multimodule\two-level-multimodule-dontIncludeSubModules\pom.xml
[INFO] ...SUCCESS.
[INFO] Building: multimodule\two-levels-includeBaseDirectory-withBinaries\pom.xml
[INFO] ...SUCCESS.
[INFO] Building: multimodule\two-levels-includeBaseDirectory-withSources\pom.xml
[INFO] ...SUCCESS.
[INFO] Building: multimodule\twoLevel-dontIncludeSubModules-artifactIdExprOutDir\pom.xml
[INFO] ...SUCCESS.
[INFO] Building: multimodule\twoLevel-includeSubModules-excludeSubModuleSourceDirs\pom.xml
[INFO] ...SUCCESS.
[INFO] Building: repositories\basic-repository\pom.xml
[INFO] ...SUCCESS.
[INFO] Building: repositories\massembly-196\pom.xml
[INFO] ...SUCCESS.
[INFO]
---------------------------------------
Execution Summary:
Builds Passing: 84
Builds Failing: 1
---------------------------------------
The following builds failed:
* file-sets\excludes-using-regex\pom.xml
[INFO] Error for project: Maven Assembly Plugin (during install)
[INFO] ------------------------------------------------------------------------
[INFO] : org.apache.maven.plugin.invoker.InvokerMojo@10a6001
1 builds failed.
[INFO] ------------------------------------------------------------------------
[INFO] Trace
org.apache.maven.BuildFailureException: 1 builds failed.
at org.apache.maven.lifecycle.DefaultLifecycleExecutor.executeGoals(DefaultLifecycleExecutor.java:699)
at org.apache.maven.lifecycle.DefaultLifecycleExecutor.executeGoalWithLifecycle(DefaultLifecycleExecutor.java:540)
at org.apache.maven.lifecycle.DefaultLifecycleExecutor.executeGoal(DefaultLifecycleExecutor.java:519)
at org.apache.maven.lifecycle.DefaultLifecycleExecutor.executeGoalAndHandleFailures(DefaultLifecycleExecutor.java:371)
at org.apache.maven.lifecycle.DefaultLifecycleExecutor.executeTaskSegments(DefaultLifecycleExecutor.java:332)
at org.apache.maven.lifecycle.DefaultLifecycleExecutor.execute(DefaultLifecycleExecutor.java:181)
at org.apache.maven.DefaultMaven.doExecute(DefaultMaven.java:356)
at org.apache.maven.DefaultMaven.execute(DefaultMaven.java:137)
at org.apache.maven.cli.MavenCli.main(MavenCli.java:356)
at sun.reflect.NativeMethodAccessorImpl.invoke0(Native Method)
at sun.reflect.NativeMethodAccessorImpl.invoke(NativeMethodAccessorImpl.java:39)
at sun.reflect.DelegatingMethodAccessorImpl.invoke(DelegatingMethodAccessorImpl.java:25)
at java.lang.reflect.Method.invoke(Method.java:585)
at org.codehaus.classworlds.Launcher.launchEnhanced(Launcher.java:315)
at org.codehaus.classworlds.Launcher.launch(Launcher.java:255)
at org.codehaus.classworlds.Launcher.mainWithExitCode(Launcher.java:430)
at org.codehaus.classworlds.Launcher.main(Launcher.java:375)
Caused by: org.apache.maven.plugin.MojoFailureException: 1 builds failed.
at org.apache.maven.plugin.invoker.InvokerMojo.execute(InvokerMojo.java:493)
at org.apache.maven.plugin.DefaultPluginManager.executeMojo(DefaultPluginManager.java:483)
at org.apache.maven.lifecycle.DefaultLifecycleExecutor.executeGoals(DefaultLifecycleExecutor.java:678)
... 16 more
[INFO] ------------------------------------------------------------------------
[INFO] BUILD ERRORS
[INFO] ------------------------------------------------------------------------
[INFO] Total time: 11 minutes 55 seconds
[INFO] Finished at: Fri May 29 10:18:55 PDT 2009
[INFO] Final Memory: 34M/63M
[INFO] ------------------------------------------------------------------------
Build failed in Hudson: maven-assembly-plugin-2.2-beta-4-ITs » 1.5,windows #20
Posted by Hudson <Hu...@sonatype.org>.
See http://grid.sonatype.org/ci/job/maven-assembly-plugin-2.2-beta-4-ITs/./jdk=1.5,label=windows/20/
------------------------------------------
[...truncated 1235 lines...]
[INFO] 2K downloaded (maven-model-2.0.6.pom)
[INFO] Downloading: http://repository.sonatype.org:8081/content/groups/sonatype-grid/org/codehaus/plexus/plexus-container-default/1.0-alpha-9-stable-1/plexus-container-default-1.0-alpha-9-stable-1.pom
[INFO] 3K downloaded (plexus-container-default-1.0-alpha-9-stable-1.pom)
[INFO] Downloading: http://repository.sonatype.org:8081/content/groups/sonatype-grid/org/apache/maven/maven-profile/2.0.6/maven-profile-2.0.6.pom
[INFO] 1K downloaded (maven-profile-2.0.6.pom)
[INFO] Downloading: http://repository.sonatype.org:8081/content/groups/sonatype-grid/org/apache/maven/maven-artifact-manager/2.0.6/maven-artifact-manager-2.0.6.pom
[INFO] 2K downloaded (maven-artifact-manager-2.0.6.pom)
[INFO] Downloading: http://repository.sonatype.org:8081/content/groups/sonatype-grid/org/apache/maven/maven-repository-metadata/2.0.6/maven-repository-metadata-2.0.6.pom
[INFO] 1K downloaded (maven-repository-metadata-2.0.6.pom)
[INFO] Downloading: http://repository.sonatype.org:8081/content/groups/sonatype-grid/org/apache/maven/maven-artifact/2.0.6/maven-artifact-2.0.6.pom
[INFO] 1K downloaded (maven-artifact-2.0.6.pom)
[INFO] Downloading: http://repository.sonatype.org:8081/content/groups/sonatype-grid/org/apache/maven/maven-plugin-registry/2.0.6/maven-plugin-registry-2.0.6.pom
[INFO] 1K downloaded (maven-plugin-registry-2.0.6.pom)
[INFO] Downloading: http://repository.sonatype.org:8081/content/groups/sonatype-grid/org/codehaus/plexus/plexus-digest/1.0/plexus-digest-1.0.pom
[INFO] 1K downloaded (plexus-digest-1.0.pom)
[INFO] Downloading: http://repository.sonatype.org:8081/content/groups/sonatype-grid/org/codehaus/plexus/plexus-components/1.1.7/plexus-components-1.1.7.pom
[INFO] 4K downloaded (plexus-components-1.1.7.pom)
[INFO] Downloading: http://repository.sonatype.org:8081/content/groups/sonatype-grid/org/codehaus/plexus/plexus-utils/1.1/plexus-utils-1.1.jar
[INFO] 164K downloaded (plexus-utils-1.1.jar)
[INFO] Downloading: http://repository.sonatype.org:8081/content/groups/sonatype-grid/org/codehaus/plexus/plexus-digest/1.0/plexus-digest-1.0.jar
[INFO] 11K downloaded (plexus-digest-1.0.jar)
[INFO] [INFO] [install:install]
[INFO] [INFO] Installing C:\tmp\assembly-ITs\it-project-parent\target\pom-transformed.xml to C:\home\hudson\workspace\maven-assembly-plugin-2.2-beta-4-ITs\jdk\1.5\label\windows\maven-assembly-plugin-2.2-beta-4\target\local-repository\org\apache\maven\plugin\assembly\test\it-project-parent\1\it-project-parent-1.pom
[INFO] [INFO] ------------------------------------------------------------------------
[INFO] [INFO] BUILD SUCCESSFUL
[INFO] [INFO] ------------------------------------------------------------------------
[INFO] [INFO] Total time: 8 seconds
[INFO] [INFO] Finished at: Thu May 28 19:38:35 PDT 2009
[INFO] [INFO] Final Memory: 8M/15M
[INFO] [INFO] ------------------------------------------------------------------------
[INFO] [invoker:run {execution: integration-test}]
[INFO] Building: basic-features\descriptorDirectoryScan\pom.xml
[INFO] ...SUCCESS.
[INFO] Building: basic-features\ExecutionRoot\pom.xml
[INFO] ...SUCCESS.
[INFO] Building: basic-features\file-copyIntoTopDir\pom.xml
[INFO] ...SUCCESS.
[INFO] Building: basic-features\file-sameName\pom.xml
[INFO] ...SUCCESS.
[INFO] Building: basic-features\massembly-256-pomPropertiesInterp\pom.xml
[INFO] ...SUCCESS.
[INFO] Building: basic-features\massembly-351-projectPrefixInterp\pom.xml
[INFO] ...SUCCESS.
[INFO] Building: basic-features\outputFileNameMapping-simple\pom.xml
[INFO] ...SUCCESS.
[INFO] Building: basic-features\outputFileNameMapping-withArtifactBaseVersion\pom.xml
[INFO] ...SUCCESS.
[INFO] Building: basic-features\relative-project-paths\pom.xml
[INFO] ...SUCCESS.
[INFO] Building: bugs\massembly-190\pom.xml
[INFO] ...SUCCESS.
[INFO] Building: bugs\massembly-285\pom.xml
[INFO] ...SUCCESS.
[INFO] Building: bugs\massembly-306\pom.xml
[INFO] ...SUCCESS.
[INFO] Building: bugs\massembly-375\pom.xml
[INFO] ...SUCCESS.
[INFO] Building: container-descriptors\configured-handler\pom.xml
[INFO] ...SUCCESS.
[INFO] Building: container-descriptors\custom-containerDescriptorHandler\pom.xml
[INFO] ...SUCCESS.
[INFO] Building: container-descriptors\custom-handler-withFileEntries\pom.xml
[INFO] ...SUCCESS.
[INFO] Building: container-descriptors\custom-handler-withMixedEntries\pom.xml
[INFO] ...SUCCESS.
[INFO] Building: dependency-sets\dep-with-transitive-filter\pom.xml
[INFO] ...SUCCESS.
[INFO] Building: dependency-sets\dependencySet-matchScope\pom.xml
[INFO] ...SUCCESS.
[INFO] Building: dependency-sets\dependencySet-nonTransitive\pom.xml
[INFO] ...SUCCESS.
[INFO] Building: dependency-sets\dependencySet-notUnpacked\pom.xml
[INFO] ...SUCCESS.
[INFO] Building: dependency-sets\dependencySet-projectArtifactNotIncluded\pom.xml
[INFO] ...SUCCESS.
[INFO] Building: dependency-sets\dependencySet-unpacked\pom.xml
[INFO] ...SUCCESS.
[INFO] Building: dependency-sets\dependencySet-unpackedExcludingMetaInf\pom.xml
[INFO] ...SUCCESS.
[INFO] Building: dependency-sets\dependencySet-unpackedSubsetsTwice\pom.xml
[INFO] ...SUCCESS.
[INFO] Building: dependency-sets\dependencySet-withExecutedProject\pom.xml
[INFO] ...SUCCESS.
[INFO] Building: dependency-sets\include-project-artifact\pom.xml
[INFO] ...SUCCESS.
[INFO] Building: dependency-sets\include-project-attachments\pom.xml
[INFO] ...SUCCESS.
[INFO] Building: dependency-sets\include-provided\pom.xml
[INFO] ...SUCCESS.
[INFO] Building: dependency-sets\including-pom-dependency\pom.xml
[INFO] ...SUCCESS.
[INFO] Building: dependency-sets\including-sar-dependency\pom.xml
[INFO] ...SUCCESS.
[INFO] Building: dependency-sets\massembly-201\pom.xml
[INFO] ...SUCCESS.
[INFO] Building: dependency-sets\massembly-232\pom.xml
[INFO] ...SUCCESS.
[INFO] Building: dependency-sets\massembly-235\pom.xml
[INFO] ...SUCCESS.
[INFO] Building: dependency-sets\massembly-345\pom.xml
[INFO] ...SUCCESS.
[INFO] Building: dependency-sets\massembly-99\pom.xml
[INFO] ...SUCCESS.
[INFO] Building: dependency-sets\multiple-wildcard-includes\pom.xml
[INFO] ...SUCCESS.
[INFO] Building: dependency-sets\outputFileNameMappingWithUnpack\pom.xml
[INFO] ...SUCCESS.
[INFO] Building: dependency-sets\using-moduleSet-implied-depSet\pom.xml
[INFO] ...SUCCESS.
[INFO] Building: descriptor-refs\bin\jars-in-archive-root\pom.xml
[INFO] ...SUCCESS.
[INFO] Building: descriptor-refs\jar-with-dependencies\component-descriptors-merged\pom.xml
[INFO] ...SUCCESS.
[INFO] Building: descriptor-refs\jar-with-dependencies\deps-unpacked-to-root-dir\pom.xml
[INFO] ...SUCCESS.
[INFO] Building: descriptor-refs\jar-with-dependencies\no-target-dir\pom.xml
[INFO] ...SUCCESS.
[INFO] Building: descriptor-refs\project\multimodule-sources-copied\pom.xml
[INFO] ...SUCCESS.
[INFO] Building: descriptor-refs\project\no-target-dir\pom.xml
[INFO] ...SUCCESS.
[INFO] Building: descriptor-refs\project\no-target-dir-multimodule\pom.xml
[INFO] ...SUCCESS.
[INFO] Building: descriptor-refs\project\sources-copied\pom.xml
[INFO] ...SUCCESS.
[INFO] Building: descriptor-refs\src\no-target-dir\pom.xml
[INFO] ...SUCCESS.
[INFO] Building: descriptor-refs\src\src-dir-copied\pom.xml
[INFO] ...SUCCESS.
[INFO] Building: file-modes\file-set-fileMode\pom.xml
[INFO] ...SUCCESS.
[INFO] Building: file-modes\fileItem-fileMode\pom.xml
[INFO] ...SUCCESS.
[INFO] Building: file-sets\default-directory-unspecified\pom.xml
[INFO] ...SUCCESS.
[INFO] Building: file-sets\default-excludes-unspecified\pom.xml
[INFO] ...SUCCESS.
[INFO] Building: file-sets\dont-use-default-excludes\pom.xml
[INFO] ...SUCCESS.
[INFO] Building: file-sets\excludes-using-regex\pom.xml
[INFO] ...FAILED[code=1]. See C:\tmp\assembly-ITs\projects\file-sets\excludes-using-regex\build.log for details.
[INFO] Building: file-sets\excluding-svn-dirs\pom.xml
[INFO] ...SUCCESS.
[INFO] Building: file-sets\filtered-module-sources\pom.xml
[INFO] ...SUCCESS.
[INFO] Building: file-sets\filtered-multimodule\pom.xml
[INFO] ...SUCCESS.
[INFO] Building: file-sets\include-base-directory\pom.xml
[INFO] ...SUCCESS.
[INFO] Building: file-sets\include-parent-dir\pom.xml
[INFO] ...SUCCESS.
[INFO] Building: file-sets\multimodule-unix-lineEndings\pom.xml
[INFO] ...SUCCESS.
[INFO] Building: file-sets\multimodule-win-lineEndings\pom.xml
[INFO] ...SUCCESS.
[INFO] Building: file-sets\use-default-excludes\pom.xml
[INFO] ...SUCCESS.
[INFO] Building: filtering-feature\filtersDefinedInAssemblyPluginConfig\pom.xml
[INFO] ...SUCCESS.
[INFO] Building: forking-tests\assembly-assembly-with-module-binaries\pom.xml
[INFO] ...SUCCESS.
[INFO] Building: forking-tests\assembly-attached-with-module-binaries\pom.xml
[INFO] ...SUCCESS.
[INFO] Building: mojo-configuration\ignoreDirFormatExtensions\pom.xml
[INFO] ...SUCCESS.
[INFO] Building: mojo-configuration\manifest-with-customEntry\pom.xml
[INFO] ...SUCCESS.
[INFO] Building: mojo-configuration\manifest-with-mainClass\pom.xml
[INFO] ...SUCCESS.
[INFO] Building: mojo-configuration\massembly-291\pom.xml
[INFO] ...SUCCESS.
[INFO] Building: mojo-configuration\massembly-301\pom.xml
[INFO] ...SUCCESS.
[INFO] Building: mojo-configuration\no-appendAssemblyId-no-classifier\pom.xml
[INFO] ...SUCCESS.
[INFO] Building: mojo-configuration\skipAssemblyCLIPropertySet\pom.xml
[INFO] ...SUCCESS.
[INFO] Building: mojo-tests\single-in-one-project-hierarchy\pom.xml
[INFO] ...SUCCESS.
[INFO] Building: mojo-tests\single-twice-in-multimodule-hierarchy\pom.xml
[INFO] ...SUCCESS.
[INFO] Building: mojo-tests\single-twice-in-one-project-hierarchy\pom.xml
[INFO] ...SUCCESS.
[INFO] Building: multimodule\massembly-298\pom.xml
[INFO] ...SUCCESS.
[INFO] Building: multimodule\two-level-multimodule\pom.xml
[INFO] ...SUCCESS.
[INFO] Building: multimodule\two-level-multimodule-dontIncludeSubModules\pom.xml
[INFO] ...SUCCESS.
[INFO] Building: multimodule\two-levels-includeBaseDirectory-withBinaries\pom.xml
[INFO] ...SUCCESS.
[INFO] Building: multimodule\two-levels-includeBaseDirectory-withSources\pom.xml
[INFO] ...SUCCESS.
[INFO] Building: multimodule\twoLevel-dontIncludeSubModules-artifactIdExprOutDir\pom.xml
[INFO] ...SUCCESS.
[INFO] Building: multimodule\twoLevel-includeSubModules-excludeSubModuleSourceDirs\pom.xml
[INFO] ...SUCCESS.
[INFO] Building: repositories\basic-repository\pom.xml
[INFO] ...SUCCESS.
[INFO] Building: repositories\massembly-196\pom.xml
[INFO] ...SUCCESS.
[INFO]
---------------------------------------
Execution Summary:
Builds Passing: 84
Builds Failing: 1
---------------------------------------
The following builds failed:
* file-sets\excludes-using-regex\pom.xml
[INFO] Error for project: Maven Assembly Plugin (during install)
[INFO] ------------------------------------------------------------------------
[INFO] : org.apache.maven.plugin.invoker.InvokerMojo@13e55db
1 builds failed.
[INFO] ------------------------------------------------------------------------
[INFO] Trace
org.apache.maven.BuildFailureException: 1 builds failed.
at org.apache.maven.lifecycle.DefaultLifecycleExecutor.executeGoals(DefaultLifecycleExecutor.java:699)
at org.apache.maven.lifecycle.DefaultLifecycleExecutor.executeGoalWithLifecycle(DefaultLifecycleExecutor.java:540)
at org.apache.maven.lifecycle.DefaultLifecycleExecutor.executeGoal(DefaultLifecycleExecutor.java:519)
at org.apache.maven.lifecycle.DefaultLifecycleExecutor.executeGoalAndHandleFailures(DefaultLifecycleExecutor.java:371)
at org.apache.maven.lifecycle.DefaultLifecycleExecutor.executeTaskSegments(DefaultLifecycleExecutor.java:332)
at org.apache.maven.lifecycle.DefaultLifecycleExecutor.execute(DefaultLifecycleExecutor.java:181)
at org.apache.maven.DefaultMaven.doExecute(DefaultMaven.java:356)
at org.apache.maven.DefaultMaven.execute(DefaultMaven.java:137)
at org.apache.maven.cli.MavenCli.main(MavenCli.java:356)
at sun.reflect.NativeMethodAccessorImpl.invoke0(Native Method)
at sun.reflect.NativeMethodAccessorImpl.invoke(NativeMethodAccessorImpl.java:39)
at sun.reflect.DelegatingMethodAccessorImpl.invoke(DelegatingMethodAccessorImpl.java:25)
at java.lang.reflect.Method.invoke(Method.java:585)
at org.codehaus.classworlds.Launcher.launchEnhanced(Launcher.java:315)
at org.codehaus.classworlds.Launcher.launch(Launcher.java:255)
at org.codehaus.classworlds.Launcher.mainWithExitCode(Launcher.java:430)
at org.codehaus.classworlds.Launcher.main(Launcher.java:375)
Caused by: org.apache.maven.plugin.MojoFailureException: 1 builds failed.
at org.apache.maven.plugin.invoker.InvokerMojo.execute(InvokerMojo.java:493)
at org.apache.maven.plugin.DefaultPluginManager.executeMojo(DefaultPluginManager.java:483)
at org.apache.maven.lifecycle.DefaultLifecycleExecutor.executeGoals(DefaultLifecycleExecutor.java:678)
... 16 more
[INFO] ------------------------------------------------------------------------
[INFO] BUILD ERRORS
[INFO] ------------------------------------------------------------------------
[INFO] Total time: 13 minutes 33 seconds
[INFO] Finished at: Thu May 28 19:50:53 PDT 2009
[INFO] Final Memory: 33M/64M
[INFO] ------------------------------------------------------------------------
Build failed in Hudson: maven-assembly-plugin-2.2-beta-4-ITs » 1.5,windows #19
Posted by Hudson <Hu...@sonatype.org>.
See http://grid.sonatype.org/ci/job/maven-assembly-plugin-2.2-beta-4-ITs/./jdk=1.5,label=windows/19/
------------------------------------------
Started by upstream project "maven-assembly-plugin-2.2-beta-4-ITs" build number 19
Building remotely on vista2
Updating https://svn.apache.org/repos/asf/maven/plugins/branches/maven-assembly-plugin-2.2-beta-4
U pom.xml
SCM check out aborted