You are viewing a plain text version of this content. The canonical link for it is here.
Posted to dev@poi.apache.org by Apache Jenkins Server <je...@builds.apache.org> on 2019/12/23 12:09:41 UTC

Build failed in Jenkins: POI-DSL-Maven #984

See <https://builds.apache.org/job/POI-DSL-Maven/984/display/redirect?page=changes>

Changes:

[fanningpj] convert some tabs to spaces


------------------------------------------
[...truncated 132.20 KB...]
Tests run: 1, Failures: 0, Errors: 0, Skipped: 0, Time elapsed: 0.001 sec - in org.apache.poi.ss.formula.functions.TestIPMT
Running org.apache.poi.ss.formula.functions.TestDGetFunctionsFromSpreadsheet
Tests run: 80, Failures: 0, Errors: 0, Skipped: 0, Time elapsed: 0.018 sec - in org.apache.poi.ss.formula.functions.TestDGetFunctionsFromSpreadsheet
Running org.apache.poi.ss.formula.functions.TestRowCol
Tests run: 4, Failures: 0, Errors: 0, Skipped: 0, Time elapsed: 0 sec - in org.apache.poi.ss.formula.functions.TestRowCol
Running org.apache.poi.ss.formula.functions.TestComplexFunctionsFromSpreadsheet
Tests run: 12, Failures: 0, Errors: 0, Skipped: 0, Time elapsed: 0 sec - in org.apache.poi.ss.formula.functions.TestComplexFunctionsFromSpreadsheet
Running org.apache.poi.ss.formula.functions.TestTrendFunctionsFromSpreadsheet
Tests run: 41, Failures: 0, Errors: 0, Skipped: 0, Time elapsed: 0.042 sec - in org.apache.poi.ss.formula.functions.TestTrendFunctionsFromSpreadsheet
Running org.apache.poi.ss.formula.functions.TestGeomean
Tests run: 11, Failures: 0, Errors: 0, Skipped: 0, Time elapsed: 0.21 sec - in org.apache.poi.ss.formula.functions.TestGeomean
Running org.apache.poi.ss.formula.functions.TestMatch
Tests run: 9, Failures: 0, Errors: 0, Skipped: 0, Time elapsed: 0.001 sec - in org.apache.poi.ss.formula.functions.TestMatch
Running org.apache.poi.ss.formula.functions.TestDec2Bin
Tests run: 15, Failures: 0, Errors: 0, Skipped: 0, Time elapsed: 0.025 sec - in org.apache.poi.ss.formula.functions.TestDec2Bin
Running org.apache.poi.ss.formula.TestCellCacheEntry
Tests run: 1, Failures: 0, Errors: 0, Skipped: 0, Time elapsed: 0 sec - in org.apache.poi.ss.formula.TestCellCacheEntry
Running org.apache.poi.ss.formula.TestFunctionRegistry
Tests run: 2, Failures: 0, Errors: 0, Skipped: 0, Time elapsed: 0 sec - in org.apache.poi.ss.formula.TestFunctionRegistry
Running org.apache.poi.ss.TestSpreadsheetVersion
Tests run: 2, Failures: 0, Errors: 0, Skipped: 0, Time elapsed: 0 sec - in org.apache.poi.ss.TestSpreadsheetVersion
Running org.apache.poi.ss.util.TestCellRangeUtil
Tests run: 1, Failures: 0, Errors: 0, Skipped: 0, Time elapsed: 0 sec - in org.apache.poi.ss.util.TestCellRangeUtil
Running org.apache.poi.ss.util.TestCellAddress
Tests run: 6, Failures: 0, Errors: 0, Skipped: 0, Time elapsed: 0 sec - in org.apache.poi.ss.util.TestCellAddress
Running org.apache.poi.ss.util.TestSheetUtil
Tests run: 7, Failures: 0, Errors: 0, Skipped: 0, Time elapsed: 0.002 sec - in org.apache.poi.ss.util.TestSheetUtil
Running org.apache.poi.ss.util.TestDateFormatConverter
Tests run: 4, Failures: 0, Errors: 0, Skipped: 0, Time elapsed: 1.738 sec - in org.apache.poi.ss.util.TestDateFormatConverter
Running org.apache.poi.ss.util.TestPropertyTemplate
Tests run: 8, Failures: 0, Errors: 0, Skipped: 0, Time elapsed: 0.051 sec - in org.apache.poi.ss.util.TestPropertyTemplate
Running org.apache.poi.ss.util.TestSheetBuilder
Tests run: 3, Failures: 0, Errors: 0, Skipped: 0, Time elapsed: 0.003 sec - in org.apache.poi.ss.util.TestSheetBuilder
Running org.apache.poi.ss.util.TestNumberComparer
Tests run: 4, Failures: 0, Errors: 0, Skipped: 0, Time elapsed: 0.052 sec - in org.apache.poi.ss.util.TestNumberComparer
Running org.apache.poi.ss.util.TestAreaReference
Tests run: 3, Failures: 0, Errors: 0, Skipped: 0, Time elapsed: 0 sec - in org.apache.poi.ss.util.TestAreaReference
Running org.apache.poi.ss.util.TestNumberToTextConverter
Tests run: 2, Failures: 0, Errors: 0, Skipped: 0, Time elapsed: 0.004 sec - in org.apache.poi.ss.util.TestNumberToTextConverter
Running org.apache.poi.ss.util.TestWorkbookUtil
Tests run: 1, Failures: 0, Errors: 0, Skipped: 0, Time elapsed: 0 sec - in org.apache.poi.ss.util.TestWorkbookUtil
Running org.apache.poi.ss.util.TestHSSFCellUtil
Tests run: 14, Failures: 0, Errors: 0, Skipped: 0, Time elapsed: 0.006 sec - in org.apache.poi.ss.util.TestHSSFCellUtil
Running org.apache.poi.ss.util.TestExpandedDouble
Tests run: 3, Failures: 0, Errors: 0, Skipped: 0, Time elapsed: 0 sec - in org.apache.poi.ss.util.TestExpandedDouble
Running org.apache.poi.ss.util.TestCellReference
Tests run: 27, Failures: 0, Errors: 0, Skipped: 0, Time elapsed: 0.418 sec - in org.apache.poi.ss.util.TestCellReference
Running org.apache.poi.ss.util.TestCellRangeAddress
Tests run: 14, Failures: 0, Errors: 0, Skipped: 0, Time elapsed: 0 sec - in org.apache.poi.ss.util.TestCellRangeAddress
Running org.apache.poi.ss.util.cellwalk.TestCellWalk
Tests run: 1, Failures: 0, Errors: 0, Skipped: 0, Time elapsed: 0.001 sec - in org.apache.poi.ss.util.cellwalk.TestCellWalk
Running org.apache.poi.ss.util.TestRegionUtil
Tests run: 10, Failures: 0, Errors: 0, Skipped: 0, Time elapsed: 0.01 sec - in org.apache.poi.ss.util.TestRegionUtil
Running org.apache.poi.ss.format.TestCellFormatResult
Tests run: 1, Failures: 0, Errors: 0, Skipped: 0, Time elapsed: 0 sec - in org.apache.poi.ss.format.TestCellFormatResult
Running org.apache.poi.ss.format.TestCellFormatCondition
Tests run: 1, Failures: 0, Errors: 0, Skipped: 0, Time elapsed: 0 sec - in org.apache.poi.ss.format.TestCellFormatCondition
Running org.apache.poi.ss.format.TestCellFormat
Tests run: 40, Failures: 0, Errors: 0, Skipped: 0, Time elapsed: 0.063 sec - in org.apache.poi.ss.format.TestCellFormat
Running org.apache.poi.ss.usermodel.TestFractionFormat
Tests run: 5, Failures: 0, Errors: 0, Skipped: 1, Time elapsed: 0.236 sec - in org.apache.poi.ss.usermodel.TestFractionFormat
Running org.apache.poi.ss.usermodel.charts.TestDataSources
Tests run: 6, Failures: 0, Errors: 0, Skipped: 0, Time elapsed: 0.003 sec - in org.apache.poi.ss.usermodel.charts.TestDataSources
Running org.apache.poi.ss.usermodel.TestHSSFBorderStyle
Tests run: 1, Failures: 0, Errors: 0, Skipped: 0, Time elapsed: 0 sec - in org.apache.poi.ss.usermodel.TestHSSFBorderStyle
Running org.apache.poi.ss.usermodel.TestExcelStyleDateFormatter
Tests run: 4, Failures: 0, Errors: 0, Skipped: 0, Time elapsed: 0.011 sec - in org.apache.poi.ss.usermodel.TestExcelStyleDateFormatter
Running org.apache.poi.ss.usermodel.TestIndexedColors
Tests run: 3, Failures: 0, Errors: 0, Skipped: 0, Time elapsed: 0 sec - in org.apache.poi.ss.usermodel.TestIndexedColors
Running org.apache.poi.ss.usermodel.TestDateUtil
Tests run: 26, Failures: 0, Errors: 0, Skipped: 0, Time elapsed: 0.014 sec - in org.apache.poi.ss.usermodel.TestDateUtil
Running org.apache.poi.ss.usermodel.TestDataFormatter
Tests run: 36, Failures: 0, Errors: 0, Skipped: 1, Time elapsed: 0.294 sec - in org.apache.poi.ss.usermodel.TestDataFormatter
Running org.apache.poi.util.TestStringUtil
Tests run: 8, Failures: 0, Errors: 0, Skipped: 0, Time elapsed: 0 sec - in org.apache.poi.util.TestStringUtil
Running org.apache.poi.util.TestShortField
Tests run: 5, Failures: 0, Errors: 0, Skipped: 0, Time elapsed: 0 sec - in org.apache.poi.util.TestShortField
Running org.apache.poi.util.TestLongField
Tests run: 5, Failures: 0, Errors: 0, Skipped: 0, Time elapsed: 0.001 sec - in org.apache.poi.util.TestLongField
Running org.apache.poi.util.TestStringCodepointsIterable
Tests run: 1, Failures: 0, Errors: 0, Skipped: 0, Time elapsed: 0 sec - in org.apache.poi.util.TestStringCodepointsIterable
Running org.apache.poi.util.TestPOILogger
Tests run: 1, Failures: 0, Errors: 0, Skipped: 0, Time elapsed: 0 sec - in org.apache.poi.util.TestPOILogger
Running org.apache.poi.util.TestLocaleUtil
Tests run: 3, Failures: 0, Errors: 0, Skipped: 0, Time elapsed: 0 sec - in org.apache.poi.util.TestLocaleUtil
Running org.apache.poi.util.TestIntegerField
Tests run: 5, Failures: 0, Errors: 0, Skipped: 0, Time elapsed: 0 sec - in org.apache.poi.util.TestIntegerField
Running org.apache.poi.util.TestLittleEndianStreams
Tests run: 5, Failures: 0, Errors: 0, Skipped: 0, Time elapsed: 0 sec - in org.apache.poi.util.TestLittleEndianStreams
Running org.apache.poi.util.TestRLEDecompressingInputStream
Tests run: 4, Failures: 0, Errors: 0, Skipped: 0, Time elapsed: 0 sec - in org.apache.poi.util.TestRLEDecompressingInputStream
Running org.apache.poi.util.TestHexDump
Tests run: 10, Failures: 0, Errors: 0, Skipped: 0, Time elapsed: 0.015 sec - in org.apache.poi.util.TestHexDump
Running org.apache.poi.util.TestTempFile
Tests run: 4, Failures: 0, Errors: 0, Skipped: 0, Time elapsed: 0.047 sec - in org.apache.poi.util.TestTempFile
Running org.apache.poi.util.TestLittleEndianCP950Reader
Tests run: 1, Failures: 0, Errors: 0, Skipped: 0, Time elapsed: 0 sec - in org.apache.poi.util.TestLittleEndianCP950Reader
Running org.apache.poi.util.TestBitField
Tests run: 16, Failures: 0, Errors: 0, Skipped: 0, Time elapsed: 0.001 sec - in org.apache.poi.util.TestBitField
Running org.apache.poi.util.TestByteField
Tests run: 5, Failures: 0, Errors: 0, Skipped: 0, Time elapsed: 0 sec - in org.apache.poi.util.TestByteField
Running org.apache.poi.util.TestArrayUtil
Tests run: 2, Failures: 0, Errors: 0, Skipped: 0, Time elapsed: 0.021 sec - in org.apache.poi.util.TestArrayUtil
Running org.apache.poi.util.TestIOUtils
Tests run: 36, Failures: 0, Errors: 0, Skipped: 0, Time elapsed: 0.004 sec - in org.apache.poi.util.TestIOUtils
Running org.apache.poi.util.TestIntList
Tests run: 19, Failures: 0, Errors: 0, Skipped: 0, Time elapsed: 0.047 sec - in org.apache.poi.util.TestIntList
Running org.apache.poi.util.TestPOILogFactory
Tests run: 1, Failures: 0, Errors: 0, Skipped: 0, Time elapsed: 0 sec - in org.apache.poi.util.TestPOILogFactory
Running org.apache.poi.util.TestXMLHelper
Tests run: 8, Failures: 0, Errors: 0, Skipped: 0, Time elapsed: 0.337 sec - in org.apache.poi.util.TestXMLHelper
Running org.apache.poi.util.TestLittleEndian
Tests run: 15, Failures: 0, Errors: 0, Skipped: 0, Time elapsed: 0.001 sec - in org.apache.poi.util.TestLittleEndian
Running org.apache.poi.TestPOIDocumentMain
Tests run: 6, Failures: 0, Errors: 0, Skipped: 0, Time elapsed: 0.008 sec - in org.apache.poi.TestPOIDocumentMain
Running org.apache.poi.hpsf.TestVariantSupport
Tests run: 2, Failures: 0, Errors: 0, Skipped: 0, Time elapsed: 0.046 sec - in org.apache.poi.hpsf.TestVariantSupport
Running org.apache.poi.hpsf.extractor.TestHPSFPropertiesExtractor
Tests run: 8, Failures: 0, Errors: 0, Skipped: 0, Time elapsed: 0.151 sec - in org.apache.poi.hpsf.extractor.TestHPSFPropertiesExtractor
Running org.apache.poi.hpsf.basic.TestBasic
Tests run: 6, Failures: 0, Errors: 0, Skipped: 0, Time elapsed: 0.016 sec - in org.apache.poi.hpsf.basic.TestBasic
Running org.apache.poi.hpsf.basic.TestEmptyProperties
Tests run: 3, Failures: 0, Errors: 0, Skipped: 0, Time elapsed: 0.011 sec - in org.apache.poi.hpsf.basic.TestEmptyProperties
Running org.apache.poi.hpsf.basic.TestMetaDataIPI
Tests run: 7, Failures: 0, Errors: 0, Skipped: 0, Time elapsed: 0.236 sec - in org.apache.poi.hpsf.basic.TestMetaDataIPI
Running org.apache.poi.hpsf.basic.TestHPSFBugs
Tests run: 4, Failures: 0, Errors: 0, Skipped: 0, Time elapsed: 0.159 sec - in org.apache.poi.hpsf.basic.TestHPSFBugs
Running org.apache.poi.hpsf.basic.TestWrite
Tests run: 10, Failures: 0, Errors: 0, Skipped: 0, Time elapsed: 0.21 sec - in org.apache.poi.hpsf.basic.TestWrite
Running org.apache.poi.hpsf.basic.TestUnicode
Tests run: 1, Failures: 0, Errors: 0, Skipped: 0, Time elapsed: 0.001 sec - in org.apache.poi.hpsf.basic.TestUnicode
Running org.apache.poi.hpsf.basic.TestWriteWellKnown
Tests run: 3, Failures: 0, Errors: 0, Skipped: 0, Time elapsed: 0.088 sec - in org.apache.poi.hpsf.basic.TestWriteWellKnown
Running org.apache.poi.hpsf.basic.TestReadAllFiles
Tests run: 88, Failures: 0, Errors: 0, Skipped: 0, Time elapsed: 1.126 sec - in org.apache.poi.hpsf.basic.TestReadAllFiles
Running org.apache.poi.hpsf.basic.TestClassID
Tests run: 3, Failures: 0, Errors: 0, Skipped: 0, Time elapsed: 0 sec - in org.apache.poi.hpsf.basic.TestClassID
Running org.apache.poi.TestPOITestCase
Tests run: 10, Failures: 0, Errors: 0, Skipped: 3, Time elapsed: 0 sec - in org.apache.poi.TestPOITestCase
Running org.apache.poi.sl.draw.geom.TestPresetGeometries
Tests run: 2, Failures: 0, Errors: 0, Skipped: 1, Time elapsed: 1.139 sec - in org.apache.poi.sl.draw.geom.TestPresetGeometries
Running org.apache.poi.poifs.storage.TestBATBlock
Tests run: 6, Failures: 0, Errors: 0, Skipped: 0, Time elapsed: 0 sec - in org.apache.poi.poifs.storage.TestBATBlock
Running org.apache.poi.poifs.storage.TestHeaderBlockReading
Tests run: 1, Failures: 0, Errors: 0, Skipped: 0, Time elapsed: 0 sec - in org.apache.poi.poifs.storage.TestHeaderBlockReading
Running org.apache.poi.poifs.nio.TestDataSource
Tests run: 4, Failures: 0, Errors: 0, Skipped: 0, Time elapsed: 0.032 sec - in org.apache.poi.poifs.nio.TestDataSource
Running org.apache.poi.poifs.macros.TestVBAMacroReader
Tests run: 27, Failures: 0, Errors: 0, Skipped: 6, Time elapsed: 0.242 sec - in org.apache.poi.poifs.macros.TestVBAMacroReader
Running org.apache.poi.poifs.eventfilesystem.TestPOIFSReaderRegistry
Tests run: 2, Failures: 0, Errors: 0, Skipped: 0, Time elapsed: 0 sec - in org.apache.poi.poifs.eventfilesystem.TestPOIFSReaderRegistry
Running org.apache.poi.poifs.dev.TestPOIFSDump
Tests run: 4, Failures: 0, Errors: 0, Skipped: 1, Time elapsed: 0.033 sec - in org.apache.poi.poifs.dev.TestPOIFSDump
Running org.apache.poi.poifs.filesystem.TestPOIFSDocumentPath
Tests run: 4, Failures: 0, Errors: 0, Skipped: 0, Time elapsed: 0.001 sec - in org.apache.poi.poifs.filesystem.TestPOIFSDocumentPath
Running org.apache.poi.poifs.filesystem.TestDocument
Tests run: 1, Failures: 0, Errors: 0, Skipped: 0, Time elapsed: 0.008 sec - in org.apache.poi.poifs.filesystem.TestDocument
Running org.apache.poi.poifs.filesystem.TestPOIFSFileSystem
Tests run: 6, Failures: 0, Errors: 0, Skipped: 0, Time elapsed: 0.555 sec - in org.apache.poi.poifs.filesystem.TestPOIFSFileSystem
Running org.apache.poi.poifs.filesystem.TestFileMagic
Tests run: 9, Failures: 0, Errors: 0, Skipped: 0, Time elapsed: 0.007 sec - in org.apache.poi.poifs.filesystem.TestFileMagic
Running org.apache.poi.poifs.filesystem.TestDocumentInputStream
Tests run: 8, Failures: 0, Errors: 0, Skipped: 0, Time elapsed: 0.291 sec - in org.apache.poi.poifs.filesystem.TestDocumentInputStream
Running org.apache.poi.poifs.filesystem.TestNotOLE2Exception
Tests run: 4, Failures: 0, Errors: 0, Skipped: 0, Time elapsed: 0.018 sec - in org.apache.poi.poifs.filesystem.TestNotOLE2Exception
Running org.apache.poi.poifs.filesystem.TestFilteringDirectoryNode
Tests run: 4, Failures: 0, Errors: 0, Skipped: 0, Time elapsed: 0 sec - in org.apache.poi.poifs.filesystem.TestFilteringDirectoryNode
Running org.apache.poi.poifs.filesystem.TestDocumentDescriptor
Tests run: 1, Failures: 0, Errors: 0, Skipped: 0, Time elapsed: 0.001 sec - in org.apache.poi.poifs.filesystem.TestDocumentDescriptor
Running org.apache.poi.poifs.filesystem.TestPOIFSMiniStore
Tests run: 7, Failures: 0, Errors: 0, Skipped: 0, Time elapsed: 0.006 sec - in org.apache.poi.poifs.filesystem.TestPOIFSMiniStore
Running org.apache.poi.poifs.filesystem.TestOfficeXMLException
Tests run: 5, Failures: 0, Errors: 0, Skipped: 0, Time elapsed: 0.057 sec - in org.apache.poi.poifs.filesystem.TestOfficeXMLException
Running org.apache.poi.poifs.filesystem.TestFileSystemBugs
Tests run: 3, Failures: 0, Errors: 0, Skipped: 0, Time elapsed: 0.044 sec - in org.apache.poi.poifs.filesystem.TestFileSystemBugs
Running org.apache.poi.poifs.filesystem.TestDirectoryNode
Tests run: 4, Failures: 0, Errors: 0, Skipped: 0, Time elapsed: 0.001 sec - in org.apache.poi.poifs.filesystem.TestDirectoryNode
Running org.apache.poi.poifs.filesystem.TestEmptyDocument
Tests run: 5, Failures: 0, Errors: 0, Skipped: 0, Time elapsed: 0.001 sec - in org.apache.poi.poifs.filesystem.TestEmptyDocument
Running org.apache.poi.poifs.filesystem.TestDocumentOutputStream
Tests run: 3, Failures: 0, Errors: 0, Skipped: 0, Time elapsed: 0.002 sec - in org.apache.poi.poifs.filesystem.TestDocumentOutputStream
Running org.apache.poi.poifs.filesystem.TestOle10Native
Tests run: 3, Failures: 0, Errors: 0, Skipped: 0, Time elapsed: 1.462 sec - in org.apache.poi.poifs.filesystem.TestOle10Native
Running org.apache.poi.poifs.filesystem.TestPropertySorter
Tests run: 2, Failures: 0, Errors: 0, Skipped: 0, Time elapsed: 0.003 sec - in org.apache.poi.poifs.filesystem.TestPropertySorter
Running org.apache.poi.poifs.filesystem.TestPOIFSStream
Tests run: 33, Failures: 0, Errors: 0, Skipped: 2, Time elapsed: 0.382 sec - in org.apache.poi.poifs.filesystem.TestPOIFSStream
Running org.apache.poi.poifs.filesystem.TestEntryUtils
Tests run: 3, Failures: 0, Errors: 0, Skipped: 0, Time elapsed: 0.006 sec - in org.apache.poi.poifs.filesystem.TestEntryUtils
Running org.apache.poi.poifs.crypt.TestCipherAlgorithm
Tests run: 4, Failures: 0, Errors: 0, Skipped: 0, Time elapsed: 0 sec - in org.apache.poi.poifs.crypt.TestCipherAlgorithm
Running org.apache.poi.poifs.crypt.TestXorEncryption
Tests run: 3, Failures: 0, Errors: 0, Skipped: 1, Time elapsed: 0.002 sec - in org.apache.poi.poifs.crypt.TestXorEncryption
Running org.apache.poi.poifs.crypt.binaryrc4.TestBinaryRC4
Tests run: 3, Failures: 0, Errors: 0, Skipped: 0, Time elapsed: 0.001 sec - in org.apache.poi.poifs.crypt.binaryrc4.TestBinaryRC4
Running org.apache.poi.poifs.crypt.TestBiff8DecryptingStream
Tests run: 4, Failures: 0, Errors: 0, Skipped: 0, Time elapsed: 0.038 sec - in org.apache.poi.poifs.crypt.TestBiff8DecryptingStream
Running org.apache.poi.poifs.property.TestPropertyTable
Tests run: 2, Failures: 0, Errors: 0, Skipped: 0, Time elapsed: 0 sec - in org.apache.poi.poifs.property.TestPropertyTable
Running org.apache.poi.poifs.property.TestDocumentProperty
Tests run: 2, Failures: 0, Errors: 0, Skipped: 0, Time elapsed: 0.001 sec - in org.apache.poi.poifs.property.TestDocumentProperty
Running org.apache.poi.poifs.property.TestRootProperty
Tests run: 3, Failures: 0, Errors: 0, Skipped: 0, Time elapsed: 0 sec - in org.apache.poi.poifs.property.TestRootProperty
Running org.apache.poi.poifs.property.TestPropertyFactory
Tests run: 1, Failures: 0, Errors: 0, Skipped: 0, Time elapsed: 0 sec - in org.apache.poi.poifs.property.TestPropertyFactory
Running org.apache.poi.poifs.property.TestDirectoryProperty
Tests run: 6, Failures: 0, Errors: 0, Skipped: 0, Time elapsed: 0.024 sec - in org.apache.poi.poifs.property.TestDirectoryProperty

Results :

Tests in error: 
  TestHSSFPictureData.testMacPicture:113 » AssumptionViolated got: <false>, expe...
  TestHSSFPictureData.testPictures:88 » AssumptionViolated got: <false>, expecte...

Tests run: 6925, Failures: 0, Errors: 2, Skipped: 810

[INFO] ------------------------------------------------------------------------
[INFO] Reactor Summary for Apache POI - the Java API for Microsoft Documents 4.1.2-SNAPSHOT:
[INFO] 
[INFO] Apache POI - the Java API for Microsoft Documents .. SUCCESS [ 11.916 s]
[INFO] Apache POI Main package ............................ FAILURE [02:20 min]
[INFO] Apache POI Scratchpad package ...................... SKIPPED
[INFO] Apache POI - Openxmlformats Schema package ......... SKIPPED
[INFO] Apache POI - Openxmlformats Encryption Schema package SKIPPED
[INFO] Apache POI - Openxmlformats Security-Schema package  SKIPPED
[INFO] Apache POI OOXML package ........................... SKIPPED
[INFO] Apache POI ExcelAnt package ........................ SKIPPED
[INFO] Apache POI Examples package ........................ SKIPPED
[INFO] ------------------------------------------------------------------------
[INFO] BUILD FAILURE
[INFO] ------------------------------------------------------------------------
[INFO] Total time:  02:32 min
[INFO] Finished at: 2019-12-23T12:09:39Z
[INFO] ------------------------------------------------------------------------
[ERROR] Failed to execute goal org.apache.maven.plugins:maven-surefire-plugin:2.19.1:test (default-test) on project poi-main: There are test failures.
[ERROR] 
[ERROR] Please refer to <https://builds.apache.org/job/POI-DSL-Maven/ws/sonar/main/target/surefire-reports> for the individual test results.
[ERROR] -> [Help 1]
[ERROR] 
[ERROR] To see the full stack trace of the errors, re-run Maven with the -e switch.
[ERROR] Re-run Maven using the -X switch to enable full debug logging.
[ERROR] 
[ERROR] For more information about the errors and possible solutions, please read the following articles:
[ERROR] [Help 1] http://cwiki.apache.org/confluence/display/MAVEN/MojoFailureException
[ERROR] 
[ERROR] After correcting the problems, you can resume the build with the command
[ERROR]   mvn <args> -rf :poi-main
Build step 'Invoke top-level Maven targets' marked build as failure
Recording test results

---------------------------------------------------------------------
To unsubscribe, e-mail: dev-unsubscribe@poi.apache.org
For additional commands, e-mail: dev-help@poi.apache.org


Jenkins build is back to normal : POI-DSL-Maven #987

Posted by Apache Jenkins Server <je...@builds.apache.org>.
See <https://builds.apache.org/job/POI-DSL-Maven/987/display/redirect?page=changes>


---------------------------------------------------------------------
To unsubscribe, e-mail: dev-unsubscribe@poi.apache.org
For additional commands, e-mail: dev-help@poi.apache.org


Build failed in Jenkins: POI-DSL-Maven #986

Posted by Apache Jenkins Server <je...@builds.apache.org>.
See <https://builds.apache.org/job/POI-DSL-Maven/986/display/redirect?page=changes>

Changes:

[kiwiwings] Replace internal GUID class with ClassID


------------------------------------------
[...truncated 87.39 KB...]
Tests run: 1, Failures: 0, Errors: 0, Skipped: 0, Time elapsed: 0.001 sec - in org.apache.poi.ss.formula.functions.TestIPMT
Running org.apache.poi.ss.formula.functions.TestDGetFunctionsFromSpreadsheet
Tests run: 80, Failures: 0, Errors: 0, Skipped: 0, Time elapsed: 0.021 sec - in org.apache.poi.ss.formula.functions.TestDGetFunctionsFromSpreadsheet
Running org.apache.poi.ss.formula.functions.TestRowCol
Tests run: 4, Failures: 0, Errors: 0, Skipped: 0, Time elapsed: 0 sec - in org.apache.poi.ss.formula.functions.TestRowCol
Running org.apache.poi.ss.formula.functions.TestComplexFunctionsFromSpreadsheet
Tests run: 12, Failures: 0, Errors: 0, Skipped: 0, Time elapsed: 0 sec - in org.apache.poi.ss.formula.functions.TestComplexFunctionsFromSpreadsheet
Running org.apache.poi.ss.formula.functions.TestTrendFunctionsFromSpreadsheet
Tests run: 41, Failures: 0, Errors: 0, Skipped: 0, Time elapsed: 0.024 sec - in org.apache.poi.ss.formula.functions.TestTrendFunctionsFromSpreadsheet
Running org.apache.poi.ss.formula.functions.TestGeomean
Tests run: 11, Failures: 0, Errors: 0, Skipped: 0, Time elapsed: 0.022 sec - in org.apache.poi.ss.formula.functions.TestGeomean
Running org.apache.poi.ss.formula.functions.TestMatch
Tests run: 9, Failures: 0, Errors: 0, Skipped: 0, Time elapsed: 0.001 sec - in org.apache.poi.ss.formula.functions.TestMatch
Running org.apache.poi.ss.formula.functions.TestDec2Bin
Tests run: 15, Failures: 0, Errors: 0, Skipped: 0, Time elapsed: 0.025 sec - in org.apache.poi.ss.formula.functions.TestDec2Bin
Running org.apache.poi.ss.formula.TestCellCacheEntry
Tests run: 1, Failures: 0, Errors: 0, Skipped: 0, Time elapsed: 0 sec - in org.apache.poi.ss.formula.TestCellCacheEntry
Running org.apache.poi.ss.formula.TestFunctionRegistry
Tests run: 2, Failures: 0, Errors: 0, Skipped: 0, Time elapsed: 0 sec - in org.apache.poi.ss.formula.TestFunctionRegistry
Running org.apache.poi.ss.TestSpreadsheetVersion
Tests run: 2, Failures: 0, Errors: 0, Skipped: 0, Time elapsed: 0.001 sec - in org.apache.poi.ss.TestSpreadsheetVersion
Running org.apache.poi.ss.util.TestCellRangeUtil
Tests run: 1, Failures: 0, Errors: 0, Skipped: 0, Time elapsed: 0.001 sec - in org.apache.poi.ss.util.TestCellRangeUtil
Running org.apache.poi.ss.util.TestCellAddress
Tests run: 6, Failures: 0, Errors: 0, Skipped: 0, Time elapsed: 0 sec - in org.apache.poi.ss.util.TestCellAddress
Running org.apache.poi.ss.util.TestSheetUtil
Tests run: 7, Failures: 0, Errors: 0, Skipped: 0, Time elapsed: 0.002 sec - in org.apache.poi.ss.util.TestSheetUtil
Running org.apache.poi.ss.util.TestDateFormatConverter
Tests run: 4, Failures: 0, Errors: 0, Skipped: 0, Time elapsed: 0.822 sec - in org.apache.poi.ss.util.TestDateFormatConverter
Running org.apache.poi.ss.util.TestPropertyTemplate
Tests run: 8, Failures: 0, Errors: 0, Skipped: 0, Time elapsed: 0.028 sec - in org.apache.poi.ss.util.TestPropertyTemplate
Running org.apache.poi.ss.util.TestSheetBuilder
Tests run: 3, Failures: 0, Errors: 0, Skipped: 0, Time elapsed: 0.001 sec - in org.apache.poi.ss.util.TestSheetBuilder
Running org.apache.poi.ss.util.TestNumberComparer
Tests run: 4, Failures: 0, Errors: 0, Skipped: 0, Time elapsed: 0.056 sec - in org.apache.poi.ss.util.TestNumberComparer
Running org.apache.poi.ss.util.TestAreaReference
Tests run: 3, Failures: 0, Errors: 0, Skipped: 0, Time elapsed: 0 sec - in org.apache.poi.ss.util.TestAreaReference
Running org.apache.poi.ss.util.TestNumberToTextConverter
Tests run: 2, Failures: 0, Errors: 0, Skipped: 0, Time elapsed: 0.006 sec - in org.apache.poi.ss.util.TestNumberToTextConverter
Running org.apache.poi.ss.util.TestWorkbookUtil
Tests run: 1, Failures: 0, Errors: 0, Skipped: 0, Time elapsed: 0 sec - in org.apache.poi.ss.util.TestWorkbookUtil
Running org.apache.poi.ss.util.TestHSSFCellUtil
Tests run: 14, Failures: 0, Errors: 0, Skipped: 0, Time elapsed: 0.006 sec - in org.apache.poi.ss.util.TestHSSFCellUtil
Running org.apache.poi.ss.util.TestExpandedDouble
Tests run: 3, Failures: 0, Errors: 0, Skipped: 0, Time elapsed: 0 sec - in org.apache.poi.ss.util.TestExpandedDouble
Running org.apache.poi.ss.util.TestCellReference
Tests run: 27, Failures: 0, Errors: 0, Skipped: 0, Time elapsed: 0.435 sec - in org.apache.poi.ss.util.TestCellReference
Running org.apache.poi.ss.util.TestCellRangeAddress
Tests run: 14, Failures: 0, Errors: 0, Skipped: 0, Time elapsed: 0.001 sec - in org.apache.poi.ss.util.TestCellRangeAddress
Running org.apache.poi.ss.util.cellwalk.TestCellWalk
Tests run: 1, Failures: 0, Errors: 0, Skipped: 0, Time elapsed: 0.001 sec - in org.apache.poi.ss.util.cellwalk.TestCellWalk
Running org.apache.poi.ss.util.TestRegionUtil
Tests run: 10, Failures: 0, Errors: 0, Skipped: 0, Time elapsed: 0.01 sec - in org.apache.poi.ss.util.TestRegionUtil
Running org.apache.poi.ss.format.TestCellFormatResult
Tests run: 1, Failures: 0, Errors: 0, Skipped: 0, Time elapsed: 0 sec - in org.apache.poi.ss.format.TestCellFormatResult
Running org.apache.poi.ss.format.TestCellFormatCondition
Tests run: 1, Failures: 0, Errors: 0, Skipped: 0, Time elapsed: 0 sec - in org.apache.poi.ss.format.TestCellFormatCondition
Running org.apache.poi.ss.format.TestCellFormat
Tests run: 40, Failures: 0, Errors: 0, Skipped: 0, Time elapsed: 0.069 sec - in org.apache.poi.ss.format.TestCellFormat
Running org.apache.poi.ss.usermodel.TestFractionFormat
Tests run: 5, Failures: 0, Errors: 0, Skipped: 1, Time elapsed: 0.219 sec - in org.apache.poi.ss.usermodel.TestFractionFormat
Running org.apache.poi.ss.usermodel.charts.TestDataSources
Tests run: 6, Failures: 0, Errors: 0, Skipped: 0, Time elapsed: 0.004 sec - in org.apache.poi.ss.usermodel.charts.TestDataSources
Running org.apache.poi.ss.usermodel.TestHSSFBorderStyle
Tests run: 1, Failures: 0, Errors: 0, Skipped: 0, Time elapsed: 0 sec - in org.apache.poi.ss.usermodel.TestHSSFBorderStyle
Running org.apache.poi.ss.usermodel.TestExcelStyleDateFormatter
Tests run: 4, Failures: 0, Errors: 0, Skipped: 0, Time elapsed: 0.008 sec - in org.apache.poi.ss.usermodel.TestExcelStyleDateFormatter
Running org.apache.poi.ss.usermodel.TestIndexedColors
Tests run: 3, Failures: 0, Errors: 0, Skipped: 0, Time elapsed: 0 sec - in org.apache.poi.ss.usermodel.TestIndexedColors
Running org.apache.poi.ss.usermodel.TestDateUtil
Tests run: 26, Failures: 0, Errors: 0, Skipped: 0, Time elapsed: 0.02 sec - in org.apache.poi.ss.usermodel.TestDateUtil
Running org.apache.poi.ss.usermodel.TestDataFormatter
Tests run: 36, Failures: 0, Errors: 0, Skipped: 1, Time elapsed: 0.229 sec - in org.apache.poi.ss.usermodel.TestDataFormatter
Running org.apache.poi.util.TestStringUtil
Tests run: 8, Failures: 0, Errors: 0, Skipped: 0, Time elapsed: 0 sec - in org.apache.poi.util.TestStringUtil
Running org.apache.poi.util.TestShortField
Tests run: 5, Failures: 0, Errors: 0, Skipped: 0, Time elapsed: 0 sec - in org.apache.poi.util.TestShortField
Running org.apache.poi.util.TestLongField
Tests run: 5, Failures: 0, Errors: 0, Skipped: 0, Time elapsed: 0 sec - in org.apache.poi.util.TestLongField
Running org.apache.poi.util.TestStringCodepointsIterable
Tests run: 1, Failures: 0, Errors: 0, Skipped: 0, Time elapsed: 0 sec - in org.apache.poi.util.TestStringCodepointsIterable
Running org.apache.poi.util.TestPOILogger
Tests run: 1, Failures: 0, Errors: 0, Skipped: 0, Time elapsed: 0 sec - in org.apache.poi.util.TestPOILogger
Running org.apache.poi.util.TestLocaleUtil
Tests run: 3, Failures: 0, Errors: 0, Skipped: 0, Time elapsed: 0 sec - in org.apache.poi.util.TestLocaleUtil
Running org.apache.poi.util.TestIntegerField
Tests run: 5, Failures: 0, Errors: 0, Skipped: 0, Time elapsed: 0 sec - in org.apache.poi.util.TestIntegerField
Running org.apache.poi.util.TestLittleEndianStreams
Tests run: 5, Failures: 0, Errors: 0, Skipped: 0, Time elapsed: 0 sec - in org.apache.poi.util.TestLittleEndianStreams
Running org.apache.poi.util.TestRLEDecompressingInputStream
Tests run: 4, Failures: 0, Errors: 0, Skipped: 0, Time elapsed: 0 sec - in org.apache.poi.util.TestRLEDecompressingInputStream
Running org.apache.poi.util.TestHexDump
Tests run: 10, Failures: 0, Errors: 0, Skipped: 0, Time elapsed: 0.009 sec - in org.apache.poi.util.TestHexDump
Running org.apache.poi.util.TestTempFile
Tests run: 4, Failures: 0, Errors: 0, Skipped: 0, Time elapsed: 0.004 sec - in org.apache.poi.util.TestTempFile
Running org.apache.poi.util.TestLittleEndianCP950Reader
Tests run: 1, Failures: 0, Errors: 0, Skipped: 0, Time elapsed: 0.001 sec - in org.apache.poi.util.TestLittleEndianCP950Reader
Running org.apache.poi.util.TestBitField
Tests run: 16, Failures: 0, Errors: 0, Skipped: 0, Time elapsed: 0.001 sec - in org.apache.poi.util.TestBitField
Running org.apache.poi.util.TestByteField
Tests run: 5, Failures: 0, Errors: 0, Skipped: 0, Time elapsed: 0 sec - in org.apache.poi.util.TestByteField
Running org.apache.poi.util.TestArrayUtil
Tests run: 2, Failures: 0, Errors: 0, Skipped: 0, Time elapsed: 0.011 sec - in org.apache.poi.util.TestArrayUtil
Running org.apache.poi.util.TestIOUtils
Tests run: 36, Failures: 0, Errors: 0, Skipped: 0, Time elapsed: 0.006 sec - in org.apache.poi.util.TestIOUtils
Running org.apache.poi.util.TestIntList
Tests run: 19, Failures: 0, Errors: 0, Skipped: 0, Time elapsed: 0.05 sec - in org.apache.poi.util.TestIntList
Running org.apache.poi.util.TestPOILogFactory
Tests run: 1, Failures: 0, Errors: 0, Skipped: 0, Time elapsed: 0 sec - in org.apache.poi.util.TestPOILogFactory
Running org.apache.poi.util.TestXMLHelper
Tests run: 8, Failures: 0, Errors: 0, Skipped: 0, Time elapsed: 0.275 sec - in org.apache.poi.util.TestXMLHelper
Running org.apache.poi.util.TestLittleEndian
Tests run: 15, Failures: 0, Errors: 0, Skipped: 0, Time elapsed: 0 sec - in org.apache.poi.util.TestLittleEndian
Running org.apache.poi.TestPOIDocumentMain
Tests run: 6, Failures: 0, Errors: 0, Skipped: 0, Time elapsed: 0.012 sec - in org.apache.poi.TestPOIDocumentMain
Running org.apache.poi.hpsf.TestVariantSupport
Tests run: 2, Failures: 0, Errors: 0, Skipped: 0, Time elapsed: 0.009 sec - in org.apache.poi.hpsf.TestVariantSupport
Running org.apache.poi.hpsf.extractor.TestHPSFPropertiesExtractor
Tests run: 8, Failures: 0, Errors: 0, Skipped: 0, Time elapsed: 0.028 sec - in org.apache.poi.hpsf.extractor.TestHPSFPropertiesExtractor
Running org.apache.poi.hpsf.basic.TestBasic
Tests run: 6, Failures: 0, Errors: 0, Skipped: 0, Time elapsed: 0.016 sec - in org.apache.poi.hpsf.basic.TestBasic
Running org.apache.poi.hpsf.basic.TestEmptyProperties
Tests run: 3, Failures: 0, Errors: 0, Skipped: 0, Time elapsed: 0.006 sec - in org.apache.poi.hpsf.basic.TestEmptyProperties
Running org.apache.poi.hpsf.basic.TestMetaDataIPI
Tests run: 7, Failures: 0, Errors: 0, Skipped: 0, Time elapsed: 0.351 sec - in org.apache.poi.hpsf.basic.TestMetaDataIPI
Running org.apache.poi.hpsf.basic.TestHPSFBugs
Tests run: 4, Failures: 0, Errors: 0, Skipped: 0, Time elapsed: 0.011 sec - in org.apache.poi.hpsf.basic.TestHPSFBugs
Running org.apache.poi.hpsf.basic.TestWrite
Tests run: 10, Failures: 0, Errors: 0, Skipped: 0, Time elapsed: 0.052 sec - in org.apache.poi.hpsf.basic.TestWrite
Running org.apache.poi.hpsf.basic.TestUnicode
Tests run: 1, Failures: 0, Errors: 0, Skipped: 0, Time elapsed: 0 sec - in org.apache.poi.hpsf.basic.TestUnicode
Running org.apache.poi.hpsf.basic.TestWriteWellKnown
Tests run: 3, Failures: 0, Errors: 0, Skipped: 0, Time elapsed: 0.008 sec - in org.apache.poi.hpsf.basic.TestWriteWellKnown
Running org.apache.poi.hpsf.basic.TestReadAllFiles
Tests run: 88, Failures: 0, Errors: 0, Skipped: 0, Time elapsed: 0.398 sec - in org.apache.poi.hpsf.basic.TestReadAllFiles
Running org.apache.poi.hpsf.basic.TestClassID
Tests run: 3, Failures: 0, Errors: 0, Skipped: 0, Time elapsed: 0 sec - in org.apache.poi.hpsf.basic.TestClassID
Running org.apache.poi.TestPOITestCase
Tests run: 10, Failures: 0, Errors: 0, Skipped: 3, Time elapsed: 0 sec - in org.apache.poi.TestPOITestCase
Running org.apache.poi.sl.draw.geom.TestPresetGeometries
Tests run: 2, Failures: 0, Errors: 0, Skipped: 1, Time elapsed: 0.824 sec - in org.apache.poi.sl.draw.geom.TestPresetGeometries
Running org.apache.poi.poifs.storage.TestBATBlock
Tests run: 6, Failures: 0, Errors: 0, Skipped: 0, Time elapsed: 0 sec - in org.apache.poi.poifs.storage.TestBATBlock
Running org.apache.poi.poifs.storage.TestHeaderBlockReading
Tests run: 1, Failures: 0, Errors: 0, Skipped: 0, Time elapsed: 0 sec - in org.apache.poi.poifs.storage.TestHeaderBlockReading
Running org.apache.poi.poifs.nio.TestDataSource
Tests run: 4, Failures: 0, Errors: 0, Skipped: 0, Time elapsed: 0.003 sec - in org.apache.poi.poifs.nio.TestDataSource
Running org.apache.poi.poifs.macros.TestVBAMacroReader
Tests run: 27, Failures: 0, Errors: 0, Skipped: 6, Time elapsed: 0.153 sec - in org.apache.poi.poifs.macros.TestVBAMacroReader
Running org.apache.poi.poifs.eventfilesystem.TestPOIFSReaderRegistry
Tests run: 2, Failures: 0, Errors: 0, Skipped: 0, Time elapsed: 0 sec - in org.apache.poi.poifs.eventfilesystem.TestPOIFSReaderRegistry
Running org.apache.poi.poifs.dev.TestPOIFSDump
Tests run: 4, Failures: 0, Errors: 0, Skipped: 1, Time elapsed: 0.146 sec - in org.apache.poi.poifs.dev.TestPOIFSDump
Running org.apache.poi.poifs.filesystem.TestPOIFSDocumentPath
Tests run: 4, Failures: 0, Errors: 0, Skipped: 0, Time elapsed: 0 sec - in org.apache.poi.poifs.filesystem.TestPOIFSDocumentPath
Running org.apache.poi.poifs.filesystem.TestDocument
Tests run: 1, Failures: 0, Errors: 0, Skipped: 0, Time elapsed: 0.006 sec - in org.apache.poi.poifs.filesystem.TestDocument
Running org.apache.poi.poifs.filesystem.TestPOIFSFileSystem
Tests run: 6, Failures: 0, Errors: 0, Skipped: 0, Time elapsed: 0.198 sec - in org.apache.poi.poifs.filesystem.TestPOIFSFileSystem
Running org.apache.poi.poifs.filesystem.TestFileMagic
Tests run: 9, Failures: 0, Errors: 0, Skipped: 0, Time elapsed: 0.014 sec - in org.apache.poi.poifs.filesystem.TestFileMagic
Running org.apache.poi.poifs.filesystem.TestDocumentInputStream
Tests run: 8, Failures: 0, Errors: 0, Skipped: 0, Time elapsed: 0.243 sec - in org.apache.poi.poifs.filesystem.TestDocumentInputStream
Running org.apache.poi.poifs.filesystem.TestNotOLE2Exception
Tests run: 4, Failures: 0, Errors: 0, Skipped: 0, Time elapsed: 0.001 sec - in org.apache.poi.poifs.filesystem.TestNotOLE2Exception
Running org.apache.poi.poifs.filesystem.TestFilteringDirectoryNode
Tests run: 4, Failures: 0, Errors: 0, Skipped: 0, Time elapsed: 0 sec - in org.apache.poi.poifs.filesystem.TestFilteringDirectoryNode
Running org.apache.poi.poifs.filesystem.TestDocumentDescriptor
Tests run: 1, Failures: 0, Errors: 0, Skipped: 0, Time elapsed: 0 sec - in org.apache.poi.poifs.filesystem.TestDocumentDescriptor
Running org.apache.poi.poifs.filesystem.TestPOIFSMiniStore
Tests run: 7, Failures: 0, Errors: 0, Skipped: 0, Time elapsed: 0.004 sec - in org.apache.poi.poifs.filesystem.TestPOIFSMiniStore
Running org.apache.poi.poifs.filesystem.TestOfficeXMLException
Tests run: 5, Failures: 0, Errors: 0, Skipped: 0, Time elapsed: 0 sec - in org.apache.poi.poifs.filesystem.TestOfficeXMLException
Running org.apache.poi.poifs.filesystem.TestFileSystemBugs
Tests run: 3, Failures: 0, Errors: 0, Skipped: 0, Time elapsed: 0.006 sec - in org.apache.poi.poifs.filesystem.TestFileSystemBugs
Running org.apache.poi.poifs.filesystem.TestDirectoryNode
Tests run: 4, Failures: 0, Errors: 0, Skipped: 0, Time elapsed: 0 sec - in org.apache.poi.poifs.filesystem.TestDirectoryNode
Running org.apache.poi.poifs.filesystem.TestEmptyDocument
Tests run: 5, Failures: 0, Errors: 0, Skipped: 0, Time elapsed: 0 sec - in org.apache.poi.poifs.filesystem.TestEmptyDocument
Running org.apache.poi.poifs.filesystem.TestDocumentOutputStream
Tests run: 3, Failures: 0, Errors: 0, Skipped: 0, Time elapsed: 0.001 sec - in org.apache.poi.poifs.filesystem.TestDocumentOutputStream
Running org.apache.poi.poifs.filesystem.TestOle10Native
Tests run: 3, Failures: 0, Errors: 0, Skipped: 0, Time elapsed: 0.123 sec - in org.apache.poi.poifs.filesystem.TestOle10Native
Running org.apache.poi.poifs.filesystem.TestPropertySorter
Tests run: 2, Failures: 0, Errors: 0, Skipped: 0, Time elapsed: 0.001 sec - in org.apache.poi.poifs.filesystem.TestPropertySorter
Running org.apache.poi.poifs.filesystem.TestPOIFSStream
Tests run: 33, Failures: 0, Errors: 0, Skipped: 2, Time elapsed: 0.352 sec - in org.apache.poi.poifs.filesystem.TestPOIFSStream
Running org.apache.poi.poifs.filesystem.TestEntryUtils
Tests run: 3, Failures: 0, Errors: 0, Skipped: 0, Time elapsed: 0.005 sec - in org.apache.poi.poifs.filesystem.TestEntryUtils
Running org.apache.poi.poifs.crypt.TestCipherAlgorithm
Tests run: 4, Failures: 0, Errors: 0, Skipped: 0, Time elapsed: 0 sec - in org.apache.poi.poifs.crypt.TestCipherAlgorithm
Running org.apache.poi.poifs.crypt.TestXorEncryption
Tests run: 3, Failures: 0, Errors: 0, Skipped: 1, Time elapsed: 0.001 sec - in org.apache.poi.poifs.crypt.TestXorEncryption
Running org.apache.poi.poifs.crypt.binaryrc4.TestBinaryRC4
Tests run: 3, Failures: 0, Errors: 0, Skipped: 0, Time elapsed: 0.001 sec - in org.apache.poi.poifs.crypt.binaryrc4.TestBinaryRC4
Running org.apache.poi.poifs.crypt.TestBiff8DecryptingStream
Tests run: 4, Failures: 0, Errors: 0, Skipped: 0, Time elapsed: 0.034 sec - in org.apache.poi.poifs.crypt.TestBiff8DecryptingStream
Running org.apache.poi.poifs.property.TestPropertyTable
Tests run: 2, Failures: 0, Errors: 0, Skipped: 0, Time elapsed: 0.001 sec - in org.apache.poi.poifs.property.TestPropertyTable
Running org.apache.poi.poifs.property.TestDocumentProperty
Tests run: 2, Failures: 0, Errors: 0, Skipped: 0, Time elapsed: 0 sec - in org.apache.poi.poifs.property.TestDocumentProperty
Running org.apache.poi.poifs.property.TestRootProperty
Tests run: 3, Failures: 0, Errors: 0, Skipped: 0, Time elapsed: 0 sec - in org.apache.poi.poifs.property.TestRootProperty
Running org.apache.poi.poifs.property.TestPropertyFactory
Tests run: 1, Failures: 0, Errors: 0, Skipped: 0, Time elapsed: 0 sec - in org.apache.poi.poifs.property.TestPropertyFactory
Running org.apache.poi.poifs.property.TestDirectoryProperty
Tests run: 6, Failures: 0, Errors: 0, Skipped: 0, Time elapsed: 0.016 sec - in org.apache.poi.poifs.property.TestDirectoryProperty

Results :

Tests in error: 
  TestHSSFPictureData.testMacPicture:113 » AssumptionViolated got: <false>, expe...
  TestHSSFPictureData.testPictures:88 » AssumptionViolated got: <false>, expecte...

Tests run: 6925, Failures: 0, Errors: 2, Skipped: 810

[INFO] ------------------------------------------------------------------------
[INFO] Reactor Summary for Apache POI - the Java API for Microsoft Documents 4.1.2-SNAPSHOT:
[INFO] 
[INFO] Apache POI - the Java API for Microsoft Documents .. SUCCESS [  0.779 s]
[INFO] Apache POI Main package ............................ FAILURE [01:36 min]
[INFO] Apache POI Scratchpad package ...................... SKIPPED
[INFO] Apache POI - Openxmlformats Schema package ......... SKIPPED
[INFO] Apache POI - Openxmlformats Encryption Schema package SKIPPED
[INFO] Apache POI - Openxmlformats Security-Schema package  SKIPPED
[INFO] Apache POI OOXML package ........................... SKIPPED
[INFO] Apache POI ExcelAnt package ........................ SKIPPED
[INFO] Apache POI Examples package ........................ SKIPPED
[INFO] ------------------------------------------------------------------------
[INFO] BUILD FAILURE
[INFO] ------------------------------------------------------------------------
[INFO] Total time:  01:37 min
[INFO] Finished at: 2019-12-24T20:06:07Z
[INFO] ------------------------------------------------------------------------
[ERROR] Failed to execute goal org.apache.maven.plugins:maven-surefire-plugin:2.19.1:test (default-test) on project poi-main: There are test failures.
[ERROR] 
[ERROR] Please refer to <https://builds.apache.org/job/POI-DSL-Maven/ws/sonar/main/target/surefire-reports> for the individual test results.
[ERROR] -> [Help 1]
[ERROR] 
[ERROR] To see the full stack trace of the errors, re-run Maven with the -e switch.
[ERROR] Re-run Maven using the -X switch to enable full debug logging.
[ERROR] 
[ERROR] For more information about the errors and possible solutions, please read the following articles:
[ERROR] [Help 1] http://cwiki.apache.org/confluence/display/MAVEN/MojoFailureException
[ERROR] 
[ERROR] After correcting the problems, you can resume the build with the command
[ERROR]   mvn <args> -rf :poi-main
Build step 'Invoke top-level Maven targets' marked build as failure
Recording test results

---------------------------------------------------------------------
To unsubscribe, e-mail: dev-unsubscribe@poi.apache.org
For additional commands, e-mail: dev-help@poi.apache.org


Build failed in Jenkins: POI-DSL-Maven #985

Posted by Apache Jenkins Server <je...@builds.apache.org>.
See <https://builds.apache.org/job/POI-DSL-Maven/985/display/redirect?page=changes>

Changes:

[kiwiwings] #64004 - Replace clone() with copy constructor - mainly HWPF classes


------------------------------------------
[...truncated 91.23 KB...]
Tests run: 1, Failures: 0, Errors: 0, Skipped: 0, Time elapsed: 0.001 sec - in org.apache.poi.ss.formula.functions.TestIPMT
Running org.apache.poi.ss.formula.functions.TestDGetFunctionsFromSpreadsheet
Tests run: 80, Failures: 0, Errors: 0, Skipped: 0, Time elapsed: 0.019 sec - in org.apache.poi.ss.formula.functions.TestDGetFunctionsFromSpreadsheet
Running org.apache.poi.ss.formula.functions.TestRowCol
Tests run: 4, Failures: 0, Errors: 0, Skipped: 0, Time elapsed: 0 sec - in org.apache.poi.ss.formula.functions.TestRowCol
Running org.apache.poi.ss.formula.functions.TestComplexFunctionsFromSpreadsheet
Tests run: 12, Failures: 0, Errors: 0, Skipped: 0, Time elapsed: 0 sec - in org.apache.poi.ss.formula.functions.TestComplexFunctionsFromSpreadsheet
Running org.apache.poi.ss.formula.functions.TestTrendFunctionsFromSpreadsheet
Tests run: 41, Failures: 0, Errors: 0, Skipped: 0, Time elapsed: 0.022 sec - in org.apache.poi.ss.formula.functions.TestTrendFunctionsFromSpreadsheet
Running org.apache.poi.ss.formula.functions.TestGeomean
Tests run: 11, Failures: 0, Errors: 0, Skipped: 0, Time elapsed: 0.023 sec - in org.apache.poi.ss.formula.functions.TestGeomean
Running org.apache.poi.ss.formula.functions.TestMatch
Tests run: 9, Failures: 0, Errors: 0, Skipped: 0, Time elapsed: 0.001 sec - in org.apache.poi.ss.formula.functions.TestMatch
Running org.apache.poi.ss.formula.functions.TestDec2Bin
Tests run: 15, Failures: 0, Errors: 0, Skipped: 0, Time elapsed: 0.029 sec - in org.apache.poi.ss.formula.functions.TestDec2Bin
Running org.apache.poi.ss.formula.TestCellCacheEntry
Tests run: 1, Failures: 0, Errors: 0, Skipped: 0, Time elapsed: 0 sec - in org.apache.poi.ss.formula.TestCellCacheEntry
Running org.apache.poi.ss.formula.TestFunctionRegistry
Tests run: 2, Failures: 0, Errors: 0, Skipped: 0, Time elapsed: 0 sec - in org.apache.poi.ss.formula.TestFunctionRegistry
Running org.apache.poi.ss.TestSpreadsheetVersion
Tests run: 2, Failures: 0, Errors: 0, Skipped: 0, Time elapsed: 0 sec - in org.apache.poi.ss.TestSpreadsheetVersion
Running org.apache.poi.ss.util.TestCellRangeUtil
Tests run: 1, Failures: 0, Errors: 0, Skipped: 0, Time elapsed: 0 sec - in org.apache.poi.ss.util.TestCellRangeUtil
Running org.apache.poi.ss.util.TestCellAddress
Tests run: 6, Failures: 0, Errors: 0, Skipped: 0, Time elapsed: 0 sec - in org.apache.poi.ss.util.TestCellAddress
Running org.apache.poi.ss.util.TestSheetUtil
Tests run: 7, Failures: 0, Errors: 0, Skipped: 0, Time elapsed: 0 sec - in org.apache.poi.ss.util.TestSheetUtil
Running org.apache.poi.ss.util.TestDateFormatConverter
Tests run: 4, Failures: 0, Errors: 0, Skipped: 0, Time elapsed: 0.805 sec - in org.apache.poi.ss.util.TestDateFormatConverter
Running org.apache.poi.ss.util.TestPropertyTemplate
Tests run: 8, Failures: 0, Errors: 0, Skipped: 0, Time elapsed: 0.025 sec - in org.apache.poi.ss.util.TestPropertyTemplate
Running org.apache.poi.ss.util.TestSheetBuilder
Tests run: 3, Failures: 0, Errors: 0, Skipped: 0, Time elapsed: 0 sec - in org.apache.poi.ss.util.TestSheetBuilder
Running org.apache.poi.ss.util.TestNumberComparer
Tests run: 4, Failures: 0, Errors: 0, Skipped: 0, Time elapsed: 0.048 sec - in org.apache.poi.ss.util.TestNumberComparer
Running org.apache.poi.ss.util.TestAreaReference
Tests run: 3, Failures: 0, Errors: 0, Skipped: 0, Time elapsed: 0 sec - in org.apache.poi.ss.util.TestAreaReference
Running org.apache.poi.ss.util.TestNumberToTextConverter
Tests run: 2, Failures: 0, Errors: 0, Skipped: 0, Time elapsed: 0.006 sec - in org.apache.poi.ss.util.TestNumberToTextConverter
Running org.apache.poi.ss.util.TestWorkbookUtil
Tests run: 1, Failures: 0, Errors: 0, Skipped: 0, Time elapsed: 0.001 sec - in org.apache.poi.ss.util.TestWorkbookUtil
Running org.apache.poi.ss.util.TestHSSFCellUtil
Tests run: 14, Failures: 0, Errors: 0, Skipped: 0, Time elapsed: 0.009 sec - in org.apache.poi.ss.util.TestHSSFCellUtil
Running org.apache.poi.ss.util.TestExpandedDouble
Tests run: 3, Failures: 0, Errors: 0, Skipped: 0, Time elapsed: 0 sec - in org.apache.poi.ss.util.TestExpandedDouble
Running org.apache.poi.ss.util.TestCellReference
Tests run: 27, Failures: 0, Errors: 0, Skipped: 0, Time elapsed: 0.428 sec - in org.apache.poi.ss.util.TestCellReference
Running org.apache.poi.ss.util.TestCellRangeAddress
Tests run: 14, Failures: 0, Errors: 0, Skipped: 0, Time elapsed: 0.001 sec - in org.apache.poi.ss.util.TestCellRangeAddress
Running org.apache.poi.ss.util.cellwalk.TestCellWalk
Tests run: 1, Failures: 0, Errors: 0, Skipped: 0, Time elapsed: 0.001 sec - in org.apache.poi.ss.util.cellwalk.TestCellWalk
Running org.apache.poi.ss.util.TestRegionUtil
Tests run: 10, Failures: 0, Errors: 0, Skipped: 0, Time elapsed: 0.011 sec - in org.apache.poi.ss.util.TestRegionUtil
Running org.apache.poi.ss.format.TestCellFormatResult
Tests run: 1, Failures: 0, Errors: 0, Skipped: 0, Time elapsed: 0 sec - in org.apache.poi.ss.format.TestCellFormatResult
Running org.apache.poi.ss.format.TestCellFormatCondition
Tests run: 1, Failures: 0, Errors: 0, Skipped: 0, Time elapsed: 0 sec - in org.apache.poi.ss.format.TestCellFormatCondition
Running org.apache.poi.ss.format.TestCellFormat
Tests run: 40, Failures: 0, Errors: 0, Skipped: 0, Time elapsed: 0.065 sec - in org.apache.poi.ss.format.TestCellFormat
Running org.apache.poi.ss.usermodel.TestFractionFormat
Tests run: 5, Failures: 0, Errors: 0, Skipped: 1, Time elapsed: 0.219 sec - in org.apache.poi.ss.usermodel.TestFractionFormat
Running org.apache.poi.ss.usermodel.charts.TestDataSources
Tests run: 6, Failures: 0, Errors: 0, Skipped: 0, Time elapsed: 0.005 sec - in org.apache.poi.ss.usermodel.charts.TestDataSources
Running org.apache.poi.ss.usermodel.TestHSSFBorderStyle
Tests run: 1, Failures: 0, Errors: 0, Skipped: 0, Time elapsed: 0 sec - in org.apache.poi.ss.usermodel.TestHSSFBorderStyle
Running org.apache.poi.ss.usermodel.TestExcelStyleDateFormatter
Tests run: 4, Failures: 0, Errors: 0, Skipped: 0, Time elapsed: 0.01 sec - in org.apache.poi.ss.usermodel.TestExcelStyleDateFormatter
Running org.apache.poi.ss.usermodel.TestIndexedColors
Tests run: 3, Failures: 0, Errors: 0, Skipped: 0, Time elapsed: 0 sec - in org.apache.poi.ss.usermodel.TestIndexedColors
Running org.apache.poi.ss.usermodel.TestDateUtil
Tests run: 26, Failures: 0, Errors: 0, Skipped: 0, Time elapsed: 0.017 sec - in org.apache.poi.ss.usermodel.TestDateUtil
Running org.apache.poi.ss.usermodel.TestDataFormatter
Tests run: 36, Failures: 0, Errors: 0, Skipped: 1, Time elapsed: 0.309 sec - in org.apache.poi.ss.usermodel.TestDataFormatter
Running org.apache.poi.util.TestStringUtil
Tests run: 8, Failures: 0, Errors: 0, Skipped: 0, Time elapsed: 0 sec - in org.apache.poi.util.TestStringUtil
Running org.apache.poi.util.TestShortField
Tests run: 5, Failures: 0, Errors: 0, Skipped: 0, Time elapsed: 0 sec - in org.apache.poi.util.TestShortField
Running org.apache.poi.util.TestLongField
Tests run: 5, Failures: 0, Errors: 0, Skipped: 0, Time elapsed: 0 sec - in org.apache.poi.util.TestLongField
Running org.apache.poi.util.TestStringCodepointsIterable
Tests run: 1, Failures: 0, Errors: 0, Skipped: 0, Time elapsed: 0 sec - in org.apache.poi.util.TestStringCodepointsIterable
Running org.apache.poi.util.TestPOILogger
Tests run: 1, Failures: 0, Errors: 0, Skipped: 0, Time elapsed: 0 sec - in org.apache.poi.util.TestPOILogger
Running org.apache.poi.util.TestLocaleUtil
Tests run: 3, Failures: 0, Errors: 0, Skipped: 0, Time elapsed: 0 sec - in org.apache.poi.util.TestLocaleUtil
Running org.apache.poi.util.TestIntegerField
Tests run: 5, Failures: 0, Errors: 0, Skipped: 0, Time elapsed: 0.001 sec - in org.apache.poi.util.TestIntegerField
Running org.apache.poi.util.TestLittleEndianStreams
Tests run: 5, Failures: 0, Errors: 0, Skipped: 0, Time elapsed: 0 sec - in org.apache.poi.util.TestLittleEndianStreams
Running org.apache.poi.util.TestRLEDecompressingInputStream
Tests run: 4, Failures: 0, Errors: 0, Skipped: 0, Time elapsed: 0 sec - in org.apache.poi.util.TestRLEDecompressingInputStream
Running org.apache.poi.util.TestHexDump
Tests run: 10, Failures: 0, Errors: 0, Skipped: 0, Time elapsed: 0.008 sec - in org.apache.poi.util.TestHexDump
Running org.apache.poi.util.TestTempFile
Tests run: 4, Failures: 0, Errors: 0, Skipped: 0, Time elapsed: 0.018 sec - in org.apache.poi.util.TestTempFile
Running org.apache.poi.util.TestLittleEndianCP950Reader
Tests run: 1, Failures: 0, Errors: 0, Skipped: 0, Time elapsed: 0 sec - in org.apache.poi.util.TestLittleEndianCP950Reader
Running org.apache.poi.util.TestBitField
Tests run: 16, Failures: 0, Errors: 0, Skipped: 0, Time elapsed: 0 sec - in org.apache.poi.util.TestBitField
Running org.apache.poi.util.TestByteField
Tests run: 5, Failures: 0, Errors: 0, Skipped: 0, Time elapsed: 0 sec - in org.apache.poi.util.TestByteField
Running org.apache.poi.util.TestArrayUtil
Tests run: 2, Failures: 0, Errors: 0, Skipped: 0, Time elapsed: 0.005 sec - in org.apache.poi.util.TestArrayUtil
Running org.apache.poi.util.TestIOUtils
Tests run: 36, Failures: 0, Errors: 0, Skipped: 0, Time elapsed: 0.005 sec - in org.apache.poi.util.TestIOUtils
Running org.apache.poi.util.TestIntList
Tests run: 19, Failures: 0, Errors: 0, Skipped: 0, Time elapsed: 0.066 sec - in org.apache.poi.util.TestIntList
Running org.apache.poi.util.TestPOILogFactory
Tests run: 1, Failures: 0, Errors: 0, Skipped: 0, Time elapsed: 0 sec - in org.apache.poi.util.TestPOILogFactory
Running org.apache.poi.util.TestXMLHelper
Tests run: 8, Failures: 0, Errors: 0, Skipped: 0, Time elapsed: 0.29 sec - in org.apache.poi.util.TestXMLHelper
Running org.apache.poi.util.TestLittleEndian
Tests run: 15, Failures: 0, Errors: 0, Skipped: 0, Time elapsed: 0 sec - in org.apache.poi.util.TestLittleEndian
Running org.apache.poi.TestPOIDocumentMain
Tests run: 6, Failures: 0, Errors: 0, Skipped: 0, Time elapsed: 0.008 sec - in org.apache.poi.TestPOIDocumentMain
Running org.apache.poi.hpsf.TestVariantSupport
Tests run: 2, Failures: 0, Errors: 0, Skipped: 0, Time elapsed: 0.018 sec - in org.apache.poi.hpsf.TestVariantSupport
Running org.apache.poi.hpsf.extractor.TestHPSFPropertiesExtractor
Tests run: 8, Failures: 0, Errors: 0, Skipped: 0, Time elapsed: 0.025 sec - in org.apache.poi.hpsf.extractor.TestHPSFPropertiesExtractor
Running org.apache.poi.hpsf.basic.TestBasic
Tests run: 6, Failures: 0, Errors: 0, Skipped: 0, Time elapsed: 0.009 sec - in org.apache.poi.hpsf.basic.TestBasic
Running org.apache.poi.hpsf.basic.TestEmptyProperties
Tests run: 3, Failures: 0, Errors: 0, Skipped: 0, Time elapsed: 0.002 sec - in org.apache.poi.hpsf.basic.TestEmptyProperties
Running org.apache.poi.hpsf.basic.TestMetaDataIPI
Tests run: 7, Failures: 0, Errors: 0, Skipped: 0, Time elapsed: 0.227 sec - in org.apache.poi.hpsf.basic.TestMetaDataIPI
Running org.apache.poi.hpsf.basic.TestHPSFBugs
Tests run: 4, Failures: 0, Errors: 0, Skipped: 0, Time elapsed: 0.017 sec - in org.apache.poi.hpsf.basic.TestHPSFBugs
Running org.apache.poi.hpsf.basic.TestWrite
Tests run: 10, Failures: 0, Errors: 0, Skipped: 0, Time elapsed: 0.034 sec - in org.apache.poi.hpsf.basic.TestWrite
Running org.apache.poi.hpsf.basic.TestUnicode
Tests run: 1, Failures: 0, Errors: 0, Skipped: 0, Time elapsed: 0 sec - in org.apache.poi.hpsf.basic.TestUnicode
Running org.apache.poi.hpsf.basic.TestWriteWellKnown
Tests run: 3, Failures: 0, Errors: 0, Skipped: 0, Time elapsed: 0.006 sec - in org.apache.poi.hpsf.basic.TestWriteWellKnown
Running org.apache.poi.hpsf.basic.TestReadAllFiles
Tests run: 88, Failures: 0, Errors: 0, Skipped: 0, Time elapsed: 0.397 sec - in org.apache.poi.hpsf.basic.TestReadAllFiles
Running org.apache.poi.hpsf.basic.TestClassID
Tests run: 3, Failures: 0, Errors: 0, Skipped: 0, Time elapsed: 0.001 sec - in org.apache.poi.hpsf.basic.TestClassID
Running org.apache.poi.TestPOITestCase
Tests run: 10, Failures: 0, Errors: 0, Skipped: 3, Time elapsed: 0 sec - in org.apache.poi.TestPOITestCase
Running org.apache.poi.sl.draw.geom.TestPresetGeometries
Tests run: 2, Failures: 0, Errors: 0, Skipped: 1, Time elapsed: 0.815 sec - in org.apache.poi.sl.draw.geom.TestPresetGeometries
Running org.apache.poi.poifs.storage.TestBATBlock
Tests run: 6, Failures: 0, Errors: 0, Skipped: 0, Time elapsed: 0 sec - in org.apache.poi.poifs.storage.TestBATBlock
Running org.apache.poi.poifs.storage.TestHeaderBlockReading
Tests run: 1, Failures: 0, Errors: 0, Skipped: 0, Time elapsed: 0.001 sec - in org.apache.poi.poifs.storage.TestHeaderBlockReading
Running org.apache.poi.poifs.nio.TestDataSource
Tests run: 4, Failures: 0, Errors: 0, Skipped: 0, Time elapsed: 0.048 sec - in org.apache.poi.poifs.nio.TestDataSource
Running org.apache.poi.poifs.macros.TestVBAMacroReader
Tests run: 27, Failures: 0, Errors: 0, Skipped: 6, Time elapsed: 0.215 sec - in org.apache.poi.poifs.macros.TestVBAMacroReader
Running org.apache.poi.poifs.eventfilesystem.TestPOIFSReaderRegistry
Tests run: 2, Failures: 0, Errors: 0, Skipped: 0, Time elapsed: 0 sec - in org.apache.poi.poifs.eventfilesystem.TestPOIFSReaderRegistry
Running org.apache.poi.poifs.dev.TestPOIFSDump
Tests run: 4, Failures: 0, Errors: 0, Skipped: 1, Time elapsed: 0.061 sec - in org.apache.poi.poifs.dev.TestPOIFSDump
Running org.apache.poi.poifs.filesystem.TestPOIFSDocumentPath
Tests run: 4, Failures: 0, Errors: 0, Skipped: 0, Time elapsed: 0 sec - in org.apache.poi.poifs.filesystem.TestPOIFSDocumentPath
Running org.apache.poi.poifs.filesystem.TestDocument
Tests run: 1, Failures: 0, Errors: 0, Skipped: 0, Time elapsed: 0.006 sec - in org.apache.poi.poifs.filesystem.TestDocument
Running org.apache.poi.poifs.filesystem.TestPOIFSFileSystem
Tests run: 6, Failures: 0, Errors: 0, Skipped: 0, Time elapsed: 0.282 sec - in org.apache.poi.poifs.filesystem.TestPOIFSFileSystem
Running org.apache.poi.poifs.filesystem.TestFileMagic
Tests run: 9, Failures: 0, Errors: 0, Skipped: 0, Time elapsed: 0.008 sec - in org.apache.poi.poifs.filesystem.TestFileMagic
Running org.apache.poi.poifs.filesystem.TestDocumentInputStream
Tests run: 8, Failures: 0, Errors: 0, Skipped: 0, Time elapsed: 0.316 sec - in org.apache.poi.poifs.filesystem.TestDocumentInputStream
Running org.apache.poi.poifs.filesystem.TestNotOLE2Exception
Tests run: 4, Failures: 0, Errors: 0, Skipped: 0, Time elapsed: 0.009 sec - in org.apache.poi.poifs.filesystem.TestNotOLE2Exception
Running org.apache.poi.poifs.filesystem.TestFilteringDirectoryNode
Tests run: 4, Failures: 0, Errors: 0, Skipped: 0, Time elapsed: 0 sec - in org.apache.poi.poifs.filesystem.TestFilteringDirectoryNode
Running org.apache.poi.poifs.filesystem.TestDocumentDescriptor
Tests run: 1, Failures: 0, Errors: 0, Skipped: 0, Time elapsed: 0.001 sec - in org.apache.poi.poifs.filesystem.TestDocumentDescriptor
Running org.apache.poi.poifs.filesystem.TestPOIFSMiniStore
Tests run: 7, Failures: 0, Errors: 0, Skipped: 0, Time elapsed: 0.005 sec - in org.apache.poi.poifs.filesystem.TestPOIFSMiniStore
Running org.apache.poi.poifs.filesystem.TestOfficeXMLException
Tests run: 5, Failures: 0, Errors: 0, Skipped: 0, Time elapsed: 0.009 sec - in org.apache.poi.poifs.filesystem.TestOfficeXMLException
Running org.apache.poi.poifs.filesystem.TestFileSystemBugs
Tests run: 3, Failures: 0, Errors: 0, Skipped: 0, Time elapsed: 0.007 sec - in org.apache.poi.poifs.filesystem.TestFileSystemBugs
Running org.apache.poi.poifs.filesystem.TestDirectoryNode
Tests run: 4, Failures: 0, Errors: 0, Skipped: 0, Time elapsed: 0.001 sec - in org.apache.poi.poifs.filesystem.TestDirectoryNode
Running org.apache.poi.poifs.filesystem.TestEmptyDocument
Tests run: 5, Failures: 0, Errors: 0, Skipped: 0, Time elapsed: 0.001 sec - in org.apache.poi.poifs.filesystem.TestEmptyDocument
Running org.apache.poi.poifs.filesystem.TestDocumentOutputStream
Tests run: 3, Failures: 0, Errors: 0, Skipped: 0, Time elapsed: 0.001 sec - in org.apache.poi.poifs.filesystem.TestDocumentOutputStream
Running org.apache.poi.poifs.filesystem.TestOle10Native
Tests run: 3, Failures: 0, Errors: 0, Skipped: 0, Time elapsed: 0.195 sec - in org.apache.poi.poifs.filesystem.TestOle10Native
Running org.apache.poi.poifs.filesystem.TestPropertySorter
Tests run: 2, Failures: 0, Errors: 0, Skipped: 0, Time elapsed: 0.001 sec - in org.apache.poi.poifs.filesystem.TestPropertySorter
Running org.apache.poi.poifs.filesystem.TestPOIFSStream
Tests run: 33, Failures: 0, Errors: 0, Skipped: 2, Time elapsed: 0.298 sec - in org.apache.poi.poifs.filesystem.TestPOIFSStream
Running org.apache.poi.poifs.filesystem.TestEntryUtils
Tests run: 3, Failures: 0, Errors: 0, Skipped: 0, Time elapsed: 0.005 sec - in org.apache.poi.poifs.filesystem.TestEntryUtils
Running org.apache.poi.poifs.crypt.TestCipherAlgorithm
Tests run: 4, Failures: 0, Errors: 0, Skipped: 0, Time elapsed: 0 sec - in org.apache.poi.poifs.crypt.TestCipherAlgorithm
Running org.apache.poi.poifs.crypt.TestXorEncryption
Tests run: 3, Failures: 0, Errors: 0, Skipped: 1, Time elapsed: 0.001 sec - in org.apache.poi.poifs.crypt.TestXorEncryption
Running org.apache.poi.poifs.crypt.binaryrc4.TestBinaryRC4
Tests run: 3, Failures: 0, Errors: 0, Skipped: 0, Time elapsed: 0.001 sec - in org.apache.poi.poifs.crypt.binaryrc4.TestBinaryRC4
Running org.apache.poi.poifs.crypt.TestBiff8DecryptingStream
Tests run: 4, Failures: 0, Errors: 0, Skipped: 0, Time elapsed: 0.03 sec - in org.apache.poi.poifs.crypt.TestBiff8DecryptingStream
Running org.apache.poi.poifs.property.TestPropertyTable
Tests run: 2, Failures: 0, Errors: 0, Skipped: 0, Time elapsed: 0 sec - in org.apache.poi.poifs.property.TestPropertyTable
Running org.apache.poi.poifs.property.TestDocumentProperty
Tests run: 2, Failures: 0, Errors: 0, Skipped: 0, Time elapsed: 0 sec - in org.apache.poi.poifs.property.TestDocumentProperty
Running org.apache.poi.poifs.property.TestRootProperty
Tests run: 3, Failures: 0, Errors: 0, Skipped: 0, Time elapsed: 0 sec - in org.apache.poi.poifs.property.TestRootProperty
Running org.apache.poi.poifs.property.TestPropertyFactory
Tests run: 1, Failures: 0, Errors: 0, Skipped: 0, Time elapsed: 0 sec - in org.apache.poi.poifs.property.TestPropertyFactory
Running org.apache.poi.poifs.property.TestDirectoryProperty
Tests run: 6, Failures: 0, Errors: 0, Skipped: 0, Time elapsed: 0.013 sec - in org.apache.poi.poifs.property.TestDirectoryProperty

Results :

Tests in error: 
  TestHSSFPictureData.testMacPicture:113 » AssumptionViolated got: <false>, expe...
  TestHSSFPictureData.testPictures:88 » AssumptionViolated got: <false>, expecte...

Tests run: 6925, Failures: 0, Errors: 2, Skipped: 810

[INFO] ------------------------------------------------------------------------
[INFO] Reactor Summary for Apache POI - the Java API for Microsoft Documents 4.1.2-SNAPSHOT:
[INFO] 
[INFO] Apache POI - the Java API for Microsoft Documents .. SUCCESS [  1.083 s]
[INFO] Apache POI Main package ............................ FAILURE [01:38 min]
[INFO] Apache POI Scratchpad package ...................... SKIPPED
[INFO] Apache POI - Openxmlformats Schema package ......... SKIPPED
[INFO] Apache POI - Openxmlformats Encryption Schema package SKIPPED
[INFO] Apache POI - Openxmlformats Security-Schema package  SKIPPED
[INFO] Apache POI OOXML package ........................... SKIPPED
[INFO] Apache POI ExcelAnt package ........................ SKIPPED
[INFO] Apache POI Examples package ........................ SKIPPED
[INFO] ------------------------------------------------------------------------
[INFO] BUILD FAILURE
[INFO] ------------------------------------------------------------------------
[INFO] Total time:  01:40 min
[INFO] Finished at: 2019-12-24T12:06:08Z
[INFO] ------------------------------------------------------------------------
[ERROR] Failed to execute goal org.apache.maven.plugins:maven-surefire-plugin:2.19.1:test (default-test) on project poi-main: There are test failures.
[ERROR] 
[ERROR] Please refer to <https://builds.apache.org/job/POI-DSL-Maven/ws/sonar/main/target/surefire-reports> for the individual test results.
[ERROR] -> [Help 1]
[ERROR] 
[ERROR] To see the full stack trace of the errors, re-run Maven with the -e switch.
[ERROR] Re-run Maven using the -X switch to enable full debug logging.
[ERROR] 
[ERROR] For more information about the errors and possible solutions, please read the following articles:
[ERROR] [Help 1] http://cwiki.apache.org/confluence/display/MAVEN/MojoFailureException
[ERROR] 
[ERROR] After correcting the problems, you can resume the build with the command
[ERROR]   mvn <args> -rf :poi-main
Build step 'Invoke top-level Maven targets' marked build as failure
Recording test results

---------------------------------------------------------------------
To unsubscribe, e-mail: dev-unsubscribe@poi.apache.org
For additional commands, e-mail: dev-help@poi.apache.org