You are viewing a plain text version of this content. The canonical link for it is here.
Posted to commits@kafka.apache.org by Apache Jenkins Server <je...@builds.apache.org> on 2012/10/03 22:13:56 UTC

Build failed in Jenkins: Kafka-0.8 #56

See <https://builds.apache.org/job/Kafka-0.8/56/changes>

Changes:

[jjkoshy] Replace numerical compression codes in config with something human readable; KAFKA-363; patched by David Arthur; reviewed by Joel Koshy

------------------------------------------
[...truncated 3049 lines...]
[2012-10-03 20:13:33,421] WARN EndOfStreamException: Unable to read additional data from client sessionid 0x13a2842db1c0007, likely client has closed socket (org.apache.zookeeper.server.NIOServerCnxn:634)
[2012-10-03 20:13:33,821] WARN EndOfStreamException: Unable to read additional data from client sessionid 0x13a2842db1c0005, likely client has closed socket (org.apache.zookeeper.server.NIOServerCnxn:634)
[2012-10-03 20:13:34,641] WARN EndOfStreamException: Unable to read additional data from client sessionid 0x13a28420ec60003, likely client has closed socket (org.apache.zookeeper.server.NIOServerCnxn:634)
[2012-10-03 20:13:34,670] ERROR [group1_consumer2], error during syncedRebalance (kafka.consumer.ZookeeperConsumerConnector:102)
java.lang.NullPointerException
	at kafka.utils.ZkUtils$.getChildrenParentMayNotExist(ZkUtils.scala:374)
	at kafka.utils.ZkUtils$.getCluster(ZkUtils.scala:392)
	at kafka.consumer.ZookeeperConsumerConnector$ZKRebalancerListener$$anonfun$syncedRebalance$1.apply$mcVI$sp(ZookeeperConsumerConnector.scala:385)
	at scala.collection.immutable.Range$ByOne$class.foreach$mVc$sp(Range.scala:282)
	at scala.collection.immutable.Range$$anon$2.foreach$mVc$sp(Range.scala:265)
	at kafka.consumer.ZookeeperConsumerConnector$ZKRebalancerListener.syncedRebalance(ZookeeperConsumerConnector.scala:382)
	at kafka.consumer.ZookeeperConsumerConnector$ZKRebalancerListener$$anon$1.run(ZookeeperConsumerConnector.scala:339)
[2012-10-03 20:13:34,921] WARN EndOfStreamException: Unable to read additional data from client sessionid 0x13a2842ab0a0002, likely client has closed socket (org.apache.zookeeper.server.NIOServerCnxn:634)
[2012-10-03 20:13:34,991] WARN EndOfStreamException: Unable to read additional data from client sessionid 0x13a2842db1c0007, likely client has closed socket (org.apache.zookeeper.server.NIOServerCnxn:634)
[2012-10-03 20:13:35,161] WARN EndOfStreamException: Unable to read additional data from client sessionid 0x13a2842a1f70002, likely client has closed socket (org.apache.zookeeper.server.NIOServerCnxn:634)
[2012-10-03 20:13:35,561] WARN EndOfStreamException: Unable to read additional data from client sessionid 0x13a2842db1c0005, likely client has closed socket (org.apache.zookeeper.server.NIOServerCnxn:634)
[2012-10-03 20:13:35,971] WARN EndOfStreamException: Unable to read additional data from client sessionid 0x13a28420ec60003, likely client has closed socket (org.apache.zookeeper.server.NIOServerCnxn:634)
[2012-10-03 20:13:36,441] WARN Exception causing close of session 0x13a2842ab0a0002 due to java.io.IOException: Connection reset by peer (org.apache.zookeeper.server.NIOServerCnxn:639)
[2012-10-03 20:13:36,442] WARN EndOfStreamException: Unable to read additional data from client sessionid 0x13a2842a1f70002, likely client has closed socket (org.apache.zookeeper.server.NIOServerCnxn:634)
[2012-10-03 20:13:36,844] ERROR [KafkaApi-0] error when processing request (test2,0,-1,10000) (kafka.server.KafkaApis:102)
kafka.common.OffsetOutOfRangeException: offset -1 is out of range
	at kafka.log.Log$.findRange(Log.scala:48)
	at kafka.log.Log.read(Log.scala:292)
	at kafka.server.KafkaApis.kafka$server$KafkaApis$$readMessageSet(KafkaApis.scala:335)
	at kafka.server.KafkaApis$$anonfun$kafka$server$KafkaApis$$readMessageSets$1.apply(KafkaApis.scala:295)
	at kafka.server.KafkaApis$$anonfun$kafka$server$KafkaApis$$readMessageSets$1.apply(KafkaApis.scala:292)
	at scala.collection.TraversableLike$$anonfun$map$1.apply(TraversableLike.scala:206)
	at scala.collection.TraversableLike$$anonfun$map$1.apply(TraversableLike.scala:206)
	at scala.collection.immutable.Map$Map4.foreach(Map.scala:180)
	at scala.collection.TraversableLike$class.map(TraversableLike.scala:206)
	at scala.collection.immutable.Map$Map4.map(Map.scala:157)
	at kafka.server.KafkaApis.kafka$server$KafkaApis$$readMessageSets(KafkaApis.scala:292)
	at kafka.server.KafkaApis.handleFetchRequest(KafkaApis.scala:229)
	at kafka.server.KafkaApis.handle(KafkaApis.scala:57)
	at kafka.server.KafkaRequestHandler.run(KafkaRequestHandler.scala:40)
	at java.lang.Thread.run(Thread.java:662)
[2012-10-03 20:13:36,845] ERROR [KafkaApi-0] error when processing request (test3,0,-1,10000) (kafka.server.KafkaApis:102)
kafka.common.OffsetOutOfRangeException: offset -1 is out of range
	at kafka.log.Log$.findRange(Log.scala:48)
	at kafka.log.Log.read(Log.scala:292)
	at kafka.server.KafkaApis.kafka$server$KafkaApis$$readMessageSet(KafkaApis.scala:335)
	at kafka.server.KafkaApis$$anonfun$kafka$server$KafkaApis$$readMessageSets$1.apply(KafkaApis.scala:295)
	at kafka.server.KafkaApis$$anonfun$kafka$server$KafkaApis$$readMessageSets$1.apply(KafkaApis.scala:292)
	at scala.collection.TraversableLike$$anonfun$map$1.apply(TraversableLike.scala:206)
	at scala.collection.TraversableLike$$anonfun$map$1.apply(TraversableLike.scala:206)
	at scala.collection.immutable.Map$Map4.foreach(Map.scala:180)
	at scala.collection.TraversableLike$class.map(TraversableLike.scala:206)
	at scala.collection.immutable.Map$Map4.map(Map.scala:157)
	at kafka.server.KafkaApis.kafka$server$KafkaApis$$readMessageSets(KafkaApis.scala:292)
	at kafka.server.KafkaApis.handleFetchRequest(KafkaApis.scala:229)
	at kafka.server.KafkaApis.handle(KafkaApis.scala:57)
	at kafka.server.KafkaRequestHandler.run(KafkaRequestHandler.scala:40)
	at java.lang.Thread.run(Thread.java:662)
[2012-10-03 20:13:36,845] ERROR [KafkaApi-0] error when processing request (test4,0,-1,10000) (kafka.server.KafkaApis:102)
kafka.common.OffsetOutOfRangeException: offset -1 is out of range
	at kafka.log.Log$.findRange(Log.scala:48)
	at kafka.log.Log.read(Log.scala:292)
	at kafka.server.KafkaApis.kafka$server$KafkaApis$$readMessageSet(KafkaApis.scala:335)
	at kafka.server.KafkaApis$$anonfun$kafka$server$KafkaApis$$readMessageSets$1.apply(KafkaApis.scala:295)
	at kafka.server.KafkaApis$$anonfun$kafka$server$KafkaApis$$readMessageSets$1.apply(KafkaApis.scala:292)
	at scala.collection.TraversableLike$$anonfun$map$1.apply(TraversableLike.scala:206)
	at scala.collection.TraversableLike$$anonfun$map$1.apply(TraversableLike.scala:206)
	at scala.collection.immutable.Map$Map4.foreach(Map.scala:180)
	at scala.collection.TraversableLike$class.map(TraversableLike.scala:206)
	at scala.collection.immutable.Map$Map4.map(Map.scala:157)
	at kafka.server.KafkaApis.kafka$server$KafkaApis$$readMessageSets(KafkaApis.scala:292)
	at kafka.server.KafkaApis.handleFetchRequest(KafkaApis.scala:229)
	at kafka.server.KafkaApis.handle(KafkaApis.scala:57)
	at kafka.server.KafkaRequestHandler.run(KafkaRequestHandler.scala:40)
	at java.lang.Thread.run(Thread.java:662)
[2012-10-03 20:13:36,845] ERROR [KafkaApi-0] error when processing request (test1,0,-1,10000) (kafka.server.KafkaApis:102)
kafka.common.OffsetOutOfRangeException: offset -1 is out of range
	at kafka.log.Log$.findRange(Log.scala:48)
	at kafka.log.Log.read(Log.scala:292)
	at kafka.server.KafkaApis.kafka$server$KafkaApis$$readMessageSet(KafkaApis.scala:335)
	at kafka.server.KafkaApis$$anonfun$kafka$server$KafkaApis$$readMessageSets$1.apply(KafkaApis.scala:295)
	at kafka.server.KafkaApis$$anonfun$kafka$server$KafkaApis$$readMessageSets$1.apply(KafkaApis.scala:292)
	at scala.collection.TraversableLike$$anonfun$map$1.apply(TraversableLike.scala:206)
	at scala.collection.TraversableLike$$anonfun$map$1.apply(TraversableLike.scala:206)
	at scala.collection.immutable.Map$Map4.foreach(Map.scala:180)
	at scala.collection.TraversableLike$class.map(TraversableLike.scala:206)
	at scala.collection.immutable.Map$Map4.map(Map.scala:157)
	at kafka.server.KafkaApis.kafka$server$KafkaApis$$readMessageSets(KafkaApis.scala:292)
	at kafka.server.KafkaApis.handleFetchRequest(KafkaApis.scala:229)
	at kafka.server.KafkaApis.handle(KafkaApis.scala:57)
	at kafka.server.KafkaRequestHandler.run(KafkaRequestHandler.scala:40)
	at java.lang.Thread.run(Thread.java:662)
[info] Test Passed: testProduceAndMultiFetch(kafka.integration.LazyInitProducerTest)
[info] Test Starting: testMultiProduce(kafka.integration.LazyInitProducerTest)
[2012-10-03 20:13:36,941] WARN EndOfStreamException: Unable to read additional data from client sessionid 0x13a2842db1c0005, likely client has closed socket (org.apache.zookeeper.server.NIOServerCnxn:634)
[2012-10-03 20:13:37,041] WARN EndOfStreamException: Unable to read additional data from client sessionid 0x13a2842db1c0007, likely client has closed socket (org.apache.zookeeper.server.NIOServerCnxn:634)
[2012-10-03 20:13:37,190] WARN EndOfStreamException: Unable to read additional data from client sessionid 0x13a28420ec60003, likely client has closed socket (org.apache.zookeeper.server.NIOServerCnxn:634)
[2012-10-03 20:13:37,751] WARN EndOfStreamException: Unable to read additional data from client sessionid 0x13a2842ab0a0002, likely client has closed socket (org.apache.zookeeper.server.NIOServerCnxn:634)
[info] Test Passed: testMultiProduce(kafka.integration.LazyInitProducerTest)
[info] Test Starting: testProduceAndFetch(kafka.integration.LazyInitProducerTest)
[2012-10-03 20:13:38,350] WARN EndOfStreamException: Unable to read additional data from client sessionid 0x13a28420ec60003, likely client has closed socket (org.apache.zookeeper.server.NIOServerCnxn:634)
[2012-10-03 20:13:38,621] WARN EndOfStreamException: Unable to read additional data from client sessionid 0x13a2842db1c0007, likely client has closed socket (org.apache.zookeeper.server.NIOServerCnxn:634)
[2012-10-03 20:13:38,831] WARN EndOfStreamException: Unable to read additional data from client sessionid 0x13a2842db1c0005, likely client has closed socket (org.apache.zookeeper.server.NIOServerCnxn:634)
[2012-10-03 20:13:39,143] ERROR [KafkaApi-0] error when processing request (test,0,-1,10000) (kafka.server.KafkaApis:102)
kafka.common.OffsetOutOfRangeException: offset -1 is out of range
	at kafka.log.Log$.findRange(Log.scala:48)
	at kafka.log.Log.read(Log.scala:292)
	at kafka.server.KafkaApis.kafka$server$KafkaApis$$readMessageSet(KafkaApis.scala:335)
	at kafka.server.KafkaApis$$anonfun$kafka$server$KafkaApis$$readMessageSets$1.apply(KafkaApis.scala:295)
	at kafka.server.KafkaApis$$anonfun$kafka$server$KafkaApis$$readMessageSets$1.apply(KafkaApis.scala:292)
	at scala.collection.TraversableLike$$anonfun$map$1.apply(TraversableLike.scala:206)
	at scala.collection.TraversableLike$$anonfun$map$1.apply(TraversableLike.scala:206)
	at scala.collection.immutable.Map$Map1.foreach(Map.scala:105)
	at scala.collection.TraversableLike$class.map(TraversableLike.scala:206)
	at scala.collection.immutable.Map$Map1.map(Map.scala:93)
	at kafka.server.KafkaApis.kafka$server$KafkaApis$$readMessageSets(KafkaApis.scala:292)
	at kafka.server.KafkaApis.handleFetchRequest(KafkaApis.scala:229)
	at kafka.server.KafkaApis.handle(KafkaApis.scala:57)
	at kafka.server.KafkaRequestHandler.run(KafkaRequestHandler.scala:40)
	at java.lang.Thread.run(Thread.java:662)
[info] Test Passed: testProduceAndFetch(kafka.integration.LazyInitProducerTest)
[info] Test Starting: testMultiProduceResend(kafka.integration.LazyInitProducerTest)
[2012-10-03 20:13:39,291] WARN EndOfStreamException: Unable to read additional data from client sessionid 0x13a2842a1f70002, likely client has closed socket (org.apache.zookeeper.server.NIOServerCnxn:634)
[2012-10-03 20:13:39,871] WARN EndOfStreamException: Unable to read additional data from client sessionid 0x13a2842ab0a0002, likely client has closed socket (org.apache.zookeeper.server.NIOServerCnxn:634)
[info] Test Passed: testMultiProduceResend(kafka.integration.LazyInitProducerTest)
[info] == core-kafka / kafka.integration.LazyInitProducerTest ==
[info] 
[info] == core-kafka / kafka.network.RpcDataSerializationTest ==
[info] Test Starting: testSerializationAndDeserialization
[info] Test Passed: testSerializationAndDeserialization
[info] == core-kafka / kafka.network.RpcDataSerializationTest ==
[info] 
[info] == core-kafka / kafka.admin.AdminTest ==
[info] Test Starting: testReplicaAssignment(kafka.admin.AdminTest)
[info] Test Passed: testReplicaAssignment(kafka.admin.AdminTest)
[info] Test Starting: testManualReplicaAssignment(kafka.admin.AdminTest)
[info] Test Passed: testManualReplicaAssignment(kafka.admin.AdminTest)
[info] Test Starting: testTopicCreationInZK(kafka.admin.AdminTest)
[2012-10-03 20:13:40,435] WARN EndOfStreamException: Unable to read additional data from client sessionid 0x13a28420ec60003, likely client has closed socket (org.apache.zookeeper.server.NIOServerCnxn:634)
[2012-10-03 20:13:40,471] WARN EndOfStreamException: Unable to read additional data from client sessionid 0x13a2842db1c0005, likely client has closed socket (org.apache.zookeeper.server.NIOServerCnxn:634)
[info] Test Passed: testTopicCreationInZK(kafka.admin.AdminTest)
[info] Test Starting: testGetTopicMetadata(kafka.admin.AdminTest)
[info] Test Passed: testGetTopicMetadata(kafka.admin.AdminTest)
[info] == core-kafka / kafka.admin.AdminTest ==
[info] 
[info] == core-kafka / kafka.utils.UtilsTest ==
[info] Test Starting: testSwallow
[info] Test Passed: testSwallow
[info] Test Starting: testCircularIterator
[info] Test Passed: testCircularIterator
[info] == core-kafka / kafka.utils.UtilsTest ==
[info] 
[info] == core-kafka / kafka.log4j.KafkaLog4jAppenderTest ==
[info] Test Starting: testKafkaLog4jConfigs(kafka.log4j.KafkaLog4jAppenderTest)
[2012-10-03 20:13:40,691] WARN EndOfStreamException: Unable to read additional data from client sessionid 0x13a2842db1c0007, likely client has closed socket (org.apache.zookeeper.server.NIOServerCnxn:634)
log4j:WARN No appenders could be found for logger (org.I0Itec.zkclient.ZkEventThread).
log4j:WARN Please initialize the log4j system properly.
[info] Test Passed: testKafkaLog4jConfigs(kafka.log4j.KafkaLog4jAppenderTest)
[info] Test Starting: testLog4jAppends(kafka.log4j.KafkaLog4jAppenderTest)
[info] Test Passed: testLog4jAppends(kafka.log4j.KafkaLog4jAppenderTest)
[info] == core-kafka / kafka.log4j.KafkaLog4jAppenderTest ==
[info] 
[info] == core-kafka / kafka.log.LogOffsetTest ==
[info] Test Starting: testGetOffsetsForUnknownTopic(kafka.log.LogOffsetTest)
[info] Test Passed: testGetOffsetsForUnknownTopic(kafka.log.LogOffsetTest)
[info] Test Starting: testGetOffsetsBeforeLatestTime(kafka.log.LogOffsetTest)
[info] Test Passed: testGetOffsetsBeforeLatestTime(kafka.log.LogOffsetTest)
[info] Test Starting: testEmptyLogsGetOffsets(kafka.log.LogOffsetTest)
[info] Test Passed: testEmptyLogsGetOffsets(kafka.log.LogOffsetTest)
[info] Test Starting: testGetOffsetsBeforeNow(kafka.log.LogOffsetTest)
[info] Test Passed: testGetOffsetsBeforeNow(kafka.log.LogOffsetTest)
[info] Test Starting: testGetOffsetsBeforeEarliestTime(kafka.log.LogOffsetTest)
[info] Test Passed: testGetOffsetsBeforeEarliestTime(kafka.log.LogOffsetTest)
[info] == core-kafka / kafka.log.LogOffsetTest ==
[info] 
[info] == core-kafka / kafka.javaapi.consumer.ZookeeperConsumerConnectorTest ==
[info] Test Starting: testBasic(kafka.javaapi.consumer.ZookeeperConsumerConnectorTest)
[info] Test Passed: testBasic(kafka.javaapi.consumer.ZookeeperConsumerConnectorTest)
[info] == core-kafka / kafka.javaapi.consumer.ZookeeperConsumerConnectorTest ==
[info] 
[info] == core-kafka / kafka.message.ByteBufferMessageSetTest ==
[info] Test Starting: testWrittenEqualsRead
[info] Test Passed: testWrittenEqualsRead
[info] Test Starting: testIteratorIsConsistent
[info] Test Passed: testIteratorIsConsistent
[info] Test Starting: testSizeInBytes
[info] Test Passed: testSizeInBytes
[info] Test Starting: testEquals
[info] Test Passed: testEquals
[info] Test Starting: testWriteTo
[info] Test Passed: testWriteTo
[info] Test Starting: testSmallFetchSize
[info] Test Passed: testSmallFetchSize
[info] Test Starting: testValidBytes
[info] Test Passed: testValidBytes
[info] Test Starting: testValidBytesWithCompression
[info] Test Passed: testValidBytesWithCompression
[info] Test Starting: testIterator
[info] Test Passed: testIterator
[info] == core-kafka / kafka.message.ByteBufferMessageSetTest ==
[info] 
[info] == core-kafka / kafka.producer.ProducerTest ==
[info] Test Starting: testUpdateBrokerPartitionInfo(kafka.producer.ProducerTest)
[info] Test Passed: testUpdateBrokerPartitionInfo(kafka.producer.ProducerTest)
[info] Test Starting: testSendToNewTopic(kafka.producer.ProducerTest)
[info] Test Passed: testSendToNewTopic(kafka.producer.ProducerTest)
[info] Test Starting: testSendWithDeadBroker(kafka.producer.ProducerTest)
[info] Test Passed: testSendWithDeadBroker(kafka.producer.ProducerTest)
[info] Test Starting: testAsyncSendCanCorrectlyFailWithTimeout(kafka.producer.ProducerTest)
[info] Test Passed: testAsyncSendCanCorrectlyFailWithTimeout(kafka.producer.ProducerTest)
[info] == core-kafka / kafka.producer.ProducerTest ==
[info] 
[info] == core-kafka / kafka.message.FileMessageSetTest ==
[info] Test Starting: testWrittenEqualsRead
[info] Test Passed: testWrittenEqualsRead
[info] Test Starting: testIteratorIsConsistent
[info] Test Passed: testIteratorIsConsistent
[info] Test Starting: testSizeInBytes
[info] Test Passed: testSizeInBytes
[info] Test Starting: testWriteTo
[info] Test Passed: testWriteTo
[info] Test Starting: testFileSize
[info] Test Passed: testFileSize
[info] Test Starting: testIterationOverPartialAndTruncation
[info] Test Passed: testIterationOverPartialAndTruncation
[info] Test Starting: testIterationDoesntChangePosition
[info] Test Passed: testIterationDoesntChangePosition
[info] Test Starting: testRead
[info] Test Passed: testRead
[info] == core-kafka / kafka.message.FileMessageSetTest ==
[info] 
[info] == core-kafka / kafka.log.LogCorruptionTest ==
[info] Test Starting: testMessageSizeTooLarge(kafka.log.LogCorruptionTest)
[info] Test Passed: testMessageSizeTooLarge(kafka.log.LogCorruptionTest)
[info] == core-kafka / kafka.log.LogCorruptionTest ==
[info] 
[info] == core-kafka / test-finish ==
[error] Failed: : Total 136, Failed 1, Errors 0, Passed 135, Skipped 0
[info] == core-kafka / test-finish ==
[info] 
[info] == core-kafka / Test cleanup 1 ==
[info] Deleting directory /var/tmp/sbt_17529a5e
[info] == core-kafka / Test cleanup 1 ==
[info] 
[info] == core-kafka / test-cleanup ==
[info] == core-kafka / test-cleanup ==
[error] Error running kafka.message.CompressionUtilTest: Test FAILED
[error] Error running test: One or more subtasks failed
[info] 
[info] Total time: 210 s, completed Oct 3, 2012 8:14:22 PM
[info] 
[info] Total session time: 211 s, completed Oct 3, 2012 8:14:22 PM
[error] Error during build.
Build step 'Execute shell' marked build as failure

Build failed in Jenkins: Kafka-0.8 #61

Posted by Apache Jenkins Server <je...@builds.apache.org>.
See <https://builds.apache.org/job/Kafka-0.8/61/changes>

Changes:

[jjkoshy] ConsumerOffsetChecker now works with hostnames (in addition to IP) in the brokers/ids zk path; KAFKA-549; patched by Bob Cotton; reviewed by Joel Koshy

------------------------------------------
[...truncated 4520 lines...]
	at scala.collection.LinearSeqOptimized$class.foreach(LinearSeqOptimized.scala:61)
	at scala.collection.immutable.List.foreach(List.scala:45)
	at kafka.controller.ReplicaStateMachine.handleStateChanges(ReplicaStateMachine.scala:79)
	at kafka.controller.ReplicaStateMachine.startup(ReplicaStateMachine.scala:52)
	at kafka.controller.KafkaController.onControllerFailover(KafkaController.scala:74)
	at kafka.controller.KafkaController$$anonfun$1.apply$mcV$sp(KafkaController.scala:47)
	at kafka.server.ZookeeperLeaderElector.elect(ZookeeperLeaderElector.scala:55)
	at kafka.server.ZookeeperLeaderElector$LeaderChangeListener.handleDataDeleted(ZookeeperLeaderElector.scala:94)
	at org.I0Itec.zkclient.ZkClient$6.run(ZkClient.java:549)
	at org.I0Itec.zkclient.ZkEventThread.run(ZkEventThread.java:71)
Caused by: java.lang.InterruptedException
	at java.lang.Object.wait(Native Method)
	at java.lang.Object.wait(Object.java:485)
	at org.apache.zookeeper.ClientCnxn.submitRequest(ClientCnxn.java:1344)
	at org.apache.zookeeper.ZooKeeper.getData(ZooKeeper.java:925)
	at org.apache.zookeeper.ZooKeeper.getData(ZooKeeper.java:956)
	at org.I0Itec.zkclient.ZkConnection.readData(ZkConnection.java:103)
	at org.I0Itec.zkclient.ZkClient$9.call(ZkClient.java:770)
	at org.I0Itec.zkclient.ZkClient$9.call(ZkClient.java:766)
	at org.I0Itec.zkclient.ZkClient.retryUntilConnected(ZkClient.java:675)
	... 22 more
[2012-10-09 00:48:01,895] ERROR [Replica state machine on Controller 1]: Error while changing state of replica 1 for partition [new-topic, 3] to OnlineReplica (kafka.controller.ReplicaStateMachine:102)
org.I0Itec.zkclient.exception.ZkInterruptedException: java.lang.InterruptedException
	at org.I0Itec.zkclient.ZkClient.retryUntilConnected(ZkClient.java:687)
	at org.I0Itec.zkclient.ZkClient.readData(ZkClient.java:766)
	at org.I0Itec.zkclient.ZkClient.readData(ZkClient.java:761)
	at kafka.utils.ZkUtils$.readDataMaybeNull(ZkUtils.scala:355)
	at kafka.utils.ZkUtils$.getLeaderAndIsrForPartition(ZkUtils.scala:75)
	at kafka.controller.ReplicaStateMachine.kafka$controller$ReplicaStateMachine$$handleStateChange(ReplicaStateMachine.scala:111)
	at kafka.controller.ReplicaStateMachine$$anonfun$handleStateChanges$1$$anonfun$apply$mcVI$sp$1.apply(ReplicaStateMachine.scala:84)
	at kafka.controller.ReplicaStateMachine$$anonfun$handleStateChanges$1$$anonfun$apply$mcVI$sp$1.apply(ReplicaStateMachine.scala:83)
	at scala.collection.LinearSeqOptimized$class.foreach(LinearSeqOptimized.scala:61)
	at scala.collection.immutable.List.foreach(List.scala:45)
	at kafka.controller.ReplicaStateMachine$$anonfun$handleStateChanges$1.apply$mcVI$sp(ReplicaStateMachine.scala:83)
	at kafka.controller.ReplicaStateMachine$$anonfun$handleStateChanges$1.apply(ReplicaStateMachine.scala:79)
	at kafka.controller.ReplicaStateMachine$$anonfun$handleStateChanges$1.apply(ReplicaStateMachine.scala:79)
	at scala.collection.LinearSeqOptimized$class.foreach(LinearSeqOptimized.scala:61)
	at scala.collection.immutable.List.foreach(List.scala:45)
	at kafka.controller.ReplicaStateMachine.handleStateChanges(ReplicaStateMachine.scala:79)
	at kafka.controller.ReplicaStateMachine.startup(ReplicaStateMachine.scala:52)
	at kafka.controller.KafkaController.onControllerFailover(KafkaController.scala:74)
	at kafka.controller.KafkaController$$anonfun$1.apply$mcV$sp(KafkaController.scala:47)
	at kafka.server.ZookeeperLeaderElector.elect(ZookeeperLeaderElector.scala:55)
	at kafka.server.ZookeeperLeaderElector$LeaderChangeListener.handleDataDeleted(ZookeeperLeaderElector.scala:94)
	at org.I0Itec.zkclient.ZkClient$6.run(ZkClient.java:549)
	at org.I0Itec.zkclient.ZkEventThread.run(ZkEventThread.java:71)
Caused by: java.lang.InterruptedException
	at java.lang.Object.wait(Native Method)
	at java.lang.Object.wait(Object.java:485)
	at org.apache.zookeeper.ClientCnxn.submitRequest(ClientCnxn.java:1344)
	at org.apache.zookeeper.ZooKeeper.getData(ZooKeeper.java:925)
	at org.apache.zookeeper.ZooKeeper.getData(ZooKeeper.java:956)
	at org.I0Itec.zkclient.ZkConnection.readData(ZkConnection.java:103)
	at org.I0Itec.zkclient.ZkClient$9.call(ZkClient.java:770)
	at org.I0Itec.zkclient.ZkClient$9.call(ZkClient.java:766)
	at org.I0Itec.zkclient.ZkClient.retryUntilConnected(ZkClient.java:675)
	... 22 more
[2012-10-09 00:48:01,896] ERROR [Replica state machine on Controller 1]: Error while changing state of replica 1 for partition [new-topic, 1] to OnlineReplica (kafka.controller.ReplicaStateMachine:102)
org.I0Itec.zkclient.exception.ZkInterruptedException: java.lang.InterruptedException
	at org.I0Itec.zkclient.ZkClient.retryUntilConnected(ZkClient.java:687)
	at org.I0Itec.zkclient.ZkClient.readData(ZkClient.java:766)
	at org.I0Itec.zkclient.ZkClient.readData(ZkClient.java:761)
	at kafka.utils.ZkUtils$.readDataMaybeNull(ZkUtils.scala:355)
	at kafka.utils.ZkUtils$.getLeaderAndIsrForPartition(ZkUtils.scala:75)
	at kafka.controller.ReplicaStateMachine.kafka$controller$ReplicaStateMachine$$handleStateChange(ReplicaStateMachine.scala:111)
	at kafka.controller.ReplicaStateMachine$$anonfun$handleStateChanges$1$$anonfun$apply$mcVI$sp$1.apply(ReplicaStateMachine.scala:84)
	at kafka.controller.ReplicaStateMachine$$anonfun$handleStateChanges$1$$anonfun$apply$mcVI$sp$1.apply(ReplicaStateMachine.scala:83)
	at scala.collection.LinearSeqOptimized$class.foreach(LinearSeqOptimized.scala:61)
	at scala.collection.immutable.List.foreach(List.scala:45)
	at kafka.controller.ReplicaStateMachine$$anonfun$handleStateChanges$1.apply$mcVI$sp(ReplicaStateMachine.scala:83)
	at kafka.controller.ReplicaStateMachine$$anonfun$handleStateChanges$1.apply(ReplicaStateMachine.scala:79)
	at kafka.controller.ReplicaStateMachine$$anonfun$handleStateChanges$1.apply(ReplicaStateMachine.scala:79)
	at scala.collection.LinearSeqOptimized$class.foreach(LinearSeqOptimized.scala:61)
	at scala.collection.immutable.List.foreach(List.scala:45)
	at kafka.controller.ReplicaStateMachine.handleStateChanges(ReplicaStateMachine.scala:79)
	at kafka.controller.ReplicaStateMachine.startup(ReplicaStateMachine.scala:52)
	at kafka.controller.KafkaController.onControllerFailover(KafkaController.scala:74)
	at kafka.controller.KafkaController$$anonfun$1.apply$mcV$sp(KafkaController.scala:47)
	at kafka.server.ZookeeperLeaderElector.elect(ZookeeperLeaderElector.scala:55)
	at kafka.server.ZookeeperLeaderElector$LeaderChangeListener.handleDataDeleted(ZookeeperLeaderElector.scala:94)
	at org.I0Itec.zkclient.ZkClient$6.run(ZkClient.java:549)
	at org.I0Itec.zkclient.ZkEventThread.run(ZkEventThread.java:71)
Caused by: java.lang.InterruptedException
	at java.lang.Object.wait(Native Method)
	at java.lang.Object.wait(Object.java:485)
	at org.apache.zookeeper.ClientCnxn.submitRequest(ClientCnxn.java:1344)
	at org.apache.zookeeper.ZooKeeper.getData(ZooKeeper.java:925)
	at org.apache.zookeeper.ZooKeeper.getData(ZooKeeper.java:956)
	at org.I0Itec.zkclient.ZkConnection.readData(ZkConnection.java:103)
	at org.I0Itec.zkclient.ZkClient$9.call(ZkClient.java:770)
	at org.I0Itec.zkclient.ZkClient$9.call(ZkClient.java:766)
	at org.I0Itec.zkclient.ZkClient.retryUntilConnected(ZkClient.java:675)
	... 22 more
[info] Test Passed: testAsyncSendCanCorrectlyFailWithTimeout(kafka.producer.ProducerTest)
[info] == core-kafka / kafka.producer.ProducerTest ==
[info] 
[info] == core-kafka / kafka.server.SimpleFetchTest ==
[info] Test Starting: testNonReplicaSeesHwWhenFetching(kafka.server.SimpleFetchTest)
[info] Test Passed: testNonReplicaSeesHwWhenFetching(kafka.server.SimpleFetchTest)
[info] Test Starting: testReplicaSeesLeoWhenFetching(kafka.server.SimpleFetchTest)
[info] Test Passed: testReplicaSeesLeoWhenFetching(kafka.server.SimpleFetchTest)
[info] == core-kafka / kafka.server.SimpleFetchTest ==
[info] 
[info] == core-kafka / kafka.consumer.TopicFilterTest ==
[info] Test Starting: testWhitelists
[info] Test Passed: testWhitelists
[info] Test Starting: testBlacklists
[info] Test Passed: testBlacklists
[info] == core-kafka / kafka.consumer.TopicFilterTest ==
[info] 
[info] == core-kafka / kafka.log4j.KafkaLog4jAppenderTest ==
[info] Test Starting: testKafkaLog4jConfigs(kafka.log4j.KafkaLog4jAppenderTest)
log4j:WARN No appenders could be found for logger (org.I0Itec.zkclient.ZkEventThread).
log4j:WARN Please initialize the log4j system properly.
[info] Test Passed: testKafkaLog4jConfigs(kafka.log4j.KafkaLog4jAppenderTest)
[info] Test Starting: testLog4jAppends(kafka.log4j.KafkaLog4jAppenderTest)
[info] Test Passed: testLog4jAppends(kafka.log4j.KafkaLog4jAppenderTest)
[info] == core-kafka / kafka.log4j.KafkaLog4jAppenderTest ==
[info] 
[info] == core-kafka / kafka.integration.LazyInitProducerTest ==
[info] Test Starting: testProduceAndMultiFetch(kafka.integration.LazyInitProducerTest)
[info] Test Passed: testProduceAndMultiFetch(kafka.integration.LazyInitProducerTest)
[info] Test Starting: testMultiProduce(kafka.integration.LazyInitProducerTest)
[info] Test Passed: testMultiProduce(kafka.integration.LazyInitProducerTest)
[info] Test Starting: testProduceAndFetch(kafka.integration.LazyInitProducerTest)
[info] Test Passed: testProduceAndFetch(kafka.integration.LazyInitProducerTest)
[info] Test Starting: testMultiProduceResend(kafka.integration.LazyInitProducerTest)
[info] Test Passed: testMultiProduceResend(kafka.integration.LazyInitProducerTest)
[info] == core-kafka / kafka.integration.LazyInitProducerTest ==
[info] 
[info] == core-kafka / kafka.integration.TopicMetadataTest ==
[info] Test Starting: testTopicMetadataRequest(kafka.integration.TopicMetadataTest)
[info] Test Passed: testTopicMetadataRequest(kafka.integration.TopicMetadataTest)
[info] Test Starting: testBasicTopicMetadata(kafka.integration.TopicMetadataTest)
[info] Test Passed: testBasicTopicMetadata(kafka.integration.TopicMetadataTest)
[info] Test Starting: testAutoCreateTopic(kafka.integration.TopicMetadataTest)
[info] Test Passed: testAutoCreateTopic(kafka.integration.TopicMetadataTest)
[info] == core-kafka / kafka.integration.TopicMetadataTest ==
[info] 
[info] == core-kafka / kafka.log.SegmentListTest ==
[info] Test Starting: testAppend
[info] Test Passed: testAppend
[info] Test Starting: testTrunc
[info] Test Passed: testTrunc
[info] Test Starting: testTruncLast
[info] Test Passed: testTruncLast
[info] == core-kafka / kafka.log.SegmentListTest ==
[info] 
[info] == core-kafka / kafka.log.OffsetIndexTest ==
[info] Test Starting: truncate
[info] Test Passed: truncate
[info] Test Starting: randomLookupTest
[info] Test Passed: randomLookupTest
[info] Test Starting: lookupExtremeCases
[info] Test Passed: lookupExtremeCases
[info] Test Starting: appendTooMany
[info] Test Passed: appendTooMany
[info] Test Starting: testReadOnly
[info] Test Passed: testReadOnly
[info] Test Starting: appendOutOfOrder
[info] Test Passed: appendOutOfOrder
[info] Test Starting: reopenAsReadonly
[info] Test Passed: reopenAsReadonly
[info] == core-kafka / kafka.log.OffsetIndexTest ==
[info] 
[info] == core-kafka / kafka.server.RequestPurgatoryTest ==
[info] Test Starting: testRequestSatisfaction(kafka.server.RequestPurgatoryTest)
[info] Test Passed: testRequestSatisfaction(kafka.server.RequestPurgatoryTest)
[info] Test Starting: testRequestExpiry(kafka.server.RequestPurgatoryTest)
[info] Test Passed: testRequestExpiry(kafka.server.RequestPurgatoryTest)
[info] == core-kafka / kafka.server.RequestPurgatoryTest ==
[info] 
[info] == core-kafka / kafka.server.LogRecoveryTest ==
[info] Test Starting: testHWCheckpointNoFailuresSingleLogSegment(kafka.server.LogRecoveryTest)
[info] Test Passed: testHWCheckpointNoFailuresSingleLogSegment(kafka.server.LogRecoveryTest)
[info] Test Starting: testHWCheckpointWithFailuresSingleLogSegment(kafka.server.LogRecoveryTest)
[error] Test Failed: testHWCheckpointWithFailuresSingleLogSegment(kafka.server.LogRecoveryTest)
java.lang.AssertionError: expected:<2> but was:<1>
	at org.junit.Assert.fail(Assert.java:69)
	at org.junit.Assert.failNotEquals(Assert.java:314)
	at org.junit.Assert.assertEquals(Assert.java:94)
	at org.junit.Assert.assertEquals(Assert.java:104)
	at kafka.server.LogRecoveryTest.testHWCheckpointWithFailuresSingleLogSegment(LogRecoveryTest.scala:149)
	at sun.reflect.NativeMethodAccessorImpl.invoke0(Native Method)
	at sun.reflect.NativeMethodAccessorImpl.invoke(NativeMethodAccessorImpl.java:39)
	at sun.reflect.DelegatingMethodAccessorImpl.invoke(DelegatingMethodAccessorImpl.java:25)
	at java.lang.reflect.Method.invoke(Method.java:597)
	at junit.framework.TestCase.runTest(TestCase.java:164)
	at junit.framework.TestCase.runBare(TestCase.java:130)
	at junit.framework.TestResult$1.protect(TestResult.java:110)
	at junit.framework.TestResult.runProtected(TestResult.java:128)
	at junit.framework.TestResult.run(TestResult.java:113)
	at junit.framework.TestCase.run(TestCase.java:120)
	at junit.framework.TestSuite.runTest(TestSuite.java:228)
	at junit.framework.TestSuite.run(TestSuite.java:223)
	at junit.framework.TestSuite.runTest(TestSuite.java:228)
	at junit.framework.TestSuite.run(TestSuite.java:223)
	at org.scalatest.junit.JUnit3Suite.run(JUnit3Suite.scala:309)
	at org.scalatest.tools.ScalaTestFramework$ScalaTestRunner.run(ScalaTestFramework.scala:40)
	at sbt.TestRunner.run(TestFramework.scala:53)
	at sbt.TestRunner.runTest$1(TestFramework.scala:67)
	at sbt.TestRunner.run(TestFramework.scala:76)
	at sbt.TestFramework$$anonfun$10$$anonfun$apply$11.runTest$2(TestFramework.scala:194)
	at sbt.TestFramework$$anonfun$10$$anonfun$apply$11$$anonfun$apply$12.apply(TestFramework.scala:205)
	at sbt.TestFramework$$anonfun$10$$anonfun$apply$11$$anonfun$apply$12.apply(TestFramework.scala:205)
	at sbt.NamedTestTask.run(TestFramework.scala:92)
	at sbt.ScalaProject$$anonfun$sbt$ScalaProject$$toTask$1.apply(ScalaProject.scala:193)
	at sbt.ScalaProject$$anonfun$sbt$ScalaProject$$toTask$1.apply(ScalaProject.scala:193)
	at sbt.TaskManager$Task.invoke(TaskManager.scala:62)
	at sbt.impl.RunTask.doRun$1(RunTask.scala:77)
	at sbt.impl.RunTask.runTask(RunTask.scala:85)
	at sbt.impl.RunTask.sbt$impl$RunTask$$runIfNotRoot(RunTask.scala:60)
	at sbt.impl.RunTask$$anonfun$runTasksExceptRoot$2.apply(RunTask.scala:48)
	at sbt.impl.RunTask$$anonfun$runTasksExceptRoot$2.apply(RunTask.scala:48)
	at sbt.Distributor$Run$Worker$$anonfun$2.apply(ParallelRunner.scala:131)
	at sbt.Distributor$Run$Worker$$anonfun$2.apply(ParallelRunner.scala:131)
	at sbt.Control$.trapUnit(Control.scala:19)
	at sbt.Distributor$Run$Worker.run(ParallelRunner.scala:131)
[info] Test Starting: testHWCheckpointNoFailuresMultipleLogSegments(kafka.server.LogRecoveryTest)
[info] Test Passed: testHWCheckpointNoFailuresMultipleLogSegments(kafka.server.LogRecoveryTest)
[info] Test Starting: testHWCheckpointWithFailuresMultipleLogSegments(kafka.server.LogRecoveryTest)
[info] Test Passed: testHWCheckpointWithFailuresMultipleLogSegments(kafka.server.LogRecoveryTest)
[info] == core-kafka / kafka.server.LogRecoveryTest ==
[info] 
[info] == core-kafka / kafka.server.HighwatermarkPersistenceTest ==
[info] Test Starting: testHighWatermarkPersistenceSinglePartition(kafka.server.HighwatermarkPersistenceTest)
[info] Test Passed: testHighWatermarkPersistenceSinglePartition(kafka.server.HighwatermarkPersistenceTest)
[info] Test Starting: testHighWatermarkPersistenceMultiplePartitions(kafka.server.HighwatermarkPersistenceTest)
[info] Test Passed: testHighWatermarkPersistenceMultiplePartitions(kafka.server.HighwatermarkPersistenceTest)
[info] == core-kafka / kafka.server.HighwatermarkPersistenceTest ==
[info] 
[info] == core-kafka / test-finish ==
[error] Failed: : Total 151, Failed 1, Errors 0, Passed 150, Skipped 0
[info] == core-kafka / test-finish ==
[info] 
[info] == core-kafka / Test cleanup 1 ==
[info] Deleting directory /tmp/sbt_9a8fd571
[info] == core-kafka / Test cleanup 1 ==
[info] 
[info] == core-kafka / test-cleanup ==
[info] == core-kafka / test-cleanup ==
[error] Error running kafka.server.LogRecoveryTest: Test FAILED
[error] Error running test: One or more subtasks failed
[info] 
[info] Total time: 209 s, completed Oct 9, 2012 12:48:31 AM
[info] 
[info] Total session time: 210 s, completed Oct 9, 2012 12:48:31 AM
[error] Error during build.
Build step 'Execute shell' marked build as failure

Build failed in Jenkins: Kafka-0.8 #60

Posted by Apache Jenkins Server <je...@builds.apache.org>.
See <https://builds.apache.org/job/Kafka-0.8/60/changes>

Changes:

[jkreps] KAFKA-506 Move to logical offsets. Reviewed by Jun and Neha.

------------------------------------------
[...truncated 2722 lines...]
	at sbt.NamedTestTask.run(TestFramework.scala:92)
	at sbt.ScalaProject$$anonfun$sbt$ScalaProject$$toTask$1.apply(ScalaProject.scala:193)
	at sbt.ScalaProject$$anonfun$sbt$ScalaProject$$toTask$1.apply(ScalaProject.scala:193)
	at sbt.TaskManager$Task.invoke(TaskManager.scala:62)
	at sbt.impl.RunTask.doRun$1(RunTask.scala:77)
	at sbt.impl.RunTask.runTask(RunTask.scala:85)
	at sbt.impl.RunTask.sbt$impl$RunTask$$runIfNotRoot(RunTask.scala:60)
	at sbt.impl.RunTask$$anonfun$runTasksExceptRoot$2.apply(RunTask.scala:48)
	at sbt.impl.RunTask$$anonfun$runTasksExceptRoot$2.apply(RunTask.scala:48)
	at sbt.Distributor$Run$Worker$$anonfun$2.apply(ParallelRunner.scala:131)
	at sbt.Distributor$Run$Worker$$anonfun$2.apply(ParallelRunner.scala:131)
	at sbt.Control$.trapUnit(Control.scala:19)
	at sbt.Distributor$Run$Worker.run(ParallelRunner.scala:131)
[info] Test Starting: testHWCheckpointNoFailuresMultipleLogSegments(kafka.server.LogRecoveryTest)
[info] Test Passed: testHWCheckpointNoFailuresMultipleLogSegments(kafka.server.LogRecoveryTest)
[info] Test Starting: testHWCheckpointWithFailuresMultipleLogSegments(kafka.server.LogRecoveryTest)
[info] Test Passed: testHWCheckpointWithFailuresMultipleLogSegments(kafka.server.LogRecoveryTest)
[info] == core-kafka / kafka.server.LogRecoveryTest ==
[info] 
[info] == core-kafka / kafka.message.ByteBufferMessageSetTest ==
[info] Test Starting: testWrittenEqualsRead
[info] Test Passed: testWrittenEqualsRead
[info] Test Starting: testIteratorIsConsistent
[info] Test Passed: testIteratorIsConsistent
[info] Test Starting: testSizeInBytes
[info] Test Passed: testSizeInBytes
[info] Test Starting: testWriteTo
[info] Test Passed: testWriteTo
[info] Test Starting: testValidBytes
[info] Test Passed: testValidBytes
[info] Test Starting: testValidBytesWithCompression
[info] Test Passed: testValidBytesWithCompression
[info] Test Starting: testEquals
[info] Test Passed: testEquals
[info] Test Starting: testIterator
[info] Test Passed: testIterator
[info] Test Starting: testOffsetAssignment
[info] Test Passed: testOffsetAssignment
[info] == core-kafka / kafka.message.ByteBufferMessageSetTest ==
[info] 
[info] == core-kafka / kafka.javaapi.message.ByteBufferMessageSetTest ==
[info] Test Starting: testWrittenEqualsRead
[info] Test Passed: testWrittenEqualsRead
[info] Test Starting: testIteratorIsConsistent
[info] Test Passed: testIteratorIsConsistent
[info] Test Starting: testSizeInBytes
[info] Test Passed: testSizeInBytes
[info] Test Starting: testEquals
[info] Test Passed: testEquals
[info] Test Starting: testIteratorIsConsistentWithCompression
[info] Test Passed: testIteratorIsConsistentWithCompression
[info] Test Starting: testSizeInBytesWithCompression
[info] Test Passed: testSizeInBytesWithCompression
[info] Test Starting: testEqualsWithCompression
[info] Test Passed: testEqualsWithCompression
[info] == core-kafka / kafka.javaapi.message.ByteBufferMessageSetTest ==
[info] 
[info] == core-kafka / kafka.consumer.ZookeeperConsumerConnectorTest ==
[info] Test Starting: testBasic(kafka.consumer.ZookeeperConsumerConnectorTest)
[info] Test Passed: testBasic(kafka.consumer.ZookeeperConsumerConnectorTest)
[info] Test Starting: testCompression(kafka.consumer.ZookeeperConsumerConnectorTest)
[info] Test Passed: testCompression(kafka.consumer.ZookeeperConsumerConnectorTest)
[info] Test Starting: testCompressionSetConsumption(kafka.consumer.ZookeeperConsumerConnectorTest)
[info] Test Passed: testCompressionSetConsumption(kafka.consumer.ZookeeperConsumerConnectorTest)
[info] Test Starting: testConsumerDecoder(kafka.consumer.ZookeeperConsumerConnectorTest)
[info] Test Passed: testConsumerDecoder(kafka.consumer.ZookeeperConsumerConnectorTest)
[info] Test Starting: testLeaderSelectionForPartition(kafka.consumer.ZookeeperConsumerConnectorTest)
[info] Test Passed: testLeaderSelectionForPartition(kafka.consumer.ZookeeperConsumerConnectorTest)
[info] == core-kafka / kafka.consumer.ZookeeperConsumerConnectorTest ==
[info] 
[info] == core-kafka / kafka.server.RequestPurgatoryTest ==
[info] Test Starting: testRequestSatisfaction(kafka.server.RequestPurgatoryTest)
[info] Test Passed: testRequestSatisfaction(kafka.server.RequestPurgatoryTest)
[info] Test Starting: testRequestExpiry(kafka.server.RequestPurgatoryTest)
[info] Test Passed: testRequestExpiry(kafka.server.RequestPurgatoryTest)
[info] == core-kafka / kafka.server.RequestPurgatoryTest ==
[info] 
[info] == core-kafka / kafka.server.ServerShutdownTest ==
[info] Test Starting: testCleanShutdown(kafka.server.ServerShutdownTest)
[info] Test Passed: testCleanShutdown(kafka.server.ServerShutdownTest)
[info] == core-kafka / kafka.server.ServerShutdownTest ==
[info] 
[info] == core-kafka / kafka.log.LogTest ==
[info] Test Starting: testTimeBasedLogRoll
[info] Test Passed: testTimeBasedLogRoll
[info] Test Starting: testSizeBasedLogRoll
[info] Test Passed: testSizeBasedLogRoll
[info] Test Starting: testLoadEmptyLog
[info] Test Passed: testLoadEmptyLog
[info] Test Starting: testAppendAndRead
[info] Test Passed: testAppendAndRead
[info] Test Starting: testReadOutOfRange
[info] Test Passed: testReadOutOfRange
[info] Test Starting: testLogRolls
[info] Test Passed: testLogRolls
[info] Test Starting: testCompressedMessages
[info] Test Passed: testCompressedMessages
[info] Test Starting: testFindSegment
[info] Test Passed: testFindSegment
[info] Test Starting: testEdgeLogRollsStartingAtZero
[info] Test Passed: testEdgeLogRollsStartingAtZero
[info] Test Starting: testEdgeLogRollsStartingAtNonZero
[info] Test Passed: testEdgeLogRollsStartingAtNonZero
[info] Test Starting: testMessageSizeCheck
[info] Test Passed: testMessageSizeCheck
[info] Test Starting: testLogRecoversToCorrectOffset
[info] Test Passed: testLogRecoversToCorrectOffset
[info] Test Starting: testTruncateTo
[info] Test Passed: testTruncateTo
[info] == core-kafka / kafka.log.LogTest ==
[info] 
[info] == core-kafka / kafka.message.MessageTest ==
[info] Test Starting: testFieldValues
[info] Test Passed: testFieldValues
[info] Test Starting: testChecksum
[info] Test Passed: testChecksum
[info] Test Starting: testEquality
[info] Test Passed: testEquality
[info] Test Starting: testIsHashable
[info] Test Passed: testIsHashable
[info] == core-kafka / kafka.message.MessageTest ==
[info] 
[info] == core-kafka / kafka.integration.AutoOffsetResetTest ==
[info] Test Starting: testResetToEarliestWhenOffsetTooHigh(kafka.integration.AutoOffsetResetTest)
[info] Test Passed: testResetToEarliestWhenOffsetTooHigh(kafka.integration.AutoOffsetResetTest)
[info] Test Starting: testResetToEarliestWhenOffsetTooLow(kafka.integration.AutoOffsetResetTest)
[info] Test Passed: testResetToEarliestWhenOffsetTooLow(kafka.integration.AutoOffsetResetTest)
[info] Test Starting: testResetToLatestWhenOffsetTooHigh(kafka.integration.AutoOffsetResetTest)
[info] Test Passed: testResetToLatestWhenOffsetTooHigh(kafka.integration.AutoOffsetResetTest)
[info] Test Starting: testResetToLatestWhenOffsetTooLow(kafka.integration.AutoOffsetResetTest)
[info] Test Passed: testResetToLatestWhenOffsetTooLow(kafka.integration.AutoOffsetResetTest)
[info] == core-kafka / kafka.integration.AutoOffsetResetTest ==
[info] 
[info] == core-kafka / kafka.zk.ZKEphemeralTest ==
[info] Test Starting: testEphemeralNodeCleanup(kafka.zk.ZKEphemeralTest)
[info] Test Passed: testEphemeralNodeCleanup(kafka.zk.ZKEphemeralTest)
[info] == core-kafka / kafka.zk.ZKEphemeralTest ==
[info] 
[info] == core-kafka / kafka.log.OffsetIndexTest ==
[info] Test Starting: truncate
[info] Test Passed: truncate
[info] Test Starting: randomLookupTest
[info] Test Passed: randomLookupTest
[info] Test Starting: lookupExtremeCases
[info] Test Passed: lookupExtremeCases
[info] Test Starting: appendTooMany
[info] Test Passed: appendTooMany
[info] Test Starting: testReadOnly
[info] Test Passed: testReadOnly
[info] Test Starting: appendOutOfOrder
[info] Test Passed: appendOutOfOrder
[info] Test Starting: reopenAsReadonly
[info] Test Passed: reopenAsReadonly
[info] == core-kafka / kafka.log.OffsetIndexTest ==
[info] 
[info] == core-kafka / kafka.admin.AdminTest ==
[info] Test Starting: testReplicaAssignment(kafka.admin.AdminTest)
[info] Test Passed: testReplicaAssignment(kafka.admin.AdminTest)
[info] Test Starting: testManualReplicaAssignment(kafka.admin.AdminTest)
[info] Test Passed: testManualReplicaAssignment(kafka.admin.AdminTest)
[info] Test Starting: testTopicCreationInZK(kafka.admin.AdminTest)
[info] Test Passed: testTopicCreationInZK(kafka.admin.AdminTest)
[info] Test Starting: testGetTopicMetadata(kafka.admin.AdminTest)
[info] Test Passed: testGetTopicMetadata(kafka.admin.AdminTest)
[info] == core-kafka / kafka.admin.AdminTest ==
[info] 
[info] == core-kafka / kafka.server.LeaderElectionTest ==
[info] Test Starting: testLeaderElectionAndEpoch(kafka.server.LeaderElectionTest)
[info] Test Passed: testLeaderElectionAndEpoch(kafka.server.LeaderElectionTest)
[info] == core-kafka / kafka.server.LeaderElectionTest ==
[info] 
[info] == core-kafka / kafka.server.ReplicaFetchTest ==
[info] Test Starting: testReplicaFetcherThread(kafka.server.ReplicaFetchTest)
[info] Test Passed: testReplicaFetcherThread(kafka.server.ReplicaFetchTest)
[info] == core-kafka / kafka.server.ReplicaFetchTest ==
[info] 
[info] == core-kafka / kafka.log.LogSegmentTest ==
[info] Test Starting: testReadOnEmptySegment(kafka.log.LogSegmentTest)
[info] Test Passed: testReadOnEmptySegment(kafka.log.LogSegmentTest)
[info] Test Starting: testReadBeforeFirstOffset(kafka.log.LogSegmentTest)
[info] Test Passed: testReadBeforeFirstOffset(kafka.log.LogSegmentTest)
[info] Test Starting: testReadSingleMessage(kafka.log.LogSegmentTest)
[info] Test Passed: testReadSingleMessage(kafka.log.LogSegmentTest)
[info] Test Starting: testReadAfterLast(kafka.log.LogSegmentTest)
[info] Test Passed: testReadAfterLast(kafka.log.LogSegmentTest)
[info] Test Starting: testReadFromGap(kafka.log.LogSegmentTest)
[info] Test Passed: testReadFromGap(kafka.log.LogSegmentTest)
[info] Test Starting: testTruncate(kafka.log.LogSegmentTest)
[info] Test Passed: testTruncate(kafka.log.LogSegmentTest)
[info] Test Starting: testNextOffsetCalculation(kafka.log.LogSegmentTest)
[info] Test Passed: testNextOffsetCalculation(kafka.log.LogSegmentTest)
[info] == core-kafka / kafka.log.LogSegmentTest ==
[info] 
[info] == core-kafka / kafka.server.ISRExpirationTest ==
[info] Test Starting: testISRExpirationForStuckFollowers(kafka.server.ISRExpirationTest)
[info] Test Passed: testISRExpirationForStuckFollowers(kafka.server.ISRExpirationTest)
[info] Test Starting: testISRExpirationForSlowFollowers(kafka.server.ISRExpirationTest)
[info] Test Passed: testISRExpirationForSlowFollowers(kafka.server.ISRExpirationTest)
[info] == core-kafka / kafka.server.ISRExpirationTest ==
[info] 
[info] == core-kafka / kafka.api.RequestResponseSerializationTest ==
[info] Test Starting: testSerializationAndDeserialization
[info] Test Passed: testSerializationAndDeserialization
[info] == core-kafka / kafka.api.RequestResponseSerializationTest ==
[info] 
[info] == core-kafka / kafka.message.MessageCompressionTest ==
[info] Test Starting: testSimpleCompressDecompress
[info] Test Passed: testSimpleCompressDecompress
[info] Test Starting: testComplexCompressDecompress
[info] Test Passed: testComplexCompressDecompress
[info] == core-kafka / kafka.message.MessageCompressionTest ==
[info] 
[info] == core-kafka / test-finish ==
[error] Failed: : Total 151, Failed 1, Errors 0, Passed 150, Skipped 0
[info] == core-kafka / test-finish ==
[info] 
[info] == core-kafka / Test cleanup 1 ==
[info] Deleting directory /tmp/sbt_4590949c
[info] == core-kafka / Test cleanup 1 ==
[info] 
[info] == core-kafka / test-cleanup ==
[info] == core-kafka / test-cleanup ==
[info] 
[info] == java-examples / test-compile ==
[info]   Source analysis: 0 new/modified, 0 indirectly invalidated, 0 removed.
[info] Compiling test sources...
[info] Nothing to compile.
[info]   Post-analysis: 0 classes.
[info] == java-examples / test-compile ==
[info] 
[info] == perf / copy-test-resources ==
[info] == perf / copy-test-resources ==
[info] 
[info] == hadoop consumer / copy-resources ==
[info] == hadoop consumer / copy-resources ==
[info] 
[info] == perf / copy-resources ==
[info] == perf / copy-resources ==
[info] 
[info] == hadoop producer / copy-resources ==
[info] == hadoop producer / copy-resources ==
[error] Error running kafka.server.LogRecoveryTest: Test FAILED
[error] Error running test: One or more subtasks failed
[info] 
[info] Total time: 208 s, completed Oct 8, 2012 8:05:03 PM
[info] 
[info] Total session time: 209 s, completed Oct 8, 2012 8:05:03 PM
[error] Error during build.
Build step 'Execute shell' marked build as failure

Build failed in Jenkins: Kafka-0.8 #59

Posted by Apache Jenkins Server <je...@builds.apache.org>.
See <https://builds.apache.org/job/Kafka-0.8/59/changes>

Changes:

[joestein] KAFKA-508 split out partiondata from fetchresponse and producerrequest

------------------------------------------
[...truncated 643 lines...]
[info] 
[info] == core-kafka / kafka.integration.PrimitiveApiTest ==
[info] Test Starting: testProduceAndMultiFetch(kafka.integration.PrimitiveApiTest)
[info] Test Passed: testProduceAndMultiFetch(kafka.integration.PrimitiveApiTest)
[info] Test Starting: testMultiProduce(kafka.integration.PrimitiveApiTest)
[info] Test Passed: testMultiProduce(kafka.integration.PrimitiveApiTest)
[info] Test Starting: testFetchRequestCanProperlySerialize(kafka.integration.PrimitiveApiTest)
[info] Test Passed: testFetchRequestCanProperlySerialize(kafka.integration.PrimitiveApiTest)
[info] Test Starting: testEmptyFetchRequest(kafka.integration.PrimitiveApiTest)
[info] Test Passed: testEmptyFetchRequest(kafka.integration.PrimitiveApiTest)
[info] Test Starting: testDefaultEncoderProducerAndFetch(kafka.integration.PrimitiveApiTest)
[info] Test Passed: testDefaultEncoderProducerAndFetch(kafka.integration.PrimitiveApiTest)
[info] Test Starting: testDefaultEncoderProducerAndFetchWithCompression(kafka.integration.PrimitiveApiTest)
[info] Test Passed: testDefaultEncoderProducerAndFetchWithCompression(kafka.integration.PrimitiveApiTest)
[info] Test Starting: testProduceAndMultiFetchWithCompression(kafka.integration.PrimitiveApiTest)
[info] Test Passed: testProduceAndMultiFetchWithCompression(kafka.integration.PrimitiveApiTest)
[info] Test Starting: testMultiProduceWithCompression(kafka.integration.PrimitiveApiTest)
[info] Test Passed: testMultiProduceWithCompression(kafka.integration.PrimitiveApiTest)
[info] Test Starting: testConsumerEmptyTopic(kafka.integration.PrimitiveApiTest)
[info] Test Passed: testConsumerEmptyTopic(kafka.integration.PrimitiveApiTest)
[info] == core-kafka / kafka.integration.PrimitiveApiTest ==
[info] 
[info] == core-kafka / kafka.javaapi.message.ByteBufferMessageSetTest ==
[info] Test Starting: testWrittenEqualsRead
[info] Test Passed: testWrittenEqualsRead
[info] Test Starting: testIteratorIsConsistent
[info] Test Passed: testIteratorIsConsistent
[info] Test Starting: testSizeInBytes
[info] Test Passed: testSizeInBytes
[info] Test Starting: testEquals
[info] Test Passed: testEquals
[info] Test Starting: testIteratorIsConsistentWithCompression
[info] Test Passed: testIteratorIsConsistentWithCompression
[info] Test Starting: testSizeInBytesWithCompression
[info] Test Passed: testSizeInBytesWithCompression
[info] Test Starting: testEqualsWithCompression
[info] Test Passed: testEqualsWithCompression
[info] == core-kafka / kafka.javaapi.message.ByteBufferMessageSetTest ==
[info] 
[info] == core-kafka / kafka.message.CompressionUtilTest ==
[info] Test Starting: testSimpleCompressDecompress
[info] Test Passed: testSimpleCompressDecompress
[info] Test Starting: testComplexCompressDecompress
[info] Test Passed: testComplexCompressDecompress
[info] Test Starting: testSnappyCompressDecompressExplicit
java.lang.reflect.InvocationTargetException
	at sun.reflect.NativeMethodAccessorImpl.invoke0(Native Method)
	at sun.reflect.NativeMethodAccessorImpl.invoke(NativeMethodAccessorImpl.java:39)
	at sun.reflect.DelegatingMethodAccessorImpl.invoke(DelegatingMethodAccessorImpl.java:25)
	at java.lang.reflect.Method.invoke(Method.java:597)
	at org.xerial.snappy.SnappyLoader.loadNativeLibrary(SnappyLoader.java:317)
	at org.xerial.snappy.SnappyLoader.load(SnappyLoader.java:219)
	at org.xerial.snappy.Snappy.<clinit>(Snappy.java:44)
	at org.xerial.snappy.SnappyOutputStream.<init>(SnappyOutputStream.java:79)
	at org.xerial.snappy.SnappyOutputStream.<init>(SnappyOutputStream.java:66)
	at kafka.message.SnappyCompression.<init>(CompressionUtils.scala:61)
	at kafka.message.CompressionFactory$.apply(CompressionUtils.scala:82)
	at kafka.message.CompressionUtils$.compress(CompressionUtils.scala:109)
	at kafka.message.CompressionUtilTest.testSnappyCompressDecompressExplicit(CompressionUtilsTest.scala:65)
	at sun.reflect.NativeMethodAccessorImpl.invoke0(Native Method)
	at sun.reflect.NativeMethodAccessorImpl.invoke(NativeMethodAccessorImpl.java:39)
	at sun.reflect.DelegatingMethodAccessorImpl.invoke(DelegatingMethodAccessorImpl.java:25)
	at java.lang.reflect.Method.invoke(Method.java:597)
	at org.junit.internal.runners.TestMethodRunner.executeMethodBody(TestMethodRunner.java:99)
	at org.junit.internal.runners.TestMethodRunner.runUnprotected(TestMethodRunner.java:81)
	at org.junit.internal.runners.BeforeAndAfterRunner.runProtected(BeforeAndAfterRunner.java:34)
	at org.junit.internal.runners.TestMethodRunner.runMethod(TestMethodRunner.java:75)
	at org.junit.internal.runners.TestMethodRunner.run(TestMethodRunner.java:45)
	at org.junit.internal.runners.TestClassMethodsRunner.invokeTestMethod(TestClassMethodsRunner.java:71)
	at org.junit.internal.runners.TestClassMethodsRunner.run(TestClassMethodsRunner.java:35)
	at org.junit.internal.runners.TestClassRunner$1.runUnprotected(TestClassRunner.java:42)
	at org.junit.internal.runners.BeforeAndAfterRunner.runProtected(BeforeAndAfterRunner.java:34)
	at org.junit.internal.runners.TestClassRunner.run(TestClassRunner.java:52)
	at org.junit.internal.runners.CompositeRunner.run(CompositeRunner.java:29)
	at org.junit.runner.JUnitCore.run(JUnitCore.java:121)
	at org.junit.runner.JUnitCore.run(JUnitCore.java:100)
	at org.junit.runner.JUnitCore.run(JUnitCore.java:91)
	at org.scalatest.junit.JUnitSuite$class.run(JUnitSuite.scala:261)
	at kafka.message.CompressionUtilTest.run(CompressionUtilsTest.scala:25)
	at org.scalatest.tools.ScalaTestFramework$ScalaTestRunner.run(ScalaTestFramework.scala:40)
	at sbt.TestRunner.run(TestFramework.scala:53)
	at sbt.TestRunner.runTest$1(TestFramework.scala:67)
	at sbt.TestRunner.run(TestFramework.scala:76)
	at sbt.TestFramework$$anonfun$10$$anonfun$apply$11.runTest$2(TestFramework.scala:194)
	at sbt.TestFramework$$anonfun$10$$anonfun$apply$11$$anonfun$apply$12.apply(TestFramework.scala:205)
	at sbt.TestFramework$$anonfun$10$$anonfun$apply$11$$anonfun$apply$12.apply(TestFramework.scala:205)
	at sbt.NamedTestTask.run(TestFramework.scala:92)
	at sbt.ScalaProject$$anonfun$sbt$ScalaProject$$toTask$1.apply(ScalaProject.scala:193)
	at sbt.ScalaProject$$anonfun$sbt$ScalaProject$$toTask$1.apply(ScalaProject.scala:193)
	at sbt.TaskManager$Task.invoke(TaskManager.scala:62)
	at sbt.impl.RunTask.doRun$1(RunTask.scala:77)
	at sbt.impl.RunTask.runTask(RunTask.scala:85)
	at sbt.impl.RunTask.sbt$impl$RunTask$$runIfNotRoot(RunTask.scala:60)
	at sbt.impl.RunTask$$anonfun$runTasksExceptRoot$2.apply(RunTask.scala:48)
	at sbt.impl.RunTask$$anonfun$runTasksExceptRoot$2.apply(RunTask.scala:48)
	at sbt.Distributor$Run$Worker$$anonfun$2.apply(ParallelRunner.scala:131)
	at sbt.Distributor$Run$Worker$$anonfun$2.apply(ParallelRunner.scala:131)
	at sbt.Control$.trapUnit(Control.scala:19)
	at sbt.Distributor$Run$Worker.run(ParallelRunner.scala:131)
Caused by: java.lang.UnsatisfiedLinkError: no snappyjava in java.library.path
	at java.lang.ClassLoader.loadLibrary(ClassLoader.java:1734)
	at java.lang.Runtime.loadLibrary0(Runtime.java:823)
	at java.lang.System.loadLibrary(System.java:1028)
	at org.xerial.snappy.SnappyNativeLoader.loadLibrary(SnappyNativeLoader.java:52)
	... 53 more
[error] Test Failed: testSnappyCompressDecompressExplicit
org.xerial.snappy.SnappyError: [FAILED_TO_LOAD_NATIVE_LIBRARY] null
	at org.xerial.snappy.SnappyLoader.load(SnappyLoader.java:229)
	at org.xerial.snappy.Snappy.<clinit>(Snappy.java:44)
	at org.xerial.snappy.SnappyOutputStream.<init>(SnappyOutputStream.java:79)
	at org.xerial.snappy.SnappyOutputStream.<init>(SnappyOutputStream.java:66)
	at kafka.message.SnappyCompression.<init>(CompressionUtils.scala:61)
	at kafka.message.CompressionFactory$.apply(CompressionUtils.scala:82)
	at kafka.message.CompressionUtils$.compress(CompressionUtils.scala:109)
	at kafka.message.CompressionUtilTest.testSnappyCompressDecompressExplicit(CompressionUtilsTest.scala:65)
	at sun.reflect.NativeMethodAccessorImpl.invoke0(Native Method)
	at sun.reflect.NativeMethodAccessorImpl.invoke(NativeMethodAccessorImpl.java:39)
	at sun.reflect.DelegatingMethodAccessorImpl.invoke(DelegatingMethodAccessorImpl.java:25)
	at java.lang.reflect.Method.invoke(Method.java:597)
	at org.junit.internal.runners.TestMethodRunner.executeMethodBody(TestMethodRunner.java:99)
	at org.junit.internal.runners.TestMethodRunner.runUnprotected(TestMethodRunner.java:81)
	at org.junit.internal.runners.BeforeAndAfterRunner.runProtected(BeforeAndAfterRunner.java:34)
	at org.junit.internal.runners.TestMethodRunner.runMethod(TestMethodRunner.java:75)
	at org.junit.internal.runners.TestMethodRunner.run(TestMethodRunner.java:45)
	at org.junit.internal.runners.TestClassMethodsRunner.invokeTestMethod(TestClassMethodsRunner.java:71)
	at org.junit.internal.runners.TestClassMethodsRunner.run(TestClassMethodsRunner.java:35)
	at org.junit.internal.runners.TestClassRunner$1.runUnprotected(TestClassRunner.java:42)
	at org.junit.internal.runners.BeforeAndAfterRunner.runProtected(BeforeAndAfterRunner.java:34)
	at org.junit.internal.runners.TestClassRunner.run(TestClassRunner.java:52)
	at org.junit.internal.runners.CompositeRunner.run(CompositeRunner.java:29)
	at org.junit.runner.JUnitCore.run(JUnitCore.java:121)
	at org.junit.runner.JUnitCore.run(JUnitCore.java:100)
	at org.junit.runner.JUnitCore.run(JUnitCore.java:91)
	at org.scalatest.junit.JUnitSuite$class.run(JUnitSuite.scala:261)
	at kafka.message.CompressionUtilTest.run(CompressionUtilsTest.scala:25)
	at org.scalatest.tools.ScalaTestFramework$ScalaTestRunner.run(ScalaTestFramework.scala:40)
	at sbt.TestRunner.run(TestFramework.scala:53)
	at sbt.TestRunner.runTest$1(TestFramework.scala:67)
	at sbt.TestRunner.run(TestFramework.scala:76)
	at sbt.TestFramework$$anonfun$10$$anonfun$apply$11.runTest$2(TestFramework.scala:194)
	at sbt.TestFramework$$anonfun$10$$anonfun$apply$11$$anonfun$apply$12.apply(TestFramework.scala:205)
	at sbt.TestFramework$$anonfun$10$$anonfun$apply$11$$anonfun$apply$12.apply(TestFramework.scala:205)
	at sbt.NamedTestTask.run(TestFramework.scala:92)
	at sbt.ScalaProject$$anonfun$sbt$ScalaProject$$toTask$1.apply(ScalaProject.scala:193)
	at sbt.ScalaProject$$anonfun$sbt$ScalaProject$$toTask$1.apply(ScalaProject.scala:193)
	at sbt.TaskManager$Task.invoke(TaskManager.scala:62)
	at sbt.impl.RunTask.doRun$1(RunTask.scala:77)
	at sbt.impl.RunTask.runTask(RunTask.scala:85)
	at sbt.impl.RunTask.sbt$impl$RunTask$$runIfNotRoot(RunTask.scala:60)
	at sbt.impl.RunTask$$anonfun$runTasksExceptRoot$2.apply(RunTask.scala:48)
	at sbt.impl.RunTask$$anonfun$runTasksExceptRoot$2.apply(RunTask.scala:48)
	at sbt.Distributor$Run$Worker$$anonfun$2.apply(ParallelRunner.scala:131)
	at sbt.Distributor$Run$Worker$$anonfun$2.apply(ParallelRunner.scala:131)
	at sbt.Control$.trapUnit(Control.scala:19)
	at sbt.Distributor$Run$Worker.run(ParallelRunner.scala:131)
[info] == core-kafka / kafka.message.CompressionUtilTest ==
[info] 
[info] == core-kafka / kafka.log.LogManagerTest ==
[info] Test Starting: testCreateLog(kafka.log.LogManagerTest)
[info] Test Passed: testCreateLog(kafka.log.LogManagerTest)
[info] Test Starting: testGetLog(kafka.log.LogManagerTest)
[info] Test Passed: testGetLog(kafka.log.LogManagerTest)
[info] Test Starting: testCleanupExpiredSegments(kafka.log.LogManagerTest)
[info] Test Passed: testCleanupExpiredSegments(kafka.log.LogManagerTest)
[info] Test Starting: testCleanupSegmentsToMaintainSize(kafka.log.LogManagerTest)
[info] Test Passed: testCleanupSegmentsToMaintainSize(kafka.log.LogManagerTest)
[info] Test Starting: testTimeBasedFlush(kafka.log.LogManagerTest)
[info] Test Passed: testTimeBasedFlush(kafka.log.LogManagerTest)
[info] == core-kafka / kafka.log.LogManagerTest ==
[info] 
[info] == core-kafka / kafka.integration.AutoOffsetResetTest ==
[info] Test Starting: testResetToEarliestWhenOffsetTooHigh(kafka.integration.AutoOffsetResetTest)
[info] Test Passed: testResetToEarliestWhenOffsetTooHigh(kafka.integration.AutoOffsetResetTest)
[info] Test Starting: testResetToEarliestWhenOffsetTooLow(kafka.integration.AutoOffsetResetTest)
[info] Test Passed: testResetToEarliestWhenOffsetTooLow(kafka.integration.AutoOffsetResetTest)
[info] Test Starting: testResetToLatestWhenOffsetTooHigh(kafka.integration.AutoOffsetResetTest)
[info] Test Passed: testResetToLatestWhenOffsetTooHigh(kafka.integration.AutoOffsetResetTest)
[info] Test Starting: testResetToLatestWhenOffsetTooLow(kafka.integration.AutoOffsetResetTest)
[info] Test Passed: testResetToLatestWhenOffsetTooLow(kafka.integration.AutoOffsetResetTest)
[info] == core-kafka / kafka.integration.AutoOffsetResetTest ==
[info] 
[info] == core-kafka / kafka.producer.ProducerTest ==
[info] Test Starting: testUpdateBrokerPartitionInfo(kafka.producer.ProducerTest)
[info] Test Passed: testUpdateBrokerPartitionInfo(kafka.producer.ProducerTest)
[info] Test Starting: testSendToNewTopic(kafka.producer.ProducerTest)
[info] Test Passed: testSendToNewTopic(kafka.producer.ProducerTest)
[info] Test Starting: testSendWithDeadBroker(kafka.producer.ProducerTest)
[info] Test Passed: testSendWithDeadBroker(kafka.producer.ProducerTest)
[info] Test Starting: testAsyncSendCanCorrectlyFailWithTimeout(kafka.producer.ProducerTest)
[info] Test Passed: testAsyncSendCanCorrectlyFailWithTimeout(kafka.producer.ProducerTest)
[info] == core-kafka / kafka.producer.ProducerTest ==
[info] 
[info] == core-kafka / kafka.javaapi.consumer.ZookeeperConsumerConnectorTest ==
[info] Test Starting: testBasic(kafka.javaapi.consumer.ZookeeperConsumerConnectorTest)
[info] Test Passed: testBasic(kafka.javaapi.consumer.ZookeeperConsumerConnectorTest)
[info] == core-kafka / kafka.javaapi.consumer.ZookeeperConsumerConnectorTest ==
[info] 
[info] == core-kafka / kafka.consumer.ZookeeperConsumerConnectorTest ==
[info] Test Starting: testBasic(kafka.consumer.ZookeeperConsumerConnectorTest)
[info] Test Passed: testBasic(kafka.consumer.ZookeeperConsumerConnectorTest)
[info] Test Starting: testCompression(kafka.consumer.ZookeeperConsumerConnectorTest)
[info] Test Passed: testCompression(kafka.consumer.ZookeeperConsumerConnectorTest)
[info] Test Starting: testCompressionSetConsumption(kafka.consumer.ZookeeperConsumerConnectorTest)
[info] Test Passed: testCompressionSetConsumption(kafka.consumer.ZookeeperConsumerConnectorTest)
[info] Test Starting: testConsumerDecoder(kafka.consumer.ZookeeperConsumerConnectorTest)
[info] Test Passed: testConsumerDecoder(kafka.consumer.ZookeeperConsumerConnectorTest)
[info] Test Starting: testLeaderSelectionForPartition(kafka.consumer.ZookeeperConsumerConnectorTest)
[info] Test Passed: testLeaderSelectionForPartition(kafka.consumer.ZookeeperConsumerConnectorTest)
[info] == core-kafka / kafka.consumer.ZookeeperConsumerConnectorTest ==
[info] 
[info] == core-kafka / kafka.message.MessageTest ==
[info] Test Starting: testFieldValues
[info] Test Passed: testFieldValues
[info] Test Starting: testChecksum
[info] Test Passed: testChecksum
[info] Test Starting: testEquality
[info] Test Passed: testEquality
[info] Test Starting: testIsHashable
[info] Test Passed: testIsHashable
[info] == core-kafka / kafka.message.MessageTest ==
[info] 
[info] == core-kafka / kafka.server.ServerShutdownTest ==
[info] Test Starting: testCleanShutdown(kafka.server.ServerShutdownTest)
[info] Test Passed: testCleanShutdown(kafka.server.ServerShutdownTest)
[info] == core-kafka / kafka.server.ServerShutdownTest ==
[info] 
[info] == core-kafka / kafka.network.RpcDataSerializationTest ==
[info] Test Starting: testSerializationAndDeserialization
[info] Test Passed: testSerializationAndDeserialization
[info] == core-kafka / kafka.network.RpcDataSerializationTest ==
[info] 
[info] == core-kafka / test-finish ==
[error] Failed: : Total 136, Failed 1, Errors 0, Passed 135, Skipped 0
[info] == core-kafka / test-finish ==
[info] 
[info] == core-kafka / Test cleanup 1 ==
[info] Deleting directory /var/tmp/sbt_d15c296d
[info] == core-kafka / Test cleanup 1 ==
[info] 
[info] == core-kafka / test-cleanup ==
[info] == core-kafka / test-cleanup ==
[error] Error running kafka.message.CompressionUtilTest: Test FAILED
[error] Error running test: One or more subtasks failed
[info] 
[info] Total time: 212 s, completed Oct 5, 2012 4:30:20 PM
[info] 
[info] Total session time: 213 s, completed Oct 5, 2012 4:30:20 PM
[error] Error during build.
Build step 'Execute shell' marked build as failure

Build failed in Jenkins: Kafka-0.8 #58

Posted by Apache Jenkins Server <je...@builds.apache.org>.
See <https://builds.apache.org/job/Kafka-0.8/58/changes>

Changes:

[junrao] ProducerSendThread calls ListBuffer.size a whole bunch. That is a O(n) operation; patched by David Arthur; reviewed by Jun Rao; kafka-456

------------------------------------------
[...truncated 2277 lines...]
[info] == core-kafka / kafka.javaapi.consumer.ZookeeperConsumerConnectorTest ==
[info] Test Starting: testBasic(kafka.javaapi.consumer.ZookeeperConsumerConnectorTest)
[info] Test Passed: testBasic(kafka.javaapi.consumer.ZookeeperConsumerConnectorTest)
[info] == core-kafka / kafka.javaapi.consumer.ZookeeperConsumerConnectorTest ==
[info] 
[info] == core-kafka / kafka.integration.PrimitiveApiTest ==
[info] Test Starting: testFetchRequestCanProperlySerialize(kafka.integration.PrimitiveApiTest)
[info] Test Passed: testFetchRequestCanProperlySerialize(kafka.integration.PrimitiveApiTest)
[info] Test Starting: testEmptyFetchRequest(kafka.integration.PrimitiveApiTest)
[info] Test Passed: testEmptyFetchRequest(kafka.integration.PrimitiveApiTest)
[info] Test Starting: testDefaultEncoderProducerAndFetch(kafka.integration.PrimitiveApiTest)
[info] Test Passed: testDefaultEncoderProducerAndFetch(kafka.integration.PrimitiveApiTest)
[info] Test Starting: testDefaultEncoderProducerAndFetchWithCompression(kafka.integration.PrimitiveApiTest)
[info] Test Passed: testDefaultEncoderProducerAndFetchWithCompression(kafka.integration.PrimitiveApiTest)
[info] Test Starting: testProduceAndMultiFetch(kafka.integration.PrimitiveApiTest)
[info] Test Passed: testProduceAndMultiFetch(kafka.integration.PrimitiveApiTest)
[info] Test Starting: testProduceAndMultiFetchWithCompression(kafka.integration.PrimitiveApiTest)
[info] Test Passed: testProduceAndMultiFetchWithCompression(kafka.integration.PrimitiveApiTest)
[info] Test Starting: testMultiProduce(kafka.integration.PrimitiveApiTest)
[info] Test Passed: testMultiProduce(kafka.integration.PrimitiveApiTest)
[info] Test Starting: testMultiProduceWithCompression(kafka.integration.PrimitiveApiTest)
[info] Test Passed: testMultiProduceWithCompression(kafka.integration.PrimitiveApiTest)
[info] Test Starting: testConsumerEmptyTopic(kafka.integration.PrimitiveApiTest)
[info] Test Passed: testConsumerEmptyTopic(kafka.integration.PrimitiveApiTest)
[info] == core-kafka / kafka.integration.PrimitiveApiTest ==
[info] 
[info] == core-kafka / kafka.admin.AdminTest ==
[info] Test Starting: testReplicaAssignment(kafka.admin.AdminTest)
[info] Test Passed: testReplicaAssignment(kafka.admin.AdminTest)
[info] Test Starting: testManualReplicaAssignment(kafka.admin.AdminTest)
[info] Test Passed: testManualReplicaAssignment(kafka.admin.AdminTest)
[info] Test Starting: testTopicCreationInZK(kafka.admin.AdminTest)
[info] Test Passed: testTopicCreationInZK(kafka.admin.AdminTest)
[info] Test Starting: testGetTopicMetadata(kafka.admin.AdminTest)
[info] Test Passed: testGetTopicMetadata(kafka.admin.AdminTest)
[info] == core-kafka / kafka.admin.AdminTest ==
[info] 
[info] == core-kafka / kafka.consumer.ZookeeperConsumerConnectorTest ==
[info] Test Starting: testBasic(kafka.consumer.ZookeeperConsumerConnectorTest)
[info] Test Passed: testBasic(kafka.consumer.ZookeeperConsumerConnectorTest)
[info] Test Starting: testCompression(kafka.consumer.ZookeeperConsumerConnectorTest)
[info] Test Passed: testCompression(kafka.consumer.ZookeeperConsumerConnectorTest)
[info] Test Starting: testCompressionSetConsumption(kafka.consumer.ZookeeperConsumerConnectorTest)
[info] Test Passed: testCompressionSetConsumption(kafka.consumer.ZookeeperConsumerConnectorTest)
[info] Test Starting: testConsumerDecoder(kafka.consumer.ZookeeperConsumerConnectorTest)
[info] Test Passed: testConsumerDecoder(kafka.consumer.ZookeeperConsumerConnectorTest)
[info] Test Starting: testLeaderSelectionForPartition(kafka.consumer.ZookeeperConsumerConnectorTest)
[info] Test Passed: testLeaderSelectionForPartition(kafka.consumer.ZookeeperConsumerConnectorTest)
[info] == core-kafka / kafka.consumer.ZookeeperConsumerConnectorTest ==
[info] 
[info] == core-kafka / kafka.server.ReplicaFetchTest ==
[info] Test Starting: testReplicaFetcherThread(kafka.server.ReplicaFetchTest)
[info] Test Passed: testReplicaFetcherThread(kafka.server.ReplicaFetchTest)
[info] == core-kafka / kafka.server.ReplicaFetchTest ==
[info] 
[info] == core-kafka / kafka.server.RequestPurgatoryTest ==
[info] Test Starting: testRequestSatisfaction(kafka.server.RequestPurgatoryTest)
[info] Test Passed: testRequestSatisfaction(kafka.server.RequestPurgatoryTest)
[info] Test Starting: testRequestExpiry(kafka.server.RequestPurgatoryTest)
[info] Test Passed: testRequestExpiry(kafka.server.RequestPurgatoryTest)
[info] == core-kafka / kafka.server.RequestPurgatoryTest ==
[info] 
[info] == core-kafka / kafka.log.LogOffsetTest ==
[info] Test Starting: testGetOffsetsForUnknownTopic(kafka.log.LogOffsetTest)
[info] Test Passed: testGetOffsetsForUnknownTopic(kafka.log.LogOffsetTest)
[info] Test Starting: testGetOffsetsBeforeLatestTime(kafka.log.LogOffsetTest)
[info] Test Passed: testGetOffsetsBeforeLatestTime(kafka.log.LogOffsetTest)
[info] Test Starting: testEmptyLogsGetOffsets(kafka.log.LogOffsetTest)
[info] Test Passed: testEmptyLogsGetOffsets(kafka.log.LogOffsetTest)
[info] Test Starting: testGetOffsetsBeforeNow(kafka.log.LogOffsetTest)
[info] Test Passed: testGetOffsetsBeforeNow(kafka.log.LogOffsetTest)
[info] Test Starting: testGetOffsetsBeforeEarliestTime(kafka.log.LogOffsetTest)
[info] Test Passed: testGetOffsetsBeforeEarliestTime(kafka.log.LogOffsetTest)
[info] == core-kafka / kafka.log.LogOffsetTest ==
[info] 
[info] == core-kafka / kafka.producer.ProducerTest ==
[info] Test Starting: testUpdateBrokerPartitionInfo(kafka.producer.ProducerTest)
[info] Test Passed: testUpdateBrokerPartitionInfo(kafka.producer.ProducerTest)
[info] Test Starting: testSendToNewTopic(kafka.producer.ProducerTest)
[info] Test Passed: testSendToNewTopic(kafka.producer.ProducerTest)
[info] Test Starting: testSendWithDeadBroker(kafka.producer.ProducerTest)
[info] Test Passed: testSendWithDeadBroker(kafka.producer.ProducerTest)
[info] Test Starting: testAsyncSendCanCorrectlyFailWithTimeout(kafka.producer.ProducerTest)
[info] Test Passed: testAsyncSendCanCorrectlyFailWithTimeout(kafka.producer.ProducerTest)
[info] == core-kafka / kafka.producer.ProducerTest ==
[info] 
[info] == core-kafka / kafka.integration.LazyInitProducerTest ==
[info] Test Starting: testProduceAndMultiFetch(kafka.integration.LazyInitProducerTest)
[info] Test Passed: testProduceAndMultiFetch(kafka.integration.LazyInitProducerTest)
[info] Test Starting: testMultiProduce(kafka.integration.LazyInitProducerTest)
[info] Test Passed: testMultiProduce(kafka.integration.LazyInitProducerTest)
[info] Test Starting: testProduceAndFetch(kafka.integration.LazyInitProducerTest)
[info] Test Passed: testProduceAndFetch(kafka.integration.LazyInitProducerTest)
[info] Test Starting: testMultiProduceResend(kafka.integration.LazyInitProducerTest)
[info] Test Passed: testMultiProduceResend(kafka.integration.LazyInitProducerTest)
[info] == core-kafka / kafka.integration.LazyInitProducerTest ==
[info] 
[info] == core-kafka / kafka.message.MessageTest ==
[info] Test Starting: testFieldValues
[info] Test Passed: testFieldValues
[info] Test Starting: testChecksum
[info] Test Passed: testChecksum
[info] Test Starting: testEquality
[info] Test Passed: testEquality
[info] Test Starting: testIsHashable
[info] Test Passed: testIsHashable
[info] == core-kafka / kafka.message.MessageTest ==
[info] 
[info] == core-kafka / kafka.server.HighwatermarkPersistenceTest ==
[info] Test Starting: testHighWatermarkPersistenceSinglePartition(kafka.server.HighwatermarkPersistenceTest)
[info] Test Passed: testHighWatermarkPersistenceSinglePartition(kafka.server.HighwatermarkPersistenceTest)
[info] Test Starting: testHighWatermarkPersistenceMultiplePartitions(kafka.server.HighwatermarkPersistenceTest)
[info] Test Passed: testHighWatermarkPersistenceMultiplePartitions(kafka.server.HighwatermarkPersistenceTest)
[info] == core-kafka / kafka.server.HighwatermarkPersistenceTest ==
[info] 
[info] == core-kafka / kafka.integration.AutoOffsetResetTest ==
[info] Test Starting: testResetToEarliestWhenOffsetTooHigh(kafka.integration.AutoOffsetResetTest)
[info] Test Passed: testResetToEarliestWhenOffsetTooHigh(kafka.integration.AutoOffsetResetTest)
[info] Test Starting: testResetToEarliestWhenOffsetTooLow(kafka.integration.AutoOffsetResetTest)
[info] Test Passed: testResetToEarliestWhenOffsetTooLow(kafka.integration.AutoOffsetResetTest)
[info] Test Starting: testResetToLatestWhenOffsetTooHigh(kafka.integration.AutoOffsetResetTest)
[info] Test Passed: testResetToLatestWhenOffsetTooHigh(kafka.integration.AutoOffsetResetTest)
[info] Test Starting: testResetToLatestWhenOffsetTooLow(kafka.integration.AutoOffsetResetTest)
[info] Test Passed: testResetToLatestWhenOffsetTooLow(kafka.integration.AutoOffsetResetTest)
[info] == core-kafka / kafka.integration.AutoOffsetResetTest ==
[info] 
[info] == core-kafka / kafka.server.ServerShutdownTest ==
[info] Test Starting: testCleanShutdown(kafka.server.ServerShutdownTest)
[info] Test Passed: testCleanShutdown(kafka.server.ServerShutdownTest)
[info] == core-kafka / kafka.server.ServerShutdownTest ==
[info] 
[info] == core-kafka / kafka.consumer.FetcherTest ==
[info] Test Starting: testFetcher(kafka.consumer.FetcherTest)
[info] Test Passed: testFetcher(kafka.consumer.FetcherTest)
[info] == core-kafka / kafka.consumer.FetcherTest ==
[info] 
[info] == core-kafka / kafka.producer.SyncProducerTest ==
[info] Test Starting: testMessageSizeTooLarge(kafka.producer.SyncProducerTest)
[info] Test Passed: testMessageSizeTooLarge(kafka.producer.SyncProducerTest)
[info] Test Starting: testReachableServer(kafka.producer.SyncProducerTest)
[info] Test Passed: testReachableServer(kafka.producer.SyncProducerTest)
[info] Test Starting: testEmptyProduceRequest(kafka.producer.SyncProducerTest)
[info] Test Passed: testEmptyProduceRequest(kafka.producer.SyncProducerTest)
[info] Test Starting: testProduceCorrectlyReceivesResponse(kafka.producer.SyncProducerTest)
[info] Test Passed: testProduceCorrectlyReceivesResponse(kafka.producer.SyncProducerTest)
[info] Test Starting: testProducerCanTimeout(kafka.producer.SyncProducerTest)
[info] Test Passed: testProducerCanTimeout(kafka.producer.SyncProducerTest)
[info] == core-kafka / kafka.producer.SyncProducerTest ==
[info] 
[info] == core-kafka / unit.kafka.metrics.KafkaTimerTest ==
[info] Test Starting: testKafkaTimer(unit.kafka.metrics.KafkaTimerTest)
[info] Test Passed: testKafkaTimer(unit.kafka.metrics.KafkaTimerTest)
[info] == core-kafka / unit.kafka.metrics.KafkaTimerTest ==
[info] 
[info] == core-kafka / kafka.log.LogTest ==
[info] Test Starting: testTimeBasedLogRoll
[info] Test Passed: testTimeBasedLogRoll
[info] Test Starting: testSizeBasedLogRoll
[info] Test Passed: testSizeBasedLogRoll
[info] Test Starting: testLoadEmptyLog
[info] Test Passed: testLoadEmptyLog
[info] Test Starting: testLoadInvalidLogsFails
[info] Test Passed: testLoadInvalidLogsFails
[info] Test Starting: testAppendAndRead
[info] Test Passed: testAppendAndRead
[info] Test Starting: testReadOutOfRange
[info] Test Passed: testReadOutOfRange
[info] Test Starting: testLogRolls
[info] Test Passed: testLogRolls
[info] Test Starting: testFindSegment
[info] Test Passed: testFindSegment
[info] Test Starting: testEdgeLogRolls
[info] Test Passed: testEdgeLogRolls
[info] Test Starting: testMessageSizeCheck
[info] Test Passed: testMessageSizeCheck
[info] Test Starting: testTruncateTo
[info] Test Passed: testTruncateTo
[info] == core-kafka / kafka.log.LogTest ==
[info] 
[info] == core-kafka / kafka.server.LogRecoveryTest ==
[info] Test Starting: testHWCheckpointNoFailuresSingleLogSegment(kafka.server.LogRecoveryTest)
[info] Test Passed: testHWCheckpointNoFailuresSingleLogSegment(kafka.server.LogRecoveryTest)
[info] Test Starting: testHWCheckpointWithFailuresSingleLogSegment(kafka.server.LogRecoveryTest)
[error] Test Failed: testHWCheckpointWithFailuresSingleLogSegment(kafka.server.LogRecoveryTest)
java.lang.AssertionError: expected:<60> but was:<30>
	at org.junit.Assert.fail(Assert.java:69)
	at org.junit.Assert.failNotEquals(Assert.java:314)
	at org.junit.Assert.assertEquals(Assert.java:94)
	at org.junit.Assert.assertEquals(Assert.java:104)
	at kafka.server.LogRecoveryTest.testHWCheckpointWithFailuresSingleLogSegment(LogRecoveryTest.scala:150)
	at sun.reflect.NativeMethodAccessorImpl.invoke0(Native Method)
	at sun.reflect.NativeMethodAccessorImpl.invoke(NativeMethodAccessorImpl.java:39)
	at sun.reflect.DelegatingMethodAccessorImpl.invoke(DelegatingMethodAccessorImpl.java:25)
	at java.lang.reflect.Method.invoke(Method.java:597)
	at junit.framework.TestCase.runTest(TestCase.java:164)
	at junit.framework.TestCase.runBare(TestCase.java:130)
	at junit.framework.TestResult$1.protect(TestResult.java:110)
	at junit.framework.TestResult.runProtected(TestResult.java:128)
	at junit.framework.TestResult.run(TestResult.java:113)
	at junit.framework.TestCase.run(TestCase.java:120)
	at junit.framework.TestSuite.runTest(TestSuite.java:228)
	at junit.framework.TestSuite.run(TestSuite.java:223)
	at junit.framework.TestSuite.runTest(TestSuite.java:228)
	at junit.framework.TestSuite.run(TestSuite.java:223)
	at org.scalatest.junit.JUnit3Suite.run(JUnit3Suite.scala:309)
	at org.scalatest.tools.ScalaTestFramework$ScalaTestRunner.run(ScalaTestFramework.scala:40)
	at sbt.TestRunner.run(TestFramework.scala:53)
	at sbt.TestRunner.runTest$1(TestFramework.scala:67)
	at sbt.TestRunner.run(TestFramework.scala:76)
	at sbt.TestFramework$$anonfun$10$$anonfun$apply$11.runTest$2(TestFramework.scala:194)
	at sbt.TestFramework$$anonfun$10$$anonfun$apply$11$$anonfun$apply$12.apply(TestFramework.scala:205)
	at sbt.TestFramework$$anonfun$10$$anonfun$apply$11$$anonfun$apply$12.apply(TestFramework.scala:205)
	at sbt.NamedTestTask.run(TestFramework.scala:92)
	at sbt.ScalaProject$$anonfun$sbt$ScalaProject$$toTask$1.apply(ScalaProject.scala:193)
	at sbt.ScalaProject$$anonfun$sbt$ScalaProject$$toTask$1.apply(ScalaProject.scala:193)
	at sbt.TaskManager$Task.invoke(TaskManager.scala:62)
	at sbt.impl.RunTask.doRun$1(RunTask.scala:77)
	at sbt.impl.RunTask.runTask(RunTask.scala:85)
	at sbt.impl.RunTask.sbt$impl$RunTask$$runIfNotRoot(RunTask.scala:60)
	at sbt.impl.RunTask$$anonfun$runTasksExceptRoot$2.apply(RunTask.scala:48)
	at sbt.impl.RunTask$$anonfun$runTasksExceptRoot$2.apply(RunTask.scala:48)
	at sbt.Distributor$Run$Worker$$anonfun$2.apply(ParallelRunner.scala:131)
	at sbt.Distributor$Run$Worker$$anonfun$2.apply(ParallelRunner.scala:131)
	at sbt.Control$.trapUnit(Control.scala:19)
	at sbt.Distributor$Run$Worker.run(ParallelRunner.scala:131)
[info] Test Starting: testHWCheckpointNoFailuresMultipleLogSegments(kafka.server.LogRecoveryTest)
[info] Test Passed: testHWCheckpointNoFailuresMultipleLogSegments(kafka.server.LogRecoveryTest)
[info] Test Starting: testHWCheckpointWithFailuresMultipleLogSegments(kafka.server.LogRecoveryTest)
[info] Test Passed: testHWCheckpointWithFailuresMultipleLogSegments(kafka.server.LogRecoveryTest)
[info] == core-kafka / kafka.server.LogRecoveryTest ==
[info] 
[info] == core-kafka / test-finish ==
[error] Failed: : Total 136, Failed 1, Errors 0, Passed 135, Skipped 0
[info] == core-kafka / test-finish ==
[info] 
[info] == core-kafka / Test cleanup 1 ==
[info] Deleting directory /tmp/sbt_8cf6258
[info] == core-kafka / Test cleanup 1 ==
[info] 
[info] == core-kafka / test-cleanup ==
[info] == core-kafka / test-cleanup ==
[error] Error running kafka.server.LogRecoveryTest: Test FAILED
[error] Error running test: One or more subtasks failed
[info] 
[info] Total time: 275 s, completed Oct 4, 2012 6:11:37 PM
[info] 
[info] Total session time: 276 s, completed Oct 4, 2012 6:11:37 PM
[error] Error during build.
Build step 'Execute shell' marked build as failure

Build failed in Jenkins: Kafka-0.8 #57

Posted by Apache Jenkins Server <je...@builds.apache.org>.
See <https://builds.apache.org/job/Kafka-0.8/57/changes>

Changes:

[junrao] log.append() should halt on IOException; patched by Jun Rao; reviewed by Jay Kreps; KAFKA-540

------------------------------------------
[...truncated 5648 lines...]
	at java.lang.Thread.run(Thread.java:662)
[2012-10-04 04:13:57,980] ERROR [KafkaApi-0] Error processing ProducerRequest on topic3:0 (kafka.server.KafkaApis:102)
kafka.common.UnknownTopicOrPartitionException: Topic topic3 partition 0 doesn't exist on 0
	at kafka.server.ReplicaManager.getLeaderReplicaIfLocal(ReplicaManager.scala:117)
	at kafka.server.KafkaApis$$anonfun$5.apply(KafkaApis.scala:171)
	at kafka.server.KafkaApis$$anonfun$5.apply(KafkaApis.scala:165)
	at scala.collection.TraversableLike$$anonfun$map$1.apply(TraversableLike.scala:206)
	at scala.collection.TraversableLike$$anonfun$map$1.apply(TraversableLike.scala:206)
	at scala.collection.immutable.Map$Map3.foreach(Map.scala:152)
	at scala.collection.TraversableLike$class.map(TraversableLike.scala:206)
	at scala.collection.immutable.Map$Map3.map(Map.scala:132)
	at kafka.server.KafkaApis.produceToLocalLog(KafkaApis.scala:165)
	at kafka.server.KafkaApis.handleProducerRequest(KafkaApis.scala:122)
	at kafka.server.KafkaApis.handle(KafkaApis.scala:56)
	at kafka.server.KafkaRequestHandler.run(KafkaRequestHandler.scala:40)
	at java.lang.Thread.run(Thread.java:662)
[2012-10-04 04:13:57,980] ERROR [KafkaApi-0] Error processing ProducerRequest on topic2:0 (kafka.server.KafkaApis:102)
kafka.common.UnknownTopicOrPartitionException: Topic topic2 partition 0 doesn't exist on 0
	at kafka.server.ReplicaManager.getLeaderReplicaIfLocal(ReplicaManager.scala:117)
	at kafka.server.KafkaApis$$anonfun$5.apply(KafkaApis.scala:171)
	at kafka.server.KafkaApis$$anonfun$5.apply(KafkaApis.scala:165)
	at scala.collection.TraversableLike$$anonfun$map$1.apply(TraversableLike.scala:206)
	at scala.collection.TraversableLike$$anonfun$map$1.apply(TraversableLike.scala:206)
	at scala.collection.immutable.Map$Map3.foreach(Map.scala:152)
	at scala.collection.TraversableLike$class.map(TraversableLike.scala:206)
	at scala.collection.immutable.Map$Map3.map(Map.scala:132)
	at kafka.server.KafkaApis.produceToLocalLog(KafkaApis.scala:165)
	at kafka.server.KafkaApis.handleProducerRequest(KafkaApis.scala:122)
	at kafka.server.KafkaApis.handle(KafkaApis.scala:56)
	at kafka.server.KafkaRequestHandler.run(KafkaRequestHandler.scala:40)
	at java.lang.Thread.run(Thread.java:662)
[2012-10-04 04:13:59,001] ERROR [KafkaApi-0] Error processing ProducerRequest on topic2:0 (kafka.server.KafkaApis:102)
kafka.common.UnknownTopicOrPartitionException: Topic topic2 partition 0 doesn't exist on 0
	at kafka.server.ReplicaManager.getLeaderReplicaIfLocal(ReplicaManager.scala:117)
	at kafka.server.KafkaApis$$anonfun$5.apply(KafkaApis.scala:171)
	at kafka.server.KafkaApis$$anonfun$5.apply(KafkaApis.scala:165)
	at scala.collection.TraversableLike$$anonfun$map$1.apply(TraversableLike.scala:206)
	at scala.collection.TraversableLike$$anonfun$map$1.apply(TraversableLike.scala:206)
	at scala.collection.immutable.Map$Map3.foreach(Map.scala:152)
	at scala.collection.TraversableLike$class.map(TraversableLike.scala:206)
	at scala.collection.immutable.Map$Map3.map(Map.scala:132)
	at kafka.server.KafkaApis.produceToLocalLog(KafkaApis.scala:165)
	at kafka.server.KafkaApis.handleProducerRequest(KafkaApis.scala:122)
	at kafka.server.KafkaApis.handle(KafkaApis.scala:56)
	at kafka.server.KafkaRequestHandler.run(KafkaRequestHandler.scala:40)
	at java.lang.Thread.run(Thread.java:662)
[info] Test Passed: testProduceCorrectlyReceivesResponse(kafka.producer.SyncProducerTest)
[info] Test Starting: testProducerCanTimeout(kafka.producer.SyncProducerTest)
[info] Test Passed: testProducerCanTimeout(kafka.producer.SyncProducerTest)
[info] == core-kafka / kafka.producer.SyncProducerTest ==
[info] 
[info] == core-kafka / kafka.network.SocketServerTest ==
[info] Test Starting: simpleRequest
[2012-10-04 04:13:59,579] ERROR Unable to open socket to localhost/127.0.0.1:2182 (org.apache.zookeeper.ClientCnxn:1076)
[2012-10-04 04:13:59,579] WARN Session 0x13a29f95fb70002 for server null, unexpected error, closing socket connection and attempting reconnect (org.apache.zookeeper.ClientCnxn:1188)
java.net.ConnectException: Connection refused
	at sun.nio.ch.Net.connect(Native Method)
	at sun.nio.ch.SocketChannelImpl.connect(SocketChannelImpl.java:507)
	at org.apache.zookeeper.ClientCnxn$SendThread.startConnect(ClientCnxn.java:1071)
	at org.apache.zookeeper.ClientCnxn$SendThread.run(ClientCnxn.java:1104)
[info] Test Passed: simpleRequest
[info] Test Starting: tooBigRequestIsRejected
[info] Test Passed: tooBigRequestIsRejected
[info] == core-kafka / kafka.network.SocketServerTest ==
[info] 
[info] == core-kafka / kafka.log4j.KafkaLog4jAppenderTest ==
[info] Test Starting: testKafkaLog4jConfigs(kafka.log4j.KafkaLog4jAppenderTest)
log4j:WARN No appenders could be found for logger (org.I0Itec.zkclient.ZkEventThread).
log4j:WARN Please initialize the log4j system properly.
[info] Test Passed: testKafkaLog4jConfigs(kafka.log4j.KafkaLog4jAppenderTest)
[info] Test Starting: testLog4jAppends(kafka.log4j.KafkaLog4jAppenderTest)
[info] Test Passed: testLog4jAppends(kafka.log4j.KafkaLog4jAppenderTest)
[info] == core-kafka / kafka.log4j.KafkaLog4jAppenderTest ==
[info] 
[info] == core-kafka / kafka.log.LogManagerTest ==
[info] Test Starting: testCreateLog(kafka.log.LogManagerTest)
[info] Test Passed: testCreateLog(kafka.log.LogManagerTest)
[info] Test Starting: testGetLog(kafka.log.LogManagerTest)
[info] Test Passed: testGetLog(kafka.log.LogManagerTest)
[info] Test Starting: testCleanupExpiredSegments(kafka.log.LogManagerTest)
[info] Test Passed: testCleanupExpiredSegments(kafka.log.LogManagerTest)
[info] Test Starting: testCleanupSegmentsToMaintainSize(kafka.log.LogManagerTest)
[info] Test Passed: testCleanupSegmentsToMaintainSize(kafka.log.LogManagerTest)
[info] Test Starting: testTimeBasedFlush(kafka.log.LogManagerTest)
[info] Test Passed: testTimeBasedFlush(kafka.log.LogManagerTest)
[info] == core-kafka / kafka.log.LogManagerTest ==
[info] 
[info] == core-kafka / kafka.javaapi.consumer.ZookeeperConsumerConnectorTest ==
[info] Test Starting: testBasic(kafka.javaapi.consumer.ZookeeperConsumerConnectorTest)
[info] Test Passed: testBasic(kafka.javaapi.consumer.ZookeeperConsumerConnectorTest)
[info] == core-kafka / kafka.javaapi.consumer.ZookeeperConsumerConnectorTest ==
[info] 
[info] == core-kafka / kafka.server.ReplicaFetchTest ==
[info] Test Starting: testReplicaFetcherThread(kafka.server.ReplicaFetchTest)
[info] Test Passed: testReplicaFetcherThread(kafka.server.ReplicaFetchTest)
[info] == core-kafka / kafka.server.ReplicaFetchTest ==
[info] 
[info] == core-kafka / kafka.server.HighwatermarkPersistenceTest ==
[info] Test Starting: testHighWatermarkPersistenceSinglePartition(kafka.server.HighwatermarkPersistenceTest)
[info] Test Passed: testHighWatermarkPersistenceSinglePartition(kafka.server.HighwatermarkPersistenceTest)
[info] Test Starting: testHighWatermarkPersistenceMultiplePartitions(kafka.server.HighwatermarkPersistenceTest)
[info] Test Passed: testHighWatermarkPersistenceMultiplePartitions(kafka.server.HighwatermarkPersistenceTest)
[info] == core-kafka / kafka.server.HighwatermarkPersistenceTest ==
[info] 
[info] == core-kafka / kafka.log.LogTest ==
[info] Test Starting: testTimeBasedLogRoll
[info] Test Passed: testTimeBasedLogRoll
[info] Test Starting: testSizeBasedLogRoll
[info] Test Passed: testSizeBasedLogRoll
[info] Test Starting: testLoadEmptyLog
[info] Test Passed: testLoadEmptyLog
[info] Test Starting: testLoadInvalidLogsFails
[info] Test Passed: testLoadInvalidLogsFails
[info] Test Starting: testAppendAndRead
[info] Test Passed: testAppendAndRead
[info] Test Starting: testReadOutOfRange
[info] Test Passed: testReadOutOfRange
[info] Test Starting: testLogRolls
[info] Test Passed: testLogRolls
[info] Test Starting: testFindSegment
[info] Test Passed: testFindSegment
[info] Test Starting: testEdgeLogRolls
[info] Test Passed: testEdgeLogRolls
[info] Test Starting: testMessageSizeCheck
[info] Test Passed: testMessageSizeCheck
[info] Test Starting: testTruncateTo
[info] Test Passed: testTruncateTo
[info] == core-kafka / kafka.log.LogTest ==
[info] 
[info] == core-kafka / kafka.message.FileMessageSetTest ==
[info] Test Starting: testWrittenEqualsRead
[info] Test Passed: testWrittenEqualsRead
[info] Test Starting: testIteratorIsConsistent
[info] Test Passed: testIteratorIsConsistent
[info] Test Starting: testSizeInBytes
[info] Test Passed: testSizeInBytes
[info] Test Starting: testWriteTo
[info] Test Passed: testWriteTo
[info] Test Starting: testFileSize
[info] Test Passed: testFileSize
[info] Test Starting: testIterationOverPartialAndTruncation
[info] Test Passed: testIterationOverPartialAndTruncation
[info] Test Starting: testIterationDoesntChangePosition
[info] Test Passed: testIterationDoesntChangePosition
[info] Test Starting: testRead
[info] Test Passed: testRead
[info] == core-kafka / kafka.message.FileMessageSetTest ==
[info] 
[info] == core-kafka / kafka.server.ServerShutdownTest ==
[info] Test Starting: testCleanShutdown(kafka.server.ServerShutdownTest)
[info] Test Passed: testCleanShutdown(kafka.server.ServerShutdownTest)
[info] == core-kafka / kafka.server.ServerShutdownTest ==
[info] 
[info] == core-kafka / kafka.admin.AdminTest ==
[info] Test Starting: testReplicaAssignment(kafka.admin.AdminTest)
[info] Test Passed: testReplicaAssignment(kafka.admin.AdminTest)
[info] Test Starting: testManualReplicaAssignment(kafka.admin.AdminTest)
[info] Test Passed: testManualReplicaAssignment(kafka.admin.AdminTest)
[info] Test Starting: testTopicCreationInZK(kafka.admin.AdminTest)
[info] Test Passed: testTopicCreationInZK(kafka.admin.AdminTest)
[info] Test Starting: testGetTopicMetadata(kafka.admin.AdminTest)
[info] Test Passed: testGetTopicMetadata(kafka.admin.AdminTest)
[info] == core-kafka / kafka.admin.AdminTest ==
[info] 
[info] == core-kafka / kafka.message.MessageTest ==
[info] Test Starting: testFieldValues
[info] Test Passed: testFieldValues
[info] Test Starting: testChecksum
[info] Test Passed: testChecksum
[info] Test Starting: testEquality
[info] Test Passed: testEquality
[info] Test Starting: testIsHashable
[info] Test Passed: testIsHashable
[info] == core-kafka / kafka.message.MessageTest ==
[info] 
[info] == core-kafka / kafka.consumer.TopicFilterTest ==
[info] Test Starting: testWhitelists
[info] Test Passed: testWhitelists
[info] Test Starting: testBlacklists
[info] Test Passed: testBlacklists
[info] == core-kafka / kafka.consumer.TopicFilterTest ==
[info] 
[info] == core-kafka / kafka.zk.ZKEphemeralTest ==
[info] Test Starting: testEphemeralNodeCleanup(kafka.zk.ZKEphemeralTest)
[info] Test Passed: testEphemeralNodeCleanup(kafka.zk.ZKEphemeralTest)
[info] == core-kafka / kafka.zk.ZKEphemeralTest ==
[info] 
[info] == core-kafka / test-finish ==
[error] Failed: : Total 136, Failed 3, Errors 0, Passed 133, Skipped 0
[info] == core-kafka / test-finish ==
[info] 
[info] == core-kafka / Test cleanup 1 ==
[info] Deleting directory /var/tmp/sbt_b21590b
[info] == core-kafka / Test cleanup 1 ==
[info] 
[info] == core-kafka / test-cleanup ==
[info] == core-kafka / test-cleanup ==
[info] 
[info] == hadoop producer / copy-test-resources ==
[info] == hadoop producer / copy-test-resources ==
[info] 
[info] == hadoop producer / test-compile ==
[info]   Source analysis: 0 new/modified, 0 indirectly invalidated, 0 removed.
[info] Compiling test sources...
[info] Nothing to compile.
[info]   Post-analysis: 0 classes.
[info] == hadoop producer / test-compile ==
[info] 
[info] == java-examples / copy-resources ==
[info] == java-examples / copy-resources ==
[info] 
[info] == hadoop consumer / test-compile ==
[info]   Source analysis: 0 new/modified, 0 indirectly invalidated, 0 removed.
[info] Compiling test sources...
[info] Nothing to compile.
[info]   Post-analysis: 0 classes.
[info] == hadoop consumer / test-compile ==
[info] 
[info] == hadoop consumer / copy-resources ==
[info] == hadoop consumer / copy-resources ==
[info] 
[info] == hadoop consumer / copy-test-resources ==
[info] == hadoop consumer / copy-test-resources ==
[info] 
[info] == perf / copy-test-resources ==
[info] == perf / copy-test-resources ==
[info] 
[info] == java-examples / copy-test-resources ==
[info] == java-examples / copy-test-resources ==
[info] 
[info] == perf / copy-resources ==
[info] == perf / copy-resources ==
[info] 
[info] == perf / test-compile ==
[info]   Source analysis: 0 new/modified, 0 indirectly invalidated, 0 removed.
[info] Compiling test sources...
[info] Nothing to compile.
[info]   Post-analysis: 0 classes.
[info] == perf / test-compile ==
[error] Error running kafka.integration.AutoOffsetResetTest: Test FAILED
[error] Error running kafka.producer.AsyncProducerTest: Test FAILED
[error] Error running kafka.message.CompressionUtilTest: Test FAILED
[error] Error running test: One or more subtasks failed
[info] 
[info] Total time: 192 s, completed Oct 4, 2012 4:14:10 AM
[info] 
[info] Total session time: 193 s, completed Oct 4, 2012 4:14:10 AM
[error] Error during build.
Build step 'Execute shell' marked build as failure