You are viewing a plain text version of this content. The canonical link for it is here.
Posted to notifications@maven.apache.org by Apache Jenkins Server <je...@builds.apache.org> on 2016/02/08 22:19:22 UTC
Build failed in Jenkins: maven-skins » Apache Maven Fluido Skin #235
See <https://builds.apache.org/job/maven-skins/org.apache.maven.skins$maven-fluido-skin/235/>
------------------------------------------
[...truncated 38 lines...]
[INFO] --- maven-resources-plugin:2.6:resources (default-resources) @ maven-fluido-skin ---
[INFO] Using 'UTF-8' encoding to copy filtered resources.
[INFO] Copying 2 resources to META-INF
[INFO] Copying 35 resources
[INFO] Copying 1 resource
[INFO] Copying 2 resources
[INFO] Copying 3 resources
[INFO]
[INFO] --- maven-compiler-plugin:3.1:compile (default-compile) @ maven-fluido-skin ---
[INFO] No sources to compile
[INFO]
[INFO] --- maven-resources-plugin:2.6:testResources (default-testResources) @ maven-fluido-skin ---
[INFO] Using 'UTF-8' encoding to copy filtered resources.
[INFO] skip non existing resourceDirectory <https://builds.apache.org/job/maven-skins/org.apache.maven.skins$maven-fluido-skin/ws/src/test/resources>
[INFO] Copying 3 resources
[INFO]
[INFO] --- maven-compiler-plugin:3.1:testCompile (default-testCompile) @ maven-fluido-skin ---
[INFO] No sources to compile
[INFO]
[INFO] --- maven-surefire-plugin:2.17:test (default-test) @ maven-fluido-skin ---
[JENKINS] Recording test results
[INFO]
[INFO] --- maven-jar-plugin:2.5:jar (default-jar) @ maven-fluido-skin ---
[INFO] Building jar: <https://builds.apache.org/job/maven-skins/org.apache.maven.skins$maven-fluido-skin/ws/target/maven-fluido-skin-1.5-SNAPSHOT.jar>
[INFO]
[INFO] --- maven-site-plugin:3.5-SNAPSHOT:attach-descriptor (attach-descriptor) @ maven-fluido-skin ---
Downloading: http://repository.apache.org/snapshots/org/apache/maven/doxia/doxia-sink-api/1.7-SNAPSHOT/maven-metadata.xml
Downloaded: http://repository.apache.org/snapshots/org/apache/maven/doxia/doxia-sink-api/1.7-SNAPSHOT/maven-metadata.xml (783 B at 5.5 KB/sec)
Downloading: http://repository.apache.org/snapshots/org/apache/maven/doxia/doxia-sink-api/1.7-SNAPSHOT/doxia-sink-api-1.7-20160202.202747-79.pom
Downloaded: http://repository.apache.org/snapshots/org/apache/maven/doxia/doxia-sink-api/1.7-SNAPSHOT/doxia-sink-api-1.7-20160202.202747-79.pom (2 KB at 14.3 KB/sec)
Downloading: http://repository.apache.org/snapshots/org/apache/maven/doxia/doxia/1.7-SNAPSHOT/maven-metadata.xml
Downloaded: http://repository.apache.org/snapshots/org/apache/maven/doxia/doxia/1.7-SNAPSHOT/maven-metadata.xml (812 B at 3.4 KB/sec)
Downloading: http://repository.apache.org/snapshots/org/apache/maven/doxia/doxia/1.7-SNAPSHOT/doxia-1.7-20160202.202716-80.pom
Downloaded: http://repository.apache.org/snapshots/org/apache/maven/doxia/doxia/1.7-SNAPSHOT/doxia-1.7-20160202.202716-80.pom (15 KB at 75.9 KB/sec)
Downloading: http://repository.apache.org/snapshots/org/apache/maven/doxia/doxia-logging-api/1.7-SNAPSHOT/maven-metadata.xml
Downloaded: http://repository.apache.org/snapshots/org/apache/maven/doxia/doxia-logging-api/1.7-SNAPSHOT/maven-metadata.xml (786 B at 9.1 KB/sec)
Downloading: http://repository.apache.org/snapshots/org/apache/maven/doxia/doxia-logging-api/1.7-SNAPSHOT/doxia-logging-api-1.7-20160202.202738-80.pom
Downloaded: http://repository.apache.org/snapshots/org/apache/maven/doxia/doxia-logging-api/1.7-SNAPSHOT/doxia-logging-api-1.7-20160202.202738-80.pom (2 KB at 16.6 KB/sec)
Downloading: http://repository.apache.org/snapshots/org/apache/maven/doxia/doxia-core/1.7-SNAPSHOT/maven-metadata.xml
Downloaded: http://repository.apache.org/snapshots/org/apache/maven/doxia/doxia-core/1.7-SNAPSHOT/maven-metadata.xml (990 B at 13.8 KB/sec)
Downloading: http://repository.apache.org/snapshots/org/apache/maven/doxia/doxia-core/1.7-SNAPSHOT/doxia-core-1.7-20160202.202725-80.pom
Downloaded: http://repository.apache.org/snapshots/org/apache/maven/doxia/doxia-core/1.7-SNAPSHOT/doxia-core-1.7-20160202.202725-80.pom (4 KB at 18.5 KB/sec)
Downloading: http://repository.apache.org/snapshots/org/apache/maven/doxia/doxia-module-xhtml/1.7-SNAPSHOT/maven-metadata.xml
Downloaded: http://repository.apache.org/snapshots/org/apache/maven/doxia/doxia-module-xhtml/1.7-SNAPSHOT/maven-metadata.xml (787 B at 8.7 KB/sec)
Downloading: http://repository.apache.org/snapshots/org/apache/maven/doxia/doxia-module-xhtml/1.7-SNAPSHOT/doxia-module-xhtml-1.7-20160202.202746-79.pom
Downloaded: http://repository.apache.org/snapshots/org/apache/maven/doxia/doxia-module-xhtml/1.7-SNAPSHOT/doxia-module-xhtml-1.7-20160202.202746-79.pom (2 KB at 10.7 KB/sec)
Downloading: http://repository.apache.org/snapshots/org/apache/maven/doxia/doxia-modules/1.7-SNAPSHOT/maven-metadata.xml
Downloaded: http://repository.apache.org/snapshots/org/apache/maven/doxia/doxia-modules/1.7-SNAPSHOT/maven-metadata.xml (820 B at 12.0 KB/sec)
Downloading: http://repository.apache.org/snapshots/org/apache/maven/doxia/doxia-modules/1.7-SNAPSHOT/doxia-modules-1.7-20160202.202747-79.pom
Downloaded: http://repository.apache.org/snapshots/org/apache/maven/doxia/doxia-modules/1.7-SNAPSHOT/doxia-modules-1.7-20160202.202747-79.pom (3 KB at 27.3 KB/sec)
Downloading: http://repository.apache.org/snapshots/org/apache/maven/doxia/doxia-module-apt/1.7-SNAPSHOT/maven-metadata.xml
Downloaded: http://repository.apache.org/snapshots/org/apache/maven/doxia/doxia-module-apt/1.7-SNAPSHOT/maven-metadata.xml (785 B at 5.5 KB/sec)
Downloading: http://repository.apache.org/snapshots/org/apache/maven/doxia/doxia-module-apt/1.7-SNAPSHOT/doxia-module-apt-1.7-20160202.202740-80.pom
Downloaded: http://repository.apache.org/snapshots/org/apache/maven/doxia/doxia-module-apt/1.7-SNAPSHOT/doxia-module-apt-1.7-20160202.202740-80.pom (2 KB at 9.7 KB/sec)
Downloading: http://repository.apache.org/snapshots/org/apache/maven/doxia/doxia-module-xdoc/1.7-SNAPSHOT/maven-metadata.xml
Downloaded: http://repository.apache.org/snapshots/org/apache/maven/doxia/doxia-module-xdoc/1.7-SNAPSHOT/maven-metadata.xml (786 B at 5.6 KB/sec)
Downloading: http://repository.apache.org/snapshots/org/apache/maven/doxia/doxia-module-xdoc/1.7-SNAPSHOT/doxia-module-xdoc-1.7-20160202.202746-79.pom
Downloaded: http://repository.apache.org/snapshots/org/apache/maven/doxia/doxia-module-xdoc/1.7-SNAPSHOT/doxia-module-xdoc-1.7-20160202.202746-79.pom (5 KB at 15.8 KB/sec)
Downloading: http://repository.apache.org/snapshots/org/apache/maven/doxia/doxia-module-fml/1.7-SNAPSHOT/maven-metadata.xml
Downloaded: http://repository.apache.org/snapshots/org/apache/maven/doxia/doxia-module-fml/1.7-SNAPSHOT/maven-metadata.xml (785 B at 6.4 KB/sec)
Downloading: http://repository.apache.org/snapshots/org/apache/maven/doxia/doxia-module-fml/1.7-SNAPSHOT/doxia-module-fml-1.7-20160202.202741-80.pom
Downloaded: http://repository.apache.org/snapshots/org/apache/maven/doxia/doxia-module-fml/1.7-SNAPSHOT/doxia-module-fml-1.7-20160202.202741-80.pom (5 KB at 26.4 KB/sec)
Downloading: http://repository.apache.org/snapshots/org/apache/maven/doxia/doxia-module-markdown/1.7-SNAPSHOT/maven-metadata.xml
Downloaded: http://repository.apache.org/snapshots/org/apache/maven/doxia/doxia-module-markdown/1.7-SNAPSHOT/maven-metadata.xml (790 B at 8.2 KB/sec)
Downloading: http://repository.apache.org/snapshots/org/apache/maven/doxia/doxia-module-markdown/1.7-SNAPSHOT/doxia-module-markdown-1.7-20160202.202744-79.pom
Downloaded: http://repository.apache.org/snapshots/org/apache/maven/doxia/doxia-module-markdown/1.7-SNAPSHOT/doxia-module-markdown-1.7-20160202.202744-79.pom (3 KB at 10.3 KB/sec)
Downloading: http://repository.apache.org/snapshots/org/apache/maven/doxia/doxia-decoration-model/1.7-SNAPSHOT/maven-metadata.xml
Downloaded: http://repository.apache.org/snapshots/org/apache/maven/doxia/doxia-decoration-model/1.7-SNAPSHOT/maven-metadata.xml (791 B at 4.3 KB/sec)
Downloading: http://repository.apache.org/snapshots/org/apache/maven/doxia/doxia-decoration-model/1.7-SNAPSHOT/doxia-decoration-model-1.7-20160208.183239-97.pom
Downloaded: http://repository.apache.org/snapshots/org/apache/maven/doxia/doxia-decoration-model/1.7-SNAPSHOT/doxia-decoration-model-1.7-20160208.183239-97.pom (4 KB at 48.2 KB/sec)
Downloading: http://repository.apache.org/snapshots/org/apache/maven/doxia/doxia-sitetools/1.7-SNAPSHOT/maven-metadata.xml
Downloaded: http://repository.apache.org/snapshots/org/apache/maven/doxia/doxia-sitetools/1.7-SNAPSHOT/maven-metadata.xml (822 B at 11.1 KB/sec)
Downloading: http://repository.apache.org/snapshots/org/apache/maven/doxia/doxia-sitetools/1.7-SNAPSHOT/doxia-sitetools-1.7-20160208.183157-95.pom
Downloaded: http://repository.apache.org/snapshots/org/apache/maven/doxia/doxia-sitetools/1.7-SNAPSHOT/doxia-sitetools-1.7-20160208.183157-95.pom (14 KB at 77.3 KB/sec)
Downloading: http://repository.apache.org/snapshots/org/apache/maven/doxia/doxia-site-renderer/1.7-SNAPSHOT/maven-metadata.xml
Downloaded: http://repository.apache.org/snapshots/org/apache/maven/doxia/doxia-site-renderer/1.7-SNAPSHOT/maven-metadata.xml (788 B at 7.3 KB/sec)
Downloading: http://repository.apache.org/snapshots/org/apache/maven/doxia/doxia-site-renderer/1.7-SNAPSHOT/doxia-site-renderer-1.7-20160208.072957-98.pom
Downloaded: http://repository.apache.org/snapshots/org/apache/maven/doxia/doxia-site-renderer/1.7-SNAPSHOT/doxia-site-renderer-1.7-20160208.072957-98.pom (7 KB at 91.9 KB/sec)
Downloading: http://repository.apache.org/snapshots/org/apache/maven/doxia/doxia-integration-tools/1.7-SNAPSHOT/maven-metadata.xml
Downloaded: http://repository.apache.org/snapshots/org/apache/maven/doxia/doxia-integration-tools/1.7-SNAPSHOT/maven-metadata.xml (795 B at 8.0 KB/sec)
Downloading: http://repository.apache.org/snapshots/org/apache/maven/doxia/doxia-integration-tools/1.7-SNAPSHOT/doxia-integration-tools-1.7-20160208.183338-123.pom
Downloaded: http://repository.apache.org/snapshots/org/apache/maven/doxia/doxia-integration-tools/1.7-SNAPSHOT/doxia-integration-tools-1.7-20160208.183338-123.pom (6 KB at 92.2 KB/sec)
Downloading: http://repository.apache.org/snapshots/org/apache/maven/doxia/doxia-sink-api/1.7-SNAPSHOT/doxia-sink-api-1.7-20160202.202747-79.jar
Downloading: http://repository.apache.org/snapshots/org/apache/maven/doxia/doxia-core/1.7-SNAPSHOT/doxia-core-1.7-20160202.202725-80.jar
Downloading: http://repository.apache.org/snapshots/org/apache/maven/doxia/doxia-module-xhtml/1.7-SNAPSHOT/doxia-module-xhtml-1.7-20160202.202746-79.jar
Downloading: http://repository.apache.org/snapshots/org/apache/maven/doxia/doxia-logging-api/1.7-SNAPSHOT/doxia-logging-api-1.7-20160202.202738-80.jar
Downloading: http://repository.apache.org/snapshots/org/apache/maven/doxia/doxia-module-apt/1.7-SNAPSHOT/doxia-module-apt-1.7-20160202.202740-80.jar
Downloaded: http://repository.apache.org/snapshots/org/apache/maven/doxia/doxia-sink-api/1.7-SNAPSHOT/doxia-sink-api-1.7-20160202.202747-79.jar (12 KB at 141.3 KB/sec)
Downloading: http://repository.apache.org/snapshots/org/apache/maven/doxia/doxia-module-xdoc/1.7-SNAPSHOT/doxia-module-xdoc-1.7-20160202.202746-79.jar
Downloaded: http://repository.apache.org/snapshots/org/apache/maven/doxia/doxia-logging-api/1.7-SNAPSHOT/doxia-logging-api-1.7-20160202.202738-80.jar (12 KB at 144.9 KB/sec)
Downloading: http://repository.apache.org/snapshots/org/apache/maven/doxia/doxia-module-fml/1.7-SNAPSHOT/doxia-module-fml-1.7-20160202.202741-80.jar
Downloaded: http://repository.apache.org/snapshots/org/apache/maven/doxia/doxia-module-xhtml/1.7-SNAPSHOT/doxia-module-xhtml-1.7-20160202.202746-79.jar (18 KB at 165.9 KB/sec)
Downloading: http://repository.apache.org/snapshots/org/apache/maven/doxia/doxia-module-markdown/1.7-SNAPSHOT/doxia-module-markdown-1.7-20160202.202744-79.jar
Downloaded: http://repository.apache.org/snapshots/org/apache/maven/doxia/doxia-module-apt/1.7-SNAPSHOT/doxia-module-apt-1.7-20160202.202740-80.jar (53 KB at 503.5 KB/sec)
Downloading: http://repository.apache.org/snapshots/org/apache/maven/doxia/doxia-decoration-model/1.7-SNAPSHOT/doxia-decoration-model-1.7-20160208.183239-97.jar
Downloaded: http://repository.apache.org/snapshots/org/apache/maven/doxia/doxia-module-xdoc/1.7-SNAPSHOT/doxia-module-xdoc-1.7-20160202.202746-79.jar (37 KB at 420.2 KB/sec)
Downloading: http://repository.apache.org/snapshots/org/apache/maven/doxia/doxia-site-renderer/1.7-SNAPSHOT/doxia-site-renderer-1.7-20160208.072957-98.jar
Downloaded: http://repository.apache.org/snapshots/org/apache/maven/doxia/doxia-module-markdown/1.7-SNAPSHOT/doxia-module-markdown-1.7-20160202.202744-79.jar (15 KB at 243.6 KB/sec)
Downloading: http://repository.apache.org/snapshots/org/apache/maven/doxia/doxia-integration-tools/1.7-SNAPSHOT/doxia-integration-tools-1.7-20160208.183338-123.jar
Downloaded: http://repository.apache.org/snapshots/org/apache/maven/doxia/doxia-module-fml/1.7-SNAPSHOT/doxia-module-fml-1.7-20160202.202741-80.jar (38 KB at 473.5 KB/sec)
Downloaded: http://repository.apache.org/snapshots/org/apache/maven/doxia/doxia-core/1.7-SNAPSHOT/doxia-core-1.7-20160202.202725-80.jar (164 KB at 731.8 KB/sec)
Downloaded: http://repository.apache.org/snapshots/org/apache/maven/doxia/doxia-decoration-model/1.7-SNAPSHOT/doxia-decoration-model-1.7-20160208.183239-97.jar (61 KB at 525.0 KB/sec)
Downloaded: http://repository.apache.org/snapshots/org/apache/maven/doxia/doxia-site-renderer/1.7-SNAPSHOT/doxia-site-renderer-1.7-20160208.072957-98.jar (63 KB at 602.6 KB/sec)
Downloaded: http://repository.apache.org/snapshots/org/apache/maven/doxia/doxia-integration-tools/1.7-SNAPSHOT/doxia-integration-tools-1.7-20160208.183338-123.jar (46 KB at 462.3 KB/sec)
[INFO]
[INFO] --- maven-invoker-plugin:1.10:install (integration-test) @ maven-fluido-skin ---
[INFO] Installing /home/jenkins/jenkins-slave/workspace/maven-skins/maven-default-skin/pom.xml to <https://builds.apache.org/job/maven-skins/org.apache.maven.skins$maven-fluido-skin/ws/target/local-repo/org/apache/maven/skins/maven-default-skin/1.2-SNAPSHOT/maven-default-skin-1.2-SNAPSHOT.pom>
[INFO] Installing /home/jenkins/jenkins-slave/workspace/maven-skins/maven-default-skin/target/maven-default-skin-1.2-SNAPSHOT.jar to <https://builds.apache.org/job/maven-skins/org.apache.maven.skins$maven-fluido-skin/ws/target/local-repo/org/apache/maven/skins/maven-default-skin/1.2-SNAPSHOT/maven-default-skin-1.2-SNAPSHOT.jar>
[INFO] Installing /home/jenkins/jenkins-slave/workspace/maven-skins/maven-default-skin/pom.xml to <https://builds.apache.org/job/maven-skins/org.apache.maven.skins$maven-fluido-skin/ws/target/local-repo/org/apache/maven/skins/maven-default-skin/1.2-SNAPSHOT/maven-default-skin-1.2-SNAPSHOT.pom>
[INFO] Installing <https://builds.apache.org/job/maven-skins/org.apache.maven.skins$maven-fluido-skin/ws/pom.xml> to <https://builds.apache.org/job/maven-skins/org.apache.maven.skins$maven-fluido-skin/ws/target/local-repo/org/apache/maven/skins/maven-fluido-skin/1.5-SNAPSHOT/maven-fluido-skin-1.5-SNAPSHOT.pom>
[INFO] Installing <https://builds.apache.org/job/maven-skins/org.apache.maven.skins$maven-fluido-skin/ws/target/maven-fluido-skin-1.5-SNAPSHOT.jar> to <https://builds.apache.org/job/maven-skins/org.apache.maven.skins$maven-fluido-skin/ws/target/local-repo/org/apache/maven/skins/maven-fluido-skin/1.5-SNAPSHOT/maven-fluido-skin-1.5-SNAPSHOT.jar>
[INFO]
[INFO] --- maven-invoker-plugin:1.10:integration-test (integration-test) @ maven-fluido-skin ---
[INFO] Building: mskins-75/pom.xml
[INFO] ..FAILED (25.2 s)
[INFO] The build exited with code 1. See <https://builds.apache.org/job/maven-skins/org.apache.maven.skins$maven-fluido-skin/ws/target/it/mskins-75/build.log> for details.
[INFO] Building: mskins-21/pom.xml
[INFO] ..FAILED (16.7 s)
[INFO] The build exited with code 1. See <https://builds.apache.org/job/maven-skins/org.apache.maven.skins$maven-fluido-skin/ws/target/it/mskins-21/build.log> for details.
[INFO] Building: mskins-10/pom.xml
[INFO] ..FAILED (14.7 s)
[INFO] The build exited with code 1. See <https://builds.apache.org/job/maven-skins/org.apache.maven.skins$maven-fluido-skin/ws/target/it/mskins-10/build.log> for details.
[INFO] Building: mskins-33_topbar/pom.xml
[INFO] ..FAILED (16.2 s)
[INFO] The build exited with code 1. See <https://builds.apache.org/job/maven-skins/org.apache.maven.skins$maven-fluido-skin/ws/target/it/mskins-33_topbar/build.log> for details.
[INFO] Building: mskins-14_sitesearch/pom.xml
[INFO] ..FAILED (19.3 s)
[INFO] The build exited with code 1. See <https://builds.apache.org/job/maven-skins/org.apache.maven.skins$maven-fluido-skin/ws/target/it/mskins-14_sitesearch/build.log> for details.
[INFO] Building: mskins-33/pom.xml
[INFO] ..FAILED (16.0 s)
[INFO] The build exited with code 1. See <https://builds.apache.org/job/maven-skins/org.apache.maven.skins$maven-fluido-skin/ws/target/it/mskins-33/build.log> for details.
[INFO] Building: mskins-72/pom.xml
[INFO] ..FAILED (13.0 s)
[INFO] The build exited with code 1. See <https://builds.apache.org/job/maven-skins/org.apache.maven.skins$maven-fluido-skin/ws/target/it/mskins-72/build.log> for details.
[INFO] Building: mskins-76/pom.xml
[INFO] ..FAILED (17.0 s)
[INFO] The build exited with code 1. See <https://builds.apache.org/job/maven-skins/org.apache.maven.skins$maven-fluido-skin/ws/target/it/mskins-76/build.log> for details.
[INFO] Building: mskins-34/pom.xml
[INFO] ..FAILED (17.3 s)
[INFO] The build exited with code 1. See <https://builds.apache.org/job/maven-skins/org.apache.maven.skins$maven-fluido-skin/ws/target/it/mskins-34/build.log> for details.
[INFO] Building: mskins-17/pom.xml
[INFO] ..FAILED (19.5 s)
[INFO] The build exited with code 1. See <https://builds.apache.org/job/maven-skins/org.apache.maven.skins$maven-fluido-skin/ws/target/it/mskins-17/build.log> for details.
[INFO] Building: mskins-14/pom.xml
[INFO] ..FAILED (14.7 s)
[INFO] The build exited with code 1. See <https://builds.apache.org/job/maven-skins/org.apache.maven.skins$maven-fluido-skin/ws/target/it/mskins-14/build.log> for details.
[INFO] Building: mskins-24/pom.xml
[INFO] ..FAILED (15.2 s)
[INFO] The build exited with code 1. See <https://builds.apache.org/job/maven-skins/org.apache.maven.skins$maven-fluido-skin/ws/target/it/mskins-24/build.log> for details.
[INFO] Building: mskins-22_topbar/pom.xml
[INFO] ..FAILED (16.0 s)
[INFO] The build exited with code 1. See <https://builds.apache.org/job/maven-skins/org.apache.maven.skins$maven-fluido-skin/ws/target/it/mskins-22_topbar/build.log> for details.
[INFO] Building: mskins-23/pom.xml
[INFO] ..FAILED (16.3 s)
[INFO] The build exited with code 1. See <https://builds.apache.org/job/maven-skins/org.apache.maven.skins$maven-fluido-skin/ws/target/it/mskins-23/build.log> for details.
[INFO] Building: topbar-inverse/pom.xml
[INFO] ..FAILED (16.2 s)
[INFO] The build exited with code 1. See <https://builds.apache.org/job/maven-skins/org.apache.maven.skins$maven-fluido-skin/ws/target/it/topbar-inverse/build.log> for details.
[INFO] Building: mskins-13/pom.xml
[INFO] ..FAILED (15.4 s)
[INFO] The build exited with code 1. See <https://builds.apache.org/job/maven-skins/org.apache.maven.skins$maven-fluido-skin/ws/target/it/mskins-13/build.log> for details.
[INFO] Building: mskins-24_topbar/pom.xml
[INFO] ..FAILED (17.4 s)
[INFO] The build exited with code 1. See <https://builds.apache.org/job/maven-skins/org.apache.maven.skins$maven-fluido-skin/ws/target/it/mskins-24_topbar/build.log> for details.
[INFO] Building: mskins-22_default/pom.xml
[INFO] ..FAILED (17.0 s)
[INFO] The build exited with code 1. See <https://builds.apache.org/job/maven-skins/org.apache.maven.skins$maven-fluido-skin/ws/target/it/mskins-22_default/build.log> for details.
[INFO] Building: mskins-15/pom.xml
[INFO] ..FAILED (13.3 s)
[INFO] The build exited with code 1. See <https://builds.apache.org/job/maven-skins/org.apache.maven.skins$maven-fluido-skin/ws/target/it/mskins-15/build.log> for details.
[INFO] Building: mskins-41/pom.xml
[INFO] ..FAILED (17.1 s)
[INFO] The build exited with code 1. See <https://builds.apache.org/job/maven-skins/org.apache.maven.skins$maven-fluido-skin/ws/target/it/mskins-41/build.log> for details.
[INFO] Building: sidebar/pom.xml
[INFO] ..FAILED (13.3 s)
[INFO] The build exited with code 1. See <https://builds.apache.org/job/maven-skins/org.apache.maven.skins$maven-fluido-skin/ws/target/it/sidebar/build.log> for details.
[INFO] Building: mskins-34_topbar/pom.xml
[INFO] ..FAILED (16.7 s)
[INFO] The build exited with code 1. See <https://builds.apache.org/job/maven-skins/org.apache.maven.skins$maven-fluido-skin/ws/target/it/mskins-34_topbar/build.log> for details.
[INFO] Building: mskins-47/pom.xml
[INFO] ..FAILED (18.6 s)
[INFO] The build exited with code 1. See <https://builds.apache.org/job/maven-skins/org.apache.maven.skins$maven-fluido-skin/ws/target/it/mskins-47/build.log> for details.
[INFO] Building: mskins-85/pom.xml
[INFO] ..FAILED (16.7 s)
[INFO] The build exited with code 1. See <https://builds.apache.org/job/maven-skins/org.apache.maven.skins$maven-fluido-skin/ws/target/it/mskins-85/build.log> for details.
[INFO] Building: topbar/pom.xml
[INFO] ..FAILED (18.7 s)
[INFO] The build exited with code 1. See <https://builds.apache.org/job/maven-skins/org.apache.maven.skins$maven-fluido-skin/ws/target/it/topbar/build.log> for details.
[INFO] Building: mskins-76_topbar/pom.xml
[INFO] ..FAILED (14.9 s)
[INFO] The build exited with code 1. See <https://builds.apache.org/job/maven-skins/org.apache.maven.skins$maven-fluido-skin/ws/target/it/mskins-76_topbar/build.log> for details.
[INFO] Building: mskins-22/pom.xml
[INFO] ..FAILED (16.5 s)
[INFO] The build exited with code 1. See <https://builds.apache.org/job/maven-skins/org.apache.maven.skins$maven-fluido-skin/ws/target/it/mskins-22/build.log> for details.
[INFO] Building: mskins-28/pom.xml
[INFO] ..FAILED (14.6 s)
[INFO] The build exited with code 1. See <https://builds.apache.org/job/maven-skins/org.apache.maven.skins$maven-fluido-skin/ws/target/it/mskins-28/build.log> for details.
[INFO] Building: mskins-25/pom.xml
[INFO] ..FAILED (15.4 s)
[INFO] The build exited with code 1. See <https://builds.apache.org/job/maven-skins/org.apache.maven.skins$maven-fluido-skin/ws/target/it/mskins-25/build.log> for details.
[INFO] Building: mskins-31/pom.xml
[INFO] ..FAILED (18.2 s)
[INFO] The build exited with code 1. See <https://builds.apache.org/job/maven-skins/org.apache.maven.skins$maven-fluido-skin/ws/target/it/mskins-31/build.log> for details.
[INFO] Building: mskins-16/pom.xml
[INFO] ..FAILED (17.6 s)
[INFO] The build exited with code 1. See <https://builds.apache.org/job/maven-skins/org.apache.maven.skins$maven-fluido-skin/ws/target/it/mskins-16/build.log> for details.
[JENKINS] Recording test results
[INFO]
[INFO] --- maven-checkstyle-plugin:2.13:check (checkstyle-check) @ maven-fluido-skin ---
[INFO]
[INFO]
[INFO] --- maven-invoker-plugin:1.10:verify (integration-test) @ maven-fluido-skin ---
[INFO] -------------------------------------------------
[INFO] Build Summary:
[INFO] Passed: 0, Failed: 31, Errors: 0, Skipped: 0
[INFO] -------------------------------------------------
[ERROR] The following builds failed:
[ERROR] * mskins-16/pom.xml
[ERROR] * mskins-17/pom.xml
[ERROR] * mskins-76/pom.xml
[ERROR] * mskins-25/pom.xml
[ERROR] * mskins-22_topbar/pom.xml
[ERROR] * mskins-22/pom.xml
[ERROR] * mskins-34/pom.xml
[ERROR] * mskins-24_topbar/pom.xml
[ERROR] * mskins-47/pom.xml
[ERROR] * mskins-24/pom.xml
[ERROR] * mskins-33/pom.xml
[ERROR] * mskins-14/pom.xml
[ERROR] * mskins-72/pom.xml
[ERROR] * topbar/pom.xml
[ERROR] * mskins-31/pom.xml
[ERROR] * mskins-41/pom.xml
[ERROR] * mskins-13/pom.xml
[ERROR] * mskins-85/pom.xml
[ERROR] * mskins-21/pom.xml
[ERROR] * mskins-76_topbar/pom.xml
[ERROR] * mskins-22_default/pom.xml
[ERROR] * topbar-inverse/pom.xml
[ERROR] * mskins-75/pom.xml
[ERROR] * mskins-14_sitesearch/pom.xml
[ERROR] * mskins-23/pom.xml
[ERROR] * mskins-15/pom.xml
[ERROR] * mskins-10/pom.xml
[ERROR] * mskins-33_topbar/pom.xml
[ERROR] * mskins-28/pom.xml
[ERROR] * sidebar/pom.xml
[ERROR] * mskins-34_topbar/pom.xml
[INFO] -------------------------------------------------
Jenkins build is back to normal : maven-skins » Apache Maven Fluido Skin #239
Posted by Apache Jenkins Server <je...@builds.apache.org>.
See <https://builds.apache.org/job/maven-skins/org.apache.maven.skins$maven-fluido-skin/239/changes>
Build failed in Jenkins: maven-skins » Apache Maven Fluido Skin #238
Posted by Apache Jenkins Server <je...@builds.apache.org>.
See <https://builds.apache.org/job/maven-skins/org.apache.maven.skins$maven-fluido-skin/238/changes>
Changes:
[Michael Osipov] [MSKINS-123] Remove decoration model default value duplication in macro #publishDate
------------------------------------------
[INFO]
[INFO] ------------------------------------------------------------------------
[INFO] Building Apache Maven Fluido Skin 1.5-SNAPSHOT
[INFO] ------------------------------------------------------------------------
[WARNING] The POM for org.apache.maven.plugins:maven-site-plugin:jar:3.5-SNAPSHOT is missing, no dependency information available
Build failed in Jenkins: maven-skins » Apache Maven Fluido Skin #237
Posted by Apache Jenkins Server <je...@builds.apache.org>.
See <https://builds.apache.org/job/maven-skins/org.apache.maven.skins$maven-fluido-skin/237/changes>
Changes:
[hboutemy] [DOXIASITETOOLS-150] use new $decoration.isLink($href)
------------------------------------------
[INFO]
[INFO] ------------------------------------------------------------------------
[INFO] Building Apache Maven Fluido Skin 1.5-SNAPSHOT
[INFO] ------------------------------------------------------------------------
Downloading: http://repo.maven.apache.org/maven2/com/samaxes/maven/maven-minify-plugin/1.3.5/maven-minify-plugin-1.3.5.pom
Downloaded: http://repo.maven.apache.org/maven2/com/samaxes/maven/maven-minify-plugin/1.3.5/maven-minify-plugin-1.3.5.pom (8 KB at 55.5 KB/sec)
Downloading: http://repo.maven.apache.org/maven2/com/samaxes/maven/maven-minify-plugin/1.3.5/maven-minify-plugin-1.3.5.jar
Downloaded: http://repo.maven.apache.org/maven2/com/samaxes/maven/maven-minify-plugin/1.3.5/maven-minify-plugin-1.3.5.jar (14 KB at 195.9 KB/sec)
[INFO]
[INFO] --- maven-clean-plugin:2.5:clean (default-clean) @ maven-fluido-skin ---
[INFO] Deleting <https://builds.apache.org/job/maven-skins/org.apache.maven.skins$maven-fluido-skin/ws/target>
[INFO]
[INFO] --- maven-enforcer-plugin:1.3.1:enforce (enforce-bytecode-version) @ maven-fluido-skin ---
[INFO]
[INFO] --- maven-enforcer-plugin:1.3.1:enforce (ban-known-bad-maven-versions) @ maven-fluido-skin ---
[INFO]
[INFO] --- apache-rat-plugin:0.11:check (rat-check) @ maven-fluido-skin ---
[INFO] 51 implicit excludes (use -debug for more details).
[INFO] Exclude: src/main/resources/fonts/glyphicons-halflings-regular.svg
[INFO] Exclude: src/main/resources/js/prettify.js
[INFO] Exclude: src/main/resources/js/jquery-*.js
[INFO] 165 resources included (use -debug for more details)
[INFO] Rat check: Summary of files. Unapproved: 0 unknown: 0 generated: 0 approved: 129 licence.
[INFO]
[INFO] --- maven-remote-resources-plugin:1.5:process (default) @ maven-fluido-skin ---
[INFO]
[INFO] --- maven-minify-plugin:1.3.5:minify (default-minify) @ maven-fluido-skin ---
Downloading: http://repo.maven.apache.org/maven2/com/yahoo/platform/yui/yuicompressor/2.4.6/yuicompressor-2.4.6.pom
Downloaded: http://repo.maven.apache.org/maven2/com/yahoo/platform/yui/yuicompressor/2.4.6/yuicompressor-2.4.6.pom (2 KB at 16.2 KB/sec)
Downloading: http://repo.maven.apache.org/maven2/com/yahoo/platform/yui/yuicompressor/2.4.6/yuicompressor-2.4.6.jar
Downloaded: http://repo.maven.apache.org/maven2/com/yahoo/platform/yui/yuicompressor/2.4.6/yuicompressor-2.4.6.jar (82 KB at 607.2 KB/sec)
[INFO] Processing source files [bootstrap-2.3.2.css, maven-base.css, maven-theme.css, prettify.css]
[INFO] Creating merged file [apache-maven-fluido-1.5-SNAPSHOT.css]
[INFO] Creating minified file [apache-maven-fluido-1.5-SNAPSHOT.min.css]
[INFO] Processing source files [jquery-1.11.2.js, bootstrap-2.3.2.js, prettify.js, fluido.js]
[INFO] Creating merged file [apache-maven-fluido-1.5-SNAPSHOT.js]
[INFO] Creating minified file [apache-maven-fluido-1.5-SNAPSHOT.min.js]
[INFO]
[INFO] --- maven-resources-plugin:2.6:resources (default-resources) @ maven-fluido-skin ---
[INFO] Using 'UTF-8' encoding to copy filtered resources.
[INFO] Copying 2 resources to META-INF
[INFO] Copying 35 resources
[INFO] Copying 1 resource
[INFO] Copying 2 resources
[INFO] Copying 3 resources
[INFO]
[INFO] --- maven-compiler-plugin:3.1:compile (default-compile) @ maven-fluido-skin ---
[INFO] No sources to compile
[INFO]
[INFO] --- maven-resources-plugin:2.6:testResources (default-testResources) @ maven-fluido-skin ---
[INFO] Using 'UTF-8' encoding to copy filtered resources.
[INFO] skip non existing resourceDirectory <https://builds.apache.org/job/maven-skins/org.apache.maven.skins$maven-fluido-skin/ws/src/test/resources>
[INFO] Copying 3 resources
[INFO]
[INFO] --- maven-compiler-plugin:3.1:testCompile (default-testCompile) @ maven-fluido-skin ---
[INFO] No sources to compile
[INFO]
[INFO] --- maven-surefire-plugin:2.17:test (default-test) @ maven-fluido-skin ---
[JENKINS] Recording test results
[INFO]
[INFO] --- maven-jar-plugin:2.5:jar (default-jar) @ maven-fluido-skin ---
[INFO] Building jar: <https://builds.apache.org/job/maven-skins/org.apache.maven.skins$maven-fluido-skin/ws/target/maven-fluido-skin-1.5-SNAPSHOT.jar>
[INFO]
[INFO] --- maven-site-plugin:3.5-SNAPSHOT:attach-descriptor (attach-descriptor) @ maven-fluido-skin ---
[INFO]
[INFO] --- maven-invoker-plugin:1.10:install (integration-test) @ maven-fluido-skin ---
[INFO] Installing /home/jenkins/jenkins-slave/workspace/maven-skins/maven-default-skin/pom.xml to <https://builds.apache.org/job/maven-skins/org.apache.maven.skins$maven-fluido-skin/ws/target/local-repo/org/apache/maven/skins/maven-default-skin/1.2-SNAPSHOT/maven-default-skin-1.2-SNAPSHOT.pom>
[INFO] Installing /home/jenkins/jenkins-slave/workspace/maven-skins/maven-default-skin/target/maven-default-skin-1.2-SNAPSHOT.jar to <https://builds.apache.org/job/maven-skins/org.apache.maven.skins$maven-fluido-skin/ws/target/local-repo/org/apache/maven/skins/maven-default-skin/1.2-SNAPSHOT/maven-default-skin-1.2-SNAPSHOT.jar>
[INFO] Installing /home/jenkins/jenkins-slave/workspace/maven-skins/maven-default-skin/pom.xml to <https://builds.apache.org/job/maven-skins/org.apache.maven.skins$maven-fluido-skin/ws/target/local-repo/org/apache/maven/skins/maven-default-skin/1.2-SNAPSHOT/maven-default-skin-1.2-SNAPSHOT.pom>
[INFO] Installing <https://builds.apache.org/job/maven-skins/org.apache.maven.skins$maven-fluido-skin/ws/pom.xml> to <https://builds.apache.org/job/maven-skins/org.apache.maven.skins$maven-fluido-skin/ws/target/local-repo/org/apache/maven/skins/maven-fluido-skin/1.5-SNAPSHOT/maven-fluido-skin-1.5-SNAPSHOT.pom>
[INFO] Installing <https://builds.apache.org/job/maven-skins/org.apache.maven.skins$maven-fluido-skin/ws/target/maven-fluido-skin-1.5-SNAPSHOT.jar> to <https://builds.apache.org/job/maven-skins/org.apache.maven.skins$maven-fluido-skin/ws/target/local-repo/org/apache/maven/skins/maven-fluido-skin/1.5-SNAPSHOT/maven-fluido-skin-1.5-SNAPSHOT.jar>
[INFO]
[INFO] --- maven-invoker-plugin:1.10:integration-test (integration-test) @ maven-fluido-skin ---
[INFO] Building: mskins-24/pom.xml
[INFO] ..FAILED (11.4 s)
[INFO] The build exited with code 1. See <https://builds.apache.org/job/maven-skins/org.apache.maven.skins$maven-fluido-skin/ws/target/it/mskins-24/build.log> for details.
[INFO] Building: mskins-28/pom.xml
[INFO] ..FAILED (5.8 s)
[INFO] The build exited with code 1. See <https://builds.apache.org/job/maven-skins/org.apache.maven.skins$maven-fluido-skin/ws/target/it/mskins-28/build.log> for details.
[INFO] Building: topbar-inverse/pom.xml
[INFO] ..FAILED (5.9 s)
[INFO] The build exited with code 1. See <https://builds.apache.org/job/maven-skins/org.apache.maven.skins$maven-fluido-skin/ws/target/it/topbar-inverse/build.log> for details.
[INFO] Building: mskins-85/pom.xml
[INFO] ..FAILED (6.7 s)
[INFO] The build exited with code 1. See <https://builds.apache.org/job/maven-skins/org.apache.maven.skins$maven-fluido-skin/ws/target/it/mskins-85/build.log> for details.
[INFO] Building: mskins-76_topbar/pom.xml
[INFO] ..FAILED (7.3 s)
[INFO] The build exited with code 1. See <https://builds.apache.org/job/maven-skins/org.apache.maven.skins$maven-fluido-skin/ws/target/it/mskins-76_topbar/build.log> for details.
[INFO] Building: mskins-15/pom.xml
[INFO] ..FAILED (5.8 s)
[INFO] The build exited with code 1. See <https://builds.apache.org/job/maven-skins/org.apache.maven.skins$maven-fluido-skin/ws/target/it/mskins-15/build.log> for details.
[INFO] Building: mskins-75/pom.xml
[INFO] ..FAILED (6.1 s)
[INFO] The build exited with code 1. See <https://builds.apache.org/job/maven-skins/org.apache.maven.skins$maven-fluido-skin/ws/target/it/mskins-75/build.log> for details.
[INFO] Building: mskins-22/pom.xml
[INFO] ..FAILED (6.6 s)
[INFO] The build exited with code 1. See <https://builds.apache.org/job/maven-skins/org.apache.maven.skins$maven-fluido-skin/ws/target/it/mskins-22/build.log> for details.
[INFO] Building: mskins-47/pom.xml
[INFO] ..FAILED (7.3 s)
[INFO] The build exited with code 1. See <https://builds.apache.org/job/maven-skins/org.apache.maven.skins$maven-fluido-skin/ws/target/it/mskins-47/build.log> for details.
[INFO] Building: mskins-14_sitesearch/pom.xml
[INFO] ..FAILED (6.5 s)
[INFO] The build exited with code 1. See <https://builds.apache.org/job/maven-skins/org.apache.maven.skins$maven-fluido-skin/ws/target/it/mskins-14_sitesearch/build.log> for details.
[INFO] Building: mskins-41/pom.xml
[INFO] ..FAILED (5.9 s)
[INFO] The build exited with code 1. See <https://builds.apache.org/job/maven-skins/org.apache.maven.skins$maven-fluido-skin/ws/target/it/mskins-41/build.log> for details.
[INFO] Building: mskins-72/pom.xml
[INFO] ..FAILED (6.6 s)
[INFO] The build exited with code 1. See <https://builds.apache.org/job/maven-skins/org.apache.maven.skins$maven-fluido-skin/ws/target/it/mskins-72/build.log> for details.
[INFO] Building: mskins-17/pom.xml
[INFO] ..FAILED (5.8 s)
[INFO] The build exited with code 1. See <https://builds.apache.org/job/maven-skins/org.apache.maven.skins$maven-fluido-skin/ws/target/it/mskins-17/build.log> for details.
[INFO] Building: mskins-24_topbar/pom.xml
[INFO] ..FAILED (6.0 s)
[INFO] The build exited with code 1. See <https://builds.apache.org/job/maven-skins/org.apache.maven.skins$maven-fluido-skin/ws/target/it/mskins-24_topbar/build.log> for details.
[INFO] Building: mskins-76/pom.xml
[INFO] ..FAILED (6.8 s)
[INFO] The build exited with code 1. See <https://builds.apache.org/job/maven-skins/org.apache.maven.skins$maven-fluido-skin/ws/target/it/mskins-76/build.log> for details.
[INFO] Building: mskins-23/pom.xml
[INFO] ..FAILED (6.2 s)
[INFO] The build exited with code 1. See <https://builds.apache.org/job/maven-skins/org.apache.maven.skins$maven-fluido-skin/ws/target/it/mskins-23/build.log> for details.
[INFO] Building: mskins-13/pom.xml
[INFO] ..FAILED (6.2 s)
[INFO] The build exited with code 1. See <https://builds.apache.org/job/maven-skins/org.apache.maven.skins$maven-fluido-skin/ws/target/it/mskins-13/build.log> for details.
[INFO] Building: mskins-21/pom.xml
[INFO] ..FAILED (5.7 s)
[INFO] The build exited with code 1. See <https://builds.apache.org/job/maven-skins/org.apache.maven.skins$maven-fluido-skin/ws/target/it/mskins-21/build.log> for details.
[INFO] Building: mskins-22_topbar/pom.xml
[INFO] ..FAILED (6.0 s)
[INFO] The build exited with code 1. See <https://builds.apache.org/job/maven-skins/org.apache.maven.skins$maven-fluido-skin/ws/target/it/mskins-22_topbar/build.log> for details.
[INFO] Building: mskins-34_topbar/pom.xml
[INFO] ..FAILED (6.4 s)
[INFO] The build exited with code 1. See <https://builds.apache.org/job/maven-skins/org.apache.maven.skins$maven-fluido-skin/ws/target/it/mskins-34_topbar/build.log> for details.
[INFO] Building: mskins-25/pom.xml
[INFO] ..FAILED (6.3 s)
[INFO] The build exited with code 1. See <https://builds.apache.org/job/maven-skins/org.apache.maven.skins$maven-fluido-skin/ws/target/it/mskins-25/build.log> for details.
[INFO] Building: mskins-14/pom.xml
[INFO] ..FAILED (6.1 s)
[INFO] The build exited with code 1. See <https://builds.apache.org/job/maven-skins/org.apache.maven.skins$maven-fluido-skin/ws/target/it/mskins-14/build.log> for details.
[INFO] Building: topbar/pom.xml
[INFO] ..FAILED (6.8 s)
[INFO] The build exited with code 1. See <https://builds.apache.org/job/maven-skins/org.apache.maven.skins$maven-fluido-skin/ws/target/it/topbar/build.log> for details.
[INFO] Building: mskins-10/pom.xml
[INFO] ..FAILED (5.7 s)
[INFO] The build exited with code 1. See <https://builds.apache.org/job/maven-skins/org.apache.maven.skins$maven-fluido-skin/ws/target/it/mskins-10/build.log> for details.
[INFO] Building: mskins-33/pom.xml
[INFO] ..FAILED (6.9 s)
[INFO] The build exited with code 1. See <https://builds.apache.org/job/maven-skins/org.apache.maven.skins$maven-fluido-skin/ws/target/it/mskins-33/build.log> for details.
[INFO] Building: mskins-33_topbar/pom.xml
[INFO] ..FAILED (5.8 s)
[INFO] The build exited with code 1. See <https://builds.apache.org/job/maven-skins/org.apache.maven.skins$maven-fluido-skin/ws/target/it/mskins-33_topbar/build.log> for details.
[INFO] Building: mskins-34/pom.xml
[INFO] ..FAILED (5.7 s)
[INFO] The build exited with code 1. See <https://builds.apache.org/job/maven-skins/org.apache.maven.skins$maven-fluido-skin/ws/target/it/mskins-34/build.log> for details.
[INFO] Building: mskins-16/pom.xml
[INFO] ..FAILED (6.3 s)
[INFO] The build exited with code 1. See <https://builds.apache.org/job/maven-skins/org.apache.maven.skins$maven-fluido-skin/ws/target/it/mskins-16/build.log> for details.
[INFO] Building: sidebar/pom.xml
[INFO] ..FAILED (6.5 s)
[INFO] The build exited with code 1. See <https://builds.apache.org/job/maven-skins/org.apache.maven.skins$maven-fluido-skin/ws/target/it/sidebar/build.log> for details.
[INFO] Building: mskins-22_default/pom.xml
[INFO] ..FAILED (6.4 s)
[INFO] The build exited with code 1. See <https://builds.apache.org/job/maven-skins/org.apache.maven.skins$maven-fluido-skin/ws/target/it/mskins-22_default/build.log> for details.
[INFO] Building: mskins-31/pom.xml
[INFO] ..FAILED (6.2 s)
[INFO] The build exited with code 1. See <https://builds.apache.org/job/maven-skins/org.apache.maven.skins$maven-fluido-skin/ws/target/it/mskins-31/build.log> for details.
[JENKINS] Recording test results
[INFO]
[INFO] --- maven-checkstyle-plugin:2.13:check (checkstyle-check) @ maven-fluido-skin ---
[INFO]
[INFO]
[INFO] --- maven-invoker-plugin:1.10:verify (integration-test) @ maven-fluido-skin ---
[INFO] -------------------------------------------------
[INFO] Build Summary:
[INFO] Passed: 0, Failed: 31, Errors: 0, Skipped: 0
[INFO] -------------------------------------------------
[ERROR] The following builds failed:
[ERROR] * mskins-24/pom.xml
[ERROR] * mskins-33_topbar/pom.xml
[ERROR] * topbar-inverse/pom.xml
[ERROR] * mskins-31/pom.xml
[ERROR] * mskins-76/pom.xml
[ERROR] * mskins-22_default/pom.xml
[ERROR] * mskins-22/pom.xml
[ERROR] * mskins-75/pom.xml
[ERROR] * mskins-72/pom.xml
[ERROR] * mskins-41/pom.xml
[ERROR] * mskins-34/pom.xml
[ERROR] * mskins-24_topbar/pom.xml
[ERROR] * mskins-34_topbar/pom.xml
[ERROR] * mskins-14_sitesearch/pom.xml
[ERROR] * mskins-14/pom.xml
[ERROR] * mskins-25/pom.xml
[ERROR] * mskins-22_topbar/pom.xml
[ERROR] * mskins-23/pom.xml
[ERROR] * mskins-21/pom.xml
[ERROR] * mskins-15/pom.xml
[ERROR] * mskins-17/pom.xml
[ERROR] * topbar/pom.xml
[ERROR] * mskins-47/pom.xml
[ERROR] * mskins-16/pom.xml
[ERROR] * mskins-85/pom.xml
[ERROR] * sidebar/pom.xml
[ERROR] * mskins-13/pom.xml
[ERROR] * mskins-28/pom.xml
[ERROR] * mskins-33/pom.xml
[ERROR] * mskins-10/pom.xml
[ERROR] * mskins-76_topbar/pom.xml
[INFO] -------------------------------------------------
Build failed in Jenkins: maven-skins » Apache Maven Fluido Skin #236
Posted by Apache Jenkins Server <je...@builds.apache.org>.
See <https://builds.apache.org/job/maven-skins/org.apache.maven.skins$maven-fluido-skin/236/changes>
Changes:
[Michael Osipov] Update site descriptor
------------------------------------------
[INFO]
[INFO] ------------------------------------------------------------------------
[INFO] Building Apache Maven Fluido Skin 1.5-SNAPSHOT
[INFO] ------------------------------------------------------------------------
[INFO]
[INFO] --- maven-clean-plugin:2.5:clean (default-clean) @ maven-fluido-skin ---
[INFO] Deleting <https://builds.apache.org/job/maven-skins/org.apache.maven.skins$maven-fluido-skin/ws/target>
[INFO]
[INFO] --- maven-enforcer-plugin:1.3.1:enforce (enforce-bytecode-version) @ maven-fluido-skin ---
[INFO]
[INFO] --- maven-enforcer-plugin:1.3.1:enforce (ban-known-bad-maven-versions) @ maven-fluido-skin ---
[INFO]
[INFO] --- apache-rat-plugin:0.11:check (rat-check) @ maven-fluido-skin ---
[INFO] 51 implicit excludes (use -debug for more details).
[INFO] Exclude: src/main/resources/fonts/glyphicons-halflings-regular.svg
[INFO] Exclude: src/main/resources/js/prettify.js
[INFO] Exclude: src/main/resources/js/jquery-*.js
[INFO] 165 resources included (use -debug for more details)
[INFO] Rat check: Summary of files. Unapproved: 0 unknown: 0 generated: 0 approved: 129 licence.
[INFO]
[INFO] --- maven-remote-resources-plugin:1.5:process (default) @ maven-fluido-skin ---
[INFO]
[INFO] --- maven-minify-plugin:1.3.5:minify (default-minify) @ maven-fluido-skin ---
[INFO] Processing source files [bootstrap-2.3.2.css, maven-base.css, maven-theme.css, prettify.css]
[INFO] Creating merged file [apache-maven-fluido-1.5-SNAPSHOT.css]
[INFO] Processing source files [jquery-1.11.2.js, bootstrap-2.3.2.js, prettify.js, fluido.js]
[INFO] Creating merged file [apache-maven-fluido-1.5-SNAPSHOT.js]
[INFO] Creating minified file [apache-maven-fluido-1.5-SNAPSHOT.min.css]
[INFO] Creating minified file [apache-maven-fluido-1.5-SNAPSHOT.min.js]
[INFO]
[INFO] --- maven-resources-plugin:2.6:resources (default-resources) @ maven-fluido-skin ---
[INFO] Using 'UTF-8' encoding to copy filtered resources.
[INFO] Copying 2 resources to META-INF
[INFO] Copying 35 resources
[INFO] Copying 1 resource
[INFO] Copying 2 resources
[INFO] Copying 3 resources
[INFO]
[INFO] --- maven-compiler-plugin:3.1:compile (default-compile) @ maven-fluido-skin ---
[INFO] No sources to compile
[INFO]
[INFO] --- maven-resources-plugin:2.6:testResources (default-testResources) @ maven-fluido-skin ---
[INFO] Using 'UTF-8' encoding to copy filtered resources.
[INFO] skip non existing resourceDirectory <https://builds.apache.org/job/maven-skins/org.apache.maven.skins$maven-fluido-skin/ws/src/test/resources>
[INFO] Copying 3 resources
[INFO]
[INFO] --- maven-compiler-plugin:3.1:testCompile (default-testCompile) @ maven-fluido-skin ---
[INFO] No sources to compile
[INFO]
[INFO] --- maven-surefire-plugin:2.17:test (default-test) @ maven-fluido-skin ---
[JENKINS] Recording test results
[INFO]
[INFO] --- maven-jar-plugin:2.5:jar (default-jar) @ maven-fluido-skin ---
[INFO] Building jar: <https://builds.apache.org/job/maven-skins/org.apache.maven.skins$maven-fluido-skin/ws/target/maven-fluido-skin-1.5-SNAPSHOT.jar>
[INFO]
[INFO] --- maven-site-plugin:3.5-SNAPSHOT:attach-descriptor (attach-descriptor) @ maven-fluido-skin ---
Downloading: http://repository.apache.org/snapshots/org/apache/maven/doxia/doxia-sink-api/1.7-SNAPSHOT/maven-metadata.xml
Downloaded: http://repository.apache.org/snapshots/org/apache/maven/doxia/doxia-sink-api/1.7-SNAPSHOT/maven-metadata.xml (783 B at 3.0 KB/sec)
Downloading: http://repository.apache.org/snapshots/org/apache/maven/doxia/doxia/1.7-SNAPSHOT/maven-metadata.xml
Downloaded: http://repository.apache.org/snapshots/org/apache/maven/doxia/doxia/1.7-SNAPSHOT/maven-metadata.xml (812 B at 10.6 KB/sec)
Downloading: http://repository.apache.org/snapshots/org/apache/maven/doxia/doxia-logging-api/1.7-SNAPSHOT/maven-metadata.xml
Downloaded: http://repository.apache.org/snapshots/org/apache/maven/doxia/doxia-logging-api/1.7-SNAPSHOT/maven-metadata.xml (786 B at 10.1 KB/sec)
Downloading: http://repository.apache.org/snapshots/org/apache/maven/doxia/doxia-core/1.7-SNAPSHOT/maven-metadata.xml
Downloaded: http://repository.apache.org/snapshots/org/apache/maven/doxia/doxia-core/1.7-SNAPSHOT/maven-metadata.xml (990 B at 11.2 KB/sec)
Downloading: http://repository.apache.org/snapshots/org/apache/maven/doxia/doxia-module-xhtml/1.7-SNAPSHOT/maven-metadata.xml
Downloaded: http://repository.apache.org/snapshots/org/apache/maven/doxia/doxia-module-xhtml/1.7-SNAPSHOT/maven-metadata.xml (787 B at 8.3 KB/sec)
Downloading: http://repository.apache.org/snapshots/org/apache/maven/doxia/doxia-modules/1.7-SNAPSHOT/maven-metadata.xml
Downloaded: http://repository.apache.org/snapshots/org/apache/maven/doxia/doxia-modules/1.7-SNAPSHOT/maven-metadata.xml (820 B at 10.8 KB/sec)
Downloading: http://repository.apache.org/snapshots/org/apache/maven/doxia/doxia-module-apt/1.7-SNAPSHOT/maven-metadata.xml
Downloaded: http://repository.apache.org/snapshots/org/apache/maven/doxia/doxia-module-apt/1.7-SNAPSHOT/maven-metadata.xml (785 B at 12.0 KB/sec)
Downloading: http://repository.apache.org/snapshots/org/apache/maven/doxia/doxia-module-xdoc/1.7-SNAPSHOT/maven-metadata.xml
Downloaded: http://repository.apache.org/snapshots/org/apache/maven/doxia/doxia-module-xdoc/1.7-SNAPSHOT/maven-metadata.xml (786 B at 11.6 KB/sec)
Downloading: http://repository.apache.org/snapshots/org/apache/maven/doxia/doxia-module-fml/1.7-SNAPSHOT/maven-metadata.xml
Downloaded: http://repository.apache.org/snapshots/org/apache/maven/doxia/doxia-module-fml/1.7-SNAPSHOT/maven-metadata.xml (785 B at 8.9 KB/sec)
Downloading: http://repository.apache.org/snapshots/org/apache/maven/doxia/doxia-module-markdown/1.7-SNAPSHOT/maven-metadata.xml
Downloaded: http://repository.apache.org/snapshots/org/apache/maven/doxia/doxia-module-markdown/1.7-SNAPSHOT/maven-metadata.xml (790 B at 12.2 KB/sec)
Downloading: http://repository.apache.org/snapshots/org/apache/maven/doxia/doxia-decoration-model/1.7-SNAPSHOT/maven-metadata.xml
Downloaded: http://repository.apache.org/snapshots/org/apache/maven/doxia/doxia-decoration-model/1.7-SNAPSHOT/maven-metadata.xml (791 B at 9.0 KB/sec)
Downloading: http://repository.apache.org/snapshots/org/apache/maven/doxia/doxia-decoration-model/1.7-SNAPSHOT/doxia-decoration-model-1.7-20160208.211242-98.pom
Downloaded: http://repository.apache.org/snapshots/org/apache/maven/doxia/doxia-decoration-model/1.7-SNAPSHOT/doxia-decoration-model-1.7-20160208.211242-98.pom (4 KB at 50.7 KB/sec)
Downloading: http://repository.apache.org/snapshots/org/apache/maven/doxia/doxia-sitetools/1.7-SNAPSHOT/maven-metadata.xml
Downloaded: http://repository.apache.org/snapshots/org/apache/maven/doxia/doxia-sitetools/1.7-SNAPSHOT/maven-metadata.xml (822 B at 12.5 KB/sec)
Downloading: http://repository.apache.org/snapshots/org/apache/maven/doxia/doxia-sitetools/1.7-SNAPSHOT/doxia-sitetools-1.7-20160208.211325-96.pom
Downloaded: http://repository.apache.org/snapshots/org/apache/maven/doxia/doxia-sitetools/1.7-SNAPSHOT/doxia-sitetools-1.7-20160208.211325-96.pom (14 KB at 215.9 KB/sec)
Downloading: http://repository.apache.org/snapshots/org/apache/maven/doxia/doxia-site-renderer/1.7-SNAPSHOT/maven-metadata.xml
Downloaded: http://repository.apache.org/snapshots/org/apache/maven/doxia/doxia-site-renderer/1.7-SNAPSHOT/maven-metadata.xml (788 B at 11.7 KB/sec)
Downloading: http://repository.apache.org/snapshots/org/apache/maven/doxia/doxia-site-renderer/1.7-SNAPSHOT/doxia-site-renderer-1.7-20160208.211324-99.pom
Downloaded: http://repository.apache.org/snapshots/org/apache/maven/doxia/doxia-site-renderer/1.7-SNAPSHOT/doxia-site-renderer-1.7-20160208.211324-99.pom (7 KB at 97.4 KB/sec)
Downloading: http://repository.apache.org/snapshots/org/apache/maven/doxia/doxia-skin-model/1.7-SNAPSHOT/maven-metadata.xml
Downloaded: http://repository.apache.org/snapshots/org/apache/maven/doxia/doxia-skin-model/1.7-SNAPSHOT/maven-metadata.xml (782 B at 12.1 KB/sec)
Downloading: http://repository.apache.org/snapshots/org/apache/maven/doxia/doxia-skin-model/1.7-SNAPSHOT/doxia-skin-model-1.7-20160208.211326-4.pom
Downloaded: http://repository.apache.org/snapshots/org/apache/maven/doxia/doxia-skin-model/1.7-SNAPSHOT/doxia-skin-model-1.7-20160208.211326-4.pom (3 KB at 46.4 KB/sec)
Downloading: http://repository.apache.org/snapshots/org/apache/maven/doxia/doxia-integration-tools/1.7-SNAPSHOT/maven-metadata.xml
Downloaded: http://repository.apache.org/snapshots/org/apache/maven/doxia/doxia-integration-tools/1.7-SNAPSHOT/maven-metadata.xml (795 B at 10.4 KB/sec)
Downloading: http://repository.apache.org/snapshots/org/apache/maven/doxia/doxia-integration-tools/1.7-SNAPSHOT/doxia-integration-tools-1.7-20160208.211244-124.pom
Downloaded: http://repository.apache.org/snapshots/org/apache/maven/doxia/doxia-integration-tools/1.7-SNAPSHOT/doxia-integration-tools-1.7-20160208.211244-124.pom (6 KB at 98.4 KB/sec)
Downloading: http://repository.apache.org/snapshots/org/apache/maven/doxia/doxia-decoration-model/1.7-SNAPSHOT/doxia-decoration-model-1.7-20160208.211242-98.jar
Downloading: http://repository.apache.org/snapshots/org/apache/maven/doxia/doxia-skin-model/1.7-SNAPSHOT/doxia-skin-model-1.7-20160208.211326-4.jar
Downloading: http://repository.apache.org/snapshots/org/apache/maven/doxia/doxia-site-renderer/1.7-SNAPSHOT/doxia-site-renderer-1.7-20160208.211324-99.jar
Downloading: http://repository.apache.org/snapshots/org/apache/maven/doxia/doxia-integration-tools/1.7-SNAPSHOT/doxia-integration-tools-1.7-20160208.211244-124.jar
Downloaded: http://repository.apache.org/snapshots/org/apache/maven/doxia/doxia-skin-model/1.7-SNAPSHOT/doxia-skin-model-1.7-20160208.211326-4.jar (16 KB at 206.5 KB/sec)
Downloaded: http://repository.apache.org/snapshots/org/apache/maven/doxia/doxia-site-renderer/1.7-SNAPSHOT/doxia-site-renderer-1.7-20160208.211324-99.jar (62 KB at 719.9 KB/sec)
Downloaded: http://repository.apache.org/snapshots/org/apache/maven/doxia/doxia-decoration-model/1.7-SNAPSHOT/doxia-decoration-model-1.7-20160208.211242-98.jar (59 KB at 676.8 KB/sec)
Downloaded: http://repository.apache.org/snapshots/org/apache/maven/doxia/doxia-integration-tools/1.7-SNAPSHOT/doxia-integration-tools-1.7-20160208.211244-124.jar (46 KB at 529.2 KB/sec)
[INFO]
[INFO] --- maven-invoker-plugin:1.10:install (integration-test) @ maven-fluido-skin ---
[INFO] Installing /home/jenkins/jenkins-slave/workspace/maven-skins/maven-default-skin/pom.xml to <https://builds.apache.org/job/maven-skins/org.apache.maven.skins$maven-fluido-skin/ws/target/local-repo/org/apache/maven/skins/maven-default-skin/1.2-SNAPSHOT/maven-default-skin-1.2-SNAPSHOT.pom>
[INFO] Installing /home/jenkins/jenkins-slave/workspace/maven-skins/maven-default-skin/target/maven-default-skin-1.2-SNAPSHOT.jar to <https://builds.apache.org/job/maven-skins/org.apache.maven.skins$maven-fluido-skin/ws/target/local-repo/org/apache/maven/skins/maven-default-skin/1.2-SNAPSHOT/maven-default-skin-1.2-SNAPSHOT.jar>
[INFO] Installing /home/jenkins/jenkins-slave/workspace/maven-skins/maven-default-skin/pom.xml to <https://builds.apache.org/job/maven-skins/org.apache.maven.skins$maven-fluido-skin/ws/target/local-repo/org/apache/maven/skins/maven-default-skin/1.2-SNAPSHOT/maven-default-skin-1.2-SNAPSHOT.pom>
[INFO] Installing <https://builds.apache.org/job/maven-skins/org.apache.maven.skins$maven-fluido-skin/ws/pom.xml> to <https://builds.apache.org/job/maven-skins/org.apache.maven.skins$maven-fluido-skin/ws/target/local-repo/org/apache/maven/skins/maven-fluido-skin/1.5-SNAPSHOT/maven-fluido-skin-1.5-SNAPSHOT.pom>
[INFO] Installing <https://builds.apache.org/job/maven-skins/org.apache.maven.skins$maven-fluido-skin/ws/target/maven-fluido-skin-1.5-SNAPSHOT.jar> to <https://builds.apache.org/job/maven-skins/org.apache.maven.skins$maven-fluido-skin/ws/target/local-repo/org/apache/maven/skins/maven-fluido-skin/1.5-SNAPSHOT/maven-fluido-skin-1.5-SNAPSHOT.jar>
[INFO]
[INFO] --- maven-invoker-plugin:1.10:integration-test (integration-test) @ maven-fluido-skin ---
[INFO] Building: mskins-24/pom.xml
[INFO] ..FAILED (9.2 s)
[INFO] The build exited with code 1. See <https://builds.apache.org/job/maven-skins/org.apache.maven.skins$maven-fluido-skin/ws/target/it/mskins-24/build.log> for details.
[INFO] Building: mskins-28/pom.xml
[INFO] ..FAILED (5.3 s)
[INFO] The build exited with code 1. See <https://builds.apache.org/job/maven-skins/org.apache.maven.skins$maven-fluido-skin/ws/target/it/mskins-28/build.log> for details.
[INFO] Building: topbar-inverse/pom.xml
[INFO] ..FAILED (5.7 s)
[INFO] The build exited with code 1. See <https://builds.apache.org/job/maven-skins/org.apache.maven.skins$maven-fluido-skin/ws/target/it/topbar-inverse/build.log> for details.
[INFO] Building: mskins-85/pom.xml
[INFO] ..FAILED (6.2 s)
[INFO] The build exited with code 1. See <https://builds.apache.org/job/maven-skins/org.apache.maven.skins$maven-fluido-skin/ws/target/it/mskins-85/build.log> for details.
[INFO] Building: mskins-76_topbar/pom.xml
[INFO] ..FAILED (6.0 s)
[INFO] The build exited with code 1. See <https://builds.apache.org/job/maven-skins/org.apache.maven.skins$maven-fluido-skin/ws/target/it/mskins-76_topbar/build.log> for details.
[INFO] Building: mskins-15/pom.xml
[INFO] ..FAILED (5.7 s)
[INFO] The build exited with code 1. See <https://builds.apache.org/job/maven-skins/org.apache.maven.skins$maven-fluido-skin/ws/target/it/mskins-15/build.log> for details.
[INFO] Building: mskins-75/pom.xml
[INFO] ..FAILED (5.3 s)
[INFO] The build exited with code 1. See <https://builds.apache.org/job/maven-skins/org.apache.maven.skins$maven-fluido-skin/ws/target/it/mskins-75/build.log> for details.
[INFO] Building: mskins-22/pom.xml
[INFO] ..FAILED (5.9 s)
[INFO] The build exited with code 1. See <https://builds.apache.org/job/maven-skins/org.apache.maven.skins$maven-fluido-skin/ws/target/it/mskins-22/build.log> for details.
[INFO] Building: mskins-47/pom.xml
[INFO] ..FAILED (6.3 s)
[INFO] The build exited with code 1. See <https://builds.apache.org/job/maven-skins/org.apache.maven.skins$maven-fluido-skin/ws/target/it/mskins-47/build.log> for details.
[INFO] Building: mskins-14_sitesearch/pom.xml
[INFO] ..FAILED (5.6 s)
[INFO] The build exited with code 1. See <https://builds.apache.org/job/maven-skins/org.apache.maven.skins$maven-fluido-skin/ws/target/it/mskins-14_sitesearch/build.log> for details.
[INFO] Building: mskins-41/pom.xml
[INFO] ..FAILED (5.2 s)
[INFO] The build exited with code 1. See <https://builds.apache.org/job/maven-skins/org.apache.maven.skins$maven-fluido-skin/ws/target/it/mskins-41/build.log> for details.
[INFO] Building: mskins-72/pom.xml
[INFO] ..FAILED (5.2 s)
[INFO] The build exited with code 1. See <https://builds.apache.org/job/maven-skins/org.apache.maven.skins$maven-fluido-skin/ws/target/it/mskins-72/build.log> for details.
[INFO] Building: mskins-17/pom.xml
[INFO] ..FAILED (5.3 s)
[INFO] The build exited with code 1. See <https://builds.apache.org/job/maven-skins/org.apache.maven.skins$maven-fluido-skin/ws/target/it/mskins-17/build.log> for details.
[INFO] Building: mskins-24_topbar/pom.xml
[INFO] ..FAILED (6.0 s)
[INFO] The build exited with code 1. See <https://builds.apache.org/job/maven-skins/org.apache.maven.skins$maven-fluido-skin/ws/target/it/mskins-24_topbar/build.log> for details.
[INFO] Building: mskins-76/pom.xml
[INFO] ..FAILED (5.9 s)
[INFO] The build exited with code 1. See <https://builds.apache.org/job/maven-skins/org.apache.maven.skins$maven-fluido-skin/ws/target/it/mskins-76/build.log> for details.
[INFO] Building: mskins-23/pom.xml
[INFO] ..FAILED (6.2 s)
[INFO] The build exited with code 1. See <https://builds.apache.org/job/maven-skins/org.apache.maven.skins$maven-fluido-skin/ws/target/it/mskins-23/build.log> for details.
[INFO] Building: mskins-13/pom.xml
[INFO] ..FAILED (5.6 s)
[INFO] The build exited with code 1. See <https://builds.apache.org/job/maven-skins/org.apache.maven.skins$maven-fluido-skin/ws/target/it/mskins-13/build.log> for details.
[INFO] Building: mskins-21/pom.xml
[INFO] ..FAILED (5.6 s)
[INFO] The build exited with code 1. See <https://builds.apache.org/job/maven-skins/org.apache.maven.skins$maven-fluido-skin/ws/target/it/mskins-21/build.log> for details.
[INFO] Building: mskins-22_topbar/pom.xml
[INFO] ..FAILED (5.9 s)
[INFO] The build exited with code 1. See <https://builds.apache.org/job/maven-skins/org.apache.maven.skins$maven-fluido-skin/ws/target/it/mskins-22_topbar/build.log> for details.
[INFO] Building: mskins-34_topbar/pom.xml
[INFO] ..FAILED (6.1 s)
[INFO] The build exited with code 1. See <https://builds.apache.org/job/maven-skins/org.apache.maven.skins$maven-fluido-skin/ws/target/it/mskins-34_topbar/build.log> for details.
[INFO] Building: mskins-25/pom.xml
[INFO] ..FAILED (5.6 s)
[INFO] The build exited with code 1. See <https://builds.apache.org/job/maven-skins/org.apache.maven.skins$maven-fluido-skin/ws/target/it/mskins-25/build.log> for details.
[INFO] Building: mskins-14/pom.xml
[INFO] ..FAILED (5.4 s)
[INFO] The build exited with code 1. See <https://builds.apache.org/job/maven-skins/org.apache.maven.skins$maven-fluido-skin/ws/target/it/mskins-14/build.log> for details.
[INFO] Building: topbar/pom.xml
[INFO] ..FAILED (5.4 s)
[INFO] The build exited with code 1. See <https://builds.apache.org/job/maven-skins/org.apache.maven.skins$maven-fluido-skin/ws/target/it/topbar/build.log> for details.
[INFO] Building: mskins-10/pom.xml
[INFO] ..FAILED (6.1 s)
[INFO] The build exited with code 1. See <https://builds.apache.org/job/maven-skins/org.apache.maven.skins$maven-fluido-skin/ws/target/it/mskins-10/build.log> for details.
[INFO] Building: mskins-33/pom.xml
[INFO] ..FAILED (5.9 s)
[INFO] The build exited with code 1. See <https://builds.apache.org/job/maven-skins/org.apache.maven.skins$maven-fluido-skin/ws/target/it/mskins-33/build.log> for details.
[INFO] Building: mskins-33_topbar/pom.xml
[INFO] ..FAILED (5.9 s)
[INFO] The build exited with code 1. See <https://builds.apache.org/job/maven-skins/org.apache.maven.skins$maven-fluido-skin/ws/target/it/mskins-33_topbar/build.log> for details.
[INFO] Building: mskins-34/pom.xml
[INFO] ..FAILED (5.4 s)
[INFO] The build exited with code 1. See <https://builds.apache.org/job/maven-skins/org.apache.maven.skins$maven-fluido-skin/ws/target/it/mskins-34/build.log> for details.
[INFO] Building: mskins-16/pom.xml
[INFO] ..FAILED (5.2 s)
[INFO] The build exited with code 1. See <https://builds.apache.org/job/maven-skins/org.apache.maven.skins$maven-fluido-skin/ws/target/it/mskins-16/build.log> for details.
[INFO] Building: sidebar/pom.xml
[INFO] ..FAILED (5.9 s)
[INFO] The build exited with code 1. See <https://builds.apache.org/job/maven-skins/org.apache.maven.skins$maven-fluido-skin/ws/target/it/sidebar/build.log> for details.
[INFO] Building: mskins-22_default/pom.xml
[INFO] ..FAILED (6.4 s)
[INFO] The build exited with code 1. See <https://builds.apache.org/job/maven-skins/org.apache.maven.skins$maven-fluido-skin/ws/target/it/mskins-22_default/build.log> for details.
[INFO] Building: mskins-31/pom.xml
[INFO] ..FAILED (5.6 s)
[INFO] The build exited with code 1. See <https://builds.apache.org/job/maven-skins/org.apache.maven.skins$maven-fluido-skin/ws/target/it/mskins-31/build.log> for details.
[JENKINS] Recording test results
[INFO]
[INFO] --- maven-checkstyle-plugin:2.13:check (checkstyle-check) @ maven-fluido-skin ---
[INFO]
[INFO]
[INFO] --- maven-invoker-plugin:1.10:verify (integration-test) @ maven-fluido-skin ---
[INFO] -------------------------------------------------
[INFO] Build Summary:
[INFO] Passed: 0, Failed: 31, Errors: 0, Skipped: 0
[INFO] -------------------------------------------------
[ERROR] The following builds failed:
[ERROR] * mskins-24/pom.xml
[ERROR] * mskins-33_topbar/pom.xml
[ERROR] * topbar-inverse/pom.xml
[ERROR] * mskins-31/pom.xml
[ERROR] * mskins-76/pom.xml
[ERROR] * mskins-22_default/pom.xml
[ERROR] * mskins-22/pom.xml
[ERROR] * mskins-75/pom.xml
[ERROR] * mskins-72/pom.xml
[ERROR] * mskins-41/pom.xml
[ERROR] * mskins-34/pom.xml
[ERROR] * mskins-24_topbar/pom.xml
[ERROR] * mskins-34_topbar/pom.xml
[ERROR] * mskins-14_sitesearch/pom.xml
[ERROR] * mskins-14/pom.xml
[ERROR] * mskins-25/pom.xml
[ERROR] * mskins-22_topbar/pom.xml
[ERROR] * mskins-23/pom.xml
[ERROR] * mskins-21/pom.xml
[ERROR] * mskins-15/pom.xml
[ERROR] * mskins-17/pom.xml
[ERROR] * topbar/pom.xml
[ERROR] * mskins-47/pom.xml
[ERROR] * mskins-16/pom.xml
[ERROR] * mskins-85/pom.xml
[ERROR] * sidebar/pom.xml
[ERROR] * mskins-13/pom.xml
[ERROR] * mskins-28/pom.xml
[ERROR] * mskins-33/pom.xml
[ERROR] * mskins-10/pom.xml
[ERROR] * mskins-76_topbar/pom.xml
[INFO] -------------------------------------------------