You are viewing a plain text version of this content. The canonical link for it is here.
Posted to dev@kafka.apache.org by Apache Jenkins Server <je...@builds.apache.org> on 2021/03/03 19:14:22 UTC
Build failed in Jenkins: Kafka » kafka-trunk-jdk15 #590
See <https://ci-builds.apache.org/job/Kafka/job/kafka-trunk-jdk15/590/display/redirect?page=changes>
Changes:
[github] KAFKA-9548 Added SPIs and public classes/interfaces introduced in KIP-405 for tiered storage feature in Kafka. (#10173)
------------------------------------------
[...truncated 3.68 MB...]
AclAuthorizerTest > testSuperUserWithCustomPrincipalHasAccess() STARTED
AclAuthorizerTest > testSuperUserWithCustomPrincipalHasAccess() PASSED
AclAuthorizerTest > testAuthorizeByResourceTypeWithAllOperationAce() STARTED
AclAuthorizerTest > testAuthorizeByResourceTypeWithAllOperationAce() PASSED
AclAuthorizerTest > testAllowAccessWithCustomPrincipal() STARTED
AclAuthorizerTest > testAllowAccessWithCustomPrincipal() PASSED
AclAuthorizerTest > testDeleteAclOnWildcardResource() STARTED
AclAuthorizerTest > testDeleteAclOnWildcardResource() PASSED
AclAuthorizerTest > testAuthorizerZkConfigFromKafkaConfig() STARTED
AclAuthorizerTest > testAuthorizerZkConfigFromKafkaConfig() PASSED
AclAuthorizerTest > testChangeListenerTiming() STARTED
AclAuthorizerTest > testChangeListenerTiming() PASSED
AclAuthorizerTest > testWritesLiteralWritesLiteralAclChangeEventWhenInterBrokerProtocolLessThanKafkaV2eralAclChangesForOlderProtocolVersions() STARTED
AclAuthorizerTest > testWritesLiteralWritesLiteralAclChangeEventWhenInterBrokerProtocolLessThanKafkaV2eralAclChangesForOlderProtocolVersions() PASSED
AclAuthorizerTest > testAuthorzeByResourceTypeSuperUserHasAccess() STARTED
AclAuthorizerTest > testAuthorzeByResourceTypeSuperUserHasAccess() PASSED
AclAuthorizerTest > testAuthorizeByResourceTypePrefixedResourceDenyDominate() STARTED
AclAuthorizerTest > testAuthorizeByResourceTypePrefixedResourceDenyDominate() PASSED
AclAuthorizerTest > testAuthorizeByResourceTypeMultipleAddAndRemove() STARTED
AclAuthorizerTest > testAuthorizeByResourceTypeMultipleAddAndRemove() PASSED
AclAuthorizerTest > testThrowsOnAddPrefixedAclIfInterBrokerProtocolVersionTooLow() STARTED
AclAuthorizerTest > testThrowsOnAddPrefixedAclIfInterBrokerProtocolVersionTooLow() PASSED
AclAuthorizerTest > testAccessAllowedIfAllowAclExistsOnPrefixedResource() STARTED
AclAuthorizerTest > testAccessAllowedIfAllowAclExistsOnPrefixedResource() PASSED
AclAuthorizerTest > testAuthorizeByResourceTypeDenyTakesPrecedence() STARTED
AclAuthorizerTest > testAuthorizeByResourceTypeDenyTakesPrecedence() PASSED
AclAuthorizerTest > testHighConcurrencyModificationOfResourceAcls() STARTED
AclAuthorizerTest > testHighConcurrencyModificationOfResourceAcls() PASSED
AclAuthorizerTest > testAuthorizeByResourceTypeWithAllPrincipalAce() STARTED
AclAuthorizerTest > testAuthorizeByResourceTypeWithAllPrincipalAce() PASSED
AclAuthorizerTest > testAuthorizeWithEmptyResourceName() STARTED
AclAuthorizerTest > testAuthorizeWithEmptyResourceName() PASSED
AclAuthorizerTest > testAuthorizeThrowsOnNonLiteralResource() STARTED
AclAuthorizerTest > testAuthorizeThrowsOnNonLiteralResource() PASSED
AclAuthorizerTest > testDeleteAllAclOnPrefixedResource() STARTED
AclAuthorizerTest > testDeleteAllAclOnPrefixedResource() PASSED
AclAuthorizerTest > testAddAclsOnLiteralResource() STARTED
AclAuthorizerTest > testAddAclsOnLiteralResource() PASSED
AclAuthorizerTest > testGetAclsPrincipal() STARTED
AclAuthorizerTest > testGetAclsPrincipal() PASSED
AclAuthorizerTest > testWritesExtendedAclChangeEventIfInterBrokerProtocolNotSet() STARTED
AclAuthorizerTest > testWritesExtendedAclChangeEventIfInterBrokerProtocolNotSet() PASSED
AclAuthorizerTest > testAccessAllowedIfAllowAclExistsOnWildcardResource() STARTED
AclAuthorizerTest > testAccessAllowedIfAllowAclExistsOnWildcardResource() PASSED
AclAuthorizerTest > testLoadCache() STARTED
AclAuthorizerTest > testLoadCache() PASSED
AuthorizerInterfaceDefaultTest > testAuthorizeByResourceTypeWithAllHostAce() STARTED
AuthorizerInterfaceDefaultTest > testAuthorizeByResourceTypeWithAllHostAce() PASSED
AuthorizerInterfaceDefaultTest > testAuthorizeByResourceTypeIsolationUnrelatedDenyWontDominateAllow() STARTED
AuthorizerInterfaceDefaultTest > testAuthorizeByResourceTypeIsolationUnrelatedDenyWontDominateAllow() PASSED
AuthorizerInterfaceDefaultTest > testAuthorizeByResourceTypeWildcardResourceDenyDominate() STARTED
AuthorizerInterfaceDefaultTest > testAuthorizeByResourceTypeWildcardResourceDenyDominate() PASSED
AuthorizerInterfaceDefaultTest > testAuthorizeByResourceTypeWithAllOperationAce() STARTED
AuthorizerInterfaceDefaultTest > testAuthorizeByResourceTypeWithAllOperationAce() PASSED
AuthorizerInterfaceDefaultTest > testAuthorzeByResourceTypeSuperUserHasAccess() STARTED
AuthorizerInterfaceDefaultTest > testAuthorzeByResourceTypeSuperUserHasAccess() PASSED
AuthorizerInterfaceDefaultTest > testAuthorizeByResourceTypePrefixedResourceDenyDominate() STARTED
AuthorizerInterfaceDefaultTest > testAuthorizeByResourceTypePrefixedResourceDenyDominate() PASSED
AuthorizerInterfaceDefaultTest > testAuthorizeByResourceTypeMultipleAddAndRemove() STARTED
AuthorizerInterfaceDefaultTest > testAuthorizeByResourceTypeMultipleAddAndRemove() PASSED
AuthorizerInterfaceDefaultTest > testAuthorizeByResourceTypeDenyTakesPrecedence() STARTED
AuthorizerInterfaceDefaultTest > testAuthorizeByResourceTypeDenyTakesPrecedence() PASSED
AuthorizerInterfaceDefaultTest > testAuthorizeByResourceTypeWithAllPrincipalAce() STARTED
AuthorizerInterfaceDefaultTest > testAuthorizeByResourceTypeWithAllPrincipalAce() PASSED
AclEntryTest > testAclJsonConversion() STARTED
AclEntryTest > testAclJsonConversion() PASSED
AuthorizerWrapperTest > testAuthorizeByResourceTypeDisableAllowEveryoneOverride() STARTED
AuthorizerWrapperTest > testAuthorizeByResourceTypeDisableAllowEveryoneOverride() PASSED
AuthorizerWrapperTest > testAuthorizeByResourceTypeWithAllHostAce() STARTED
AuthorizerWrapperTest > testAuthorizeByResourceTypeWithAllHostAce() PASSED
AuthorizerWrapperTest > testAuthorizeByResourceTypeIsolationUnrelatedDenyWontDominateAllow() STARTED
AuthorizerWrapperTest > testAuthorizeByResourceTypeIsolationUnrelatedDenyWontDominateAllow() PASSED
AuthorizerWrapperTest > testAuthorizeByResourceTypeWildcardResourceDenyDominate() STARTED
AuthorizerWrapperTest > testAuthorizeByResourceTypeWildcardResourceDenyDominate() PASSED
AuthorizerWrapperTest > testAuthorizeByResourceTypeEnableAllowEveryOne() STARTED
AuthorizerWrapperTest > testAuthorizeByResourceTypeEnableAllowEveryOne() PASSED
AuthorizerWrapperTest > testAuthorizeByResourceTypeWithAllOperationAce() STARTED
AuthorizerWrapperTest > testAuthorizeByResourceTypeWithAllOperationAce() PASSED
AuthorizerWrapperTest > testAuthorzeByResourceTypeSuperUserHasAccess() STARTED
AuthorizerWrapperTest > testAuthorzeByResourceTypeSuperUserHasAccess() PASSED
AuthorizerWrapperTest > testAuthorizeByResourceTypePrefixedResourceDenyDominate() STARTED
AuthorizerWrapperTest > testAuthorizeByResourceTypePrefixedResourceDenyDominate() PASSED
AuthorizerWrapperTest > testAuthorizeByResourceTypeMultipleAddAndRemove() STARTED
AuthorizerWrapperTest > testAuthorizeByResourceTypeMultipleAddAndRemove() PASSED
AuthorizerWrapperTest > testAuthorizeByResourceTypeDenyTakesPrecedence() STARTED
AuthorizerWrapperTest > testAuthorizeByResourceTypeDenyTakesPrecedence() PASSED
AuthorizerWrapperTest > testAuthorizeByResourceTypeWithAllPrincipalAce() STARTED
AuthorizerWrapperTest > testAuthorizeByResourceTypeWithAllPrincipalAce() PASSED
ControllerContextTest > testPartitionFullReplicaAssignmentReturnsEmptyAssignmentIfTopicOrPartitionDoesNotExist() STARTED
ControllerContextTest > testPartitionFullReplicaAssignmentReturnsEmptyAssignmentIfTopicOrPartitionDoesNotExist() PASSED
ControllerContextTest > testPartitionReplicaAssignmentForTopicReturnsEmptyMapIfTopicDoesNotExist() STARTED
ControllerContextTest > testPartitionReplicaAssignmentForTopicReturnsEmptyMapIfTopicDoesNotExist() PASSED
ControllerContextTest > testPreferredReplicaImbalanceMetric() STARTED
ControllerContextTest > testPreferredReplicaImbalanceMetric() PASSED
ControllerContextTest > testPartitionReplicaAssignmentForTopicReturnsExpectedReplicaAssignments() STARTED
ControllerContextTest > testPartitionReplicaAssignmentForTopicReturnsExpectedReplicaAssignments() PASSED
ControllerContextTest > testReassignTo() STARTED
ControllerContextTest > testReassignTo() PASSED
ControllerContextTest > testPartitionReplicaAssignment() STARTED
ControllerContextTest > testPartitionReplicaAssignment() PASSED
ControllerContextTest > testUpdatePartitionFullReplicaAssignmentUpdatesReplicaAssignment() STARTED
ControllerContextTest > testUpdatePartitionFullReplicaAssignmentUpdatesReplicaAssignment() PASSED
ControllerContextTest > testReassignToIdempotence() STARTED
ControllerContextTest > testReassignToIdempotence() PASSED
ControllerContextTest > testPartitionReplicaAssignmentReturnsEmptySeqIfTopicOrPartitionDoesNotExist() STARTED
ControllerContextTest > testPartitionReplicaAssignmentReturnsEmptySeqIfTopicOrPartitionDoesNotExist() PASSED
TransactionsWithMaxInFlightOneTest > testTransactionalProducerSingleBrokerMaxInFlightOne() STARTED
TransactionsWithMaxInFlightOneTest > testTransactionalProducerSingleBrokerMaxInFlightOne() PASSED
FAILURE: Build completed with 2 failures.
1: Task failed with an exception.
-----------
* What went wrong:
Execution failed for task ':connect:mirror:test'.
> There were failing tests. See the report at: file://<https://ci-builds.apache.org/job/Kafka/job/kafka-trunk-jdk15/ws/connect/mirror/build/reports/tests/test/index.html>
* Try:
Run with --stacktrace option to get the stack trace. Run with --info or --debug option to get more log output. Run with --scan to get full insights.
==============================================================================
2: Task failed with an exception.
-----------
* What went wrong:
Execution failed for task ':streams:test'.
> There were failing tests. See the report at: file://<https://ci-builds.apache.org/job/Kafka/job/kafka-trunk-jdk15/ws/streams/build/reports/tests/test/index.html>
* Try:
Run with --stacktrace option to get the stack trace. Run with --info or --debug option to get more log output. Run with --scan to get full insights.
==============================================================================
* Get more help at https://help.gradle.org
Deprecated Gradle features were used in this build, making it incompatible with Gradle 7.0.
Use '--warning-mode all' to show the individual deprecation warnings.
See https://docs.gradle.org/6.8.1/userguide/command_line_interface.html#sec:command_line_warnings
BUILD FAILED in 1h 20m 41s
257 actionable tasks: 220 executed, 37 up-to-date
Build step 'Execute shell' marked build as failure
Recording test results
Not sending mail to unregistered user github@hugo-hirsch.de
Jenkins build is back to normal : Kafka » kafka-trunk-jdk15 #593
Posted by Apache Jenkins Server <je...@builds.apache.org>.
See <https://ci-builds.apache.org/job/Kafka/job/kafka-trunk-jdk15/593/display/redirect?page=changes>
Build failed in Jenkins: Kafka » kafka-trunk-jdk15 #592
Posted by Apache Jenkins Server <je...@builds.apache.org>.
See <https://ci-builds.apache.org/job/Kafka/job/kafka-trunk-jdk15/592/display/redirect?page=changes>
Changes:
[github] KAFKA-10759 Add ARM build stage (#9992)
------------------------------------------
[...truncated 3.67 MB...]
AclAuthorizerTest > testWritesLiteralAclChangeEventWhenInterBrokerProtocolIsKafkaV2() STARTED
AclAuthorizerTest > testWritesLiteralAclChangeEventWhenInterBrokerProtocolIsKafkaV2() PASSED
AclAuthorizerTest > testTopicAcl() STARTED
AclAuthorizerTest > testTopicAcl() PASSED
AclAuthorizerTest > testSuperUserHasAccess() STARTED
AclAuthorizerTest > testSuperUserHasAccess() PASSED
AclAuthorizerTest > testDeleteAclOnPrefixedResource() STARTED
AclAuthorizerTest > testDeleteAclOnPrefixedResource() PASSED
AclAuthorizerTest > testDenyTakesPrecedence() STARTED
AclAuthorizerTest > testDenyTakesPrecedence() PASSED
AclAuthorizerTest > testAuthorizeByResourceTypeIsolationUnrelatedDenyWontDominateAllow() STARTED
AclAuthorizerTest > testAuthorizeByResourceTypeIsolationUnrelatedDenyWontDominateAllow() PASSED
AclAuthorizerTest > testSingleCharacterResourceAcls() STARTED
AclAuthorizerTest > testSingleCharacterResourceAcls() PASSED
AclAuthorizerTest > testNoAclFoundOverride() STARTED
AclAuthorizerTest > testNoAclFoundOverride() PASSED
AclAuthorizerTest > testAuthorizeByResourceTypeWildcardResourceDenyDominate() STARTED
AclAuthorizerTest > testAuthorizeByResourceTypeWildcardResourceDenyDominate() PASSED
AclAuthorizerTest > testEmptyAclThrowsException() STARTED
AclAuthorizerTest > testEmptyAclThrowsException() PASSED
AclAuthorizerTest > testAuthorizeByResourceTypeNoAclFoundOverride() STARTED
AclAuthorizerTest > testAuthorizeByResourceTypeNoAclFoundOverride() PASSED
AclAuthorizerTest > testSuperUserWithCustomPrincipalHasAccess() STARTED
AclAuthorizerTest > testSuperUserWithCustomPrincipalHasAccess() PASSED
AclAuthorizerTest > testAuthorizeByResourceTypeWithAllOperationAce() STARTED
AclAuthorizerTest > testAuthorizeByResourceTypeWithAllOperationAce() PASSED
AclAuthorizerTest > testAllowAccessWithCustomPrincipal() STARTED
AclAuthorizerTest > testAllowAccessWithCustomPrincipal() PASSED
AclAuthorizerTest > testDeleteAclOnWildcardResource() STARTED
AclAuthorizerTest > testDeleteAclOnWildcardResource() PASSED
AclAuthorizerTest > testAuthorizerZkConfigFromKafkaConfig() STARTED
AclAuthorizerTest > testAuthorizerZkConfigFromKafkaConfig() PASSED
AclAuthorizerTest > testChangeListenerTiming() STARTED
AclAuthorizerTest > testChangeListenerTiming() PASSED
AclAuthorizerTest > testWritesLiteralWritesLiteralAclChangeEventWhenInterBrokerProtocolLessThanKafkaV2eralAclChangesForOlderProtocolVersions() STARTED
AclAuthorizerTest > testWritesLiteralWritesLiteralAclChangeEventWhenInterBrokerProtocolLessThanKafkaV2eralAclChangesForOlderProtocolVersions() PASSED
AclAuthorizerTest > testAuthorzeByResourceTypeSuperUserHasAccess() STARTED
AclAuthorizerTest > testAuthorzeByResourceTypeSuperUserHasAccess() PASSED
AclAuthorizerTest > testAuthorizeByResourceTypePrefixedResourceDenyDominate() STARTED
AclAuthorizerTest > testAuthorizeByResourceTypePrefixedResourceDenyDominate() PASSED
AclAuthorizerTest > testAuthorizeByResourceTypeMultipleAddAndRemove() STARTED
AclAuthorizerTest > testAuthorizeByResourceTypeMultipleAddAndRemove() PASSED
AclAuthorizerTest > testThrowsOnAddPrefixedAclIfInterBrokerProtocolVersionTooLow() STARTED
AclAuthorizerTest > testThrowsOnAddPrefixedAclIfInterBrokerProtocolVersionTooLow() PASSED
AclAuthorizerTest > testAccessAllowedIfAllowAclExistsOnPrefixedResource() STARTED
AclAuthorizerTest > testAccessAllowedIfAllowAclExistsOnPrefixedResource() PASSED
AclAuthorizerTest > testAuthorizeByResourceTypeDenyTakesPrecedence() STARTED
AclAuthorizerTest > testAuthorizeByResourceTypeDenyTakesPrecedence() PASSED
AclAuthorizerTest > testHighConcurrencyModificationOfResourceAcls() STARTED
AclAuthorizerTest > testHighConcurrencyModificationOfResourceAcls() PASSED
AclAuthorizerTest > testAuthorizeByResourceTypeWithAllPrincipalAce() STARTED
AclAuthorizerTest > testAuthorizeByResourceTypeWithAllPrincipalAce() PASSED
AclAuthorizerTest > testAuthorizeWithEmptyResourceName() STARTED
AclAuthorizerTest > testAuthorizeWithEmptyResourceName() PASSED
AclAuthorizerTest > testAuthorizeThrowsOnNonLiteralResource() STARTED
AclAuthorizerTest > testAuthorizeThrowsOnNonLiteralResource() PASSED
AclAuthorizerTest > testDeleteAllAclOnPrefixedResource() STARTED
AclAuthorizerTest > testDeleteAllAclOnPrefixedResource() PASSED
AclAuthorizerTest > testAddAclsOnLiteralResource() STARTED
AclAuthorizerTest > testAddAclsOnLiteralResource() PASSED
AclAuthorizerTest > testGetAclsPrincipal() STARTED
AclAuthorizerTest > testGetAclsPrincipal() PASSED
AclAuthorizerTest > testWritesExtendedAclChangeEventIfInterBrokerProtocolNotSet() STARTED
AclAuthorizerTest > testWritesExtendedAclChangeEventIfInterBrokerProtocolNotSet() PASSED
AclAuthorizerTest > testAccessAllowedIfAllowAclExistsOnWildcardResource() STARTED
AclAuthorizerTest > testAccessAllowedIfAllowAclExistsOnWildcardResource() PASSED
AclAuthorizerTest > testLoadCache() STARTED
AclAuthorizerTest > testLoadCache() PASSED
AuthorizerInterfaceDefaultTest > testAuthorizeByResourceTypeWithAllHostAce() STARTED
AuthorizerInterfaceDefaultTest > testAuthorizeByResourceTypeWithAllHostAce() PASSED
AuthorizerInterfaceDefaultTest > testAuthorizeByResourceTypeIsolationUnrelatedDenyWontDominateAllow() STARTED
AuthorizerInterfaceDefaultTest > testAuthorizeByResourceTypeIsolationUnrelatedDenyWontDominateAllow() PASSED
AuthorizerInterfaceDefaultTest > testAuthorizeByResourceTypeWildcardResourceDenyDominate() STARTED
AuthorizerInterfaceDefaultTest > testAuthorizeByResourceTypeWildcardResourceDenyDominate() PASSED
AuthorizerInterfaceDefaultTest > testAuthorizeByResourceTypeWithAllOperationAce() STARTED
AuthorizerInterfaceDefaultTest > testAuthorizeByResourceTypeWithAllOperationAce() PASSED
AuthorizerInterfaceDefaultTest > testAuthorzeByResourceTypeSuperUserHasAccess() STARTED
AuthorizerInterfaceDefaultTest > testAuthorzeByResourceTypeSuperUserHasAccess() PASSED
AuthorizerInterfaceDefaultTest > testAuthorizeByResourceTypePrefixedResourceDenyDominate() STARTED
AuthorizerInterfaceDefaultTest > testAuthorizeByResourceTypePrefixedResourceDenyDominate() PASSED
AuthorizerInterfaceDefaultTest > testAuthorizeByResourceTypeMultipleAddAndRemove() STARTED
AuthorizerInterfaceDefaultTest > testAuthorizeByResourceTypeMultipleAddAndRemove() PASSED
AuthorizerInterfaceDefaultTest > testAuthorizeByResourceTypeDenyTakesPrecedence() STARTED
AuthorizerInterfaceDefaultTest > testAuthorizeByResourceTypeDenyTakesPrecedence() PASSED
AuthorizerInterfaceDefaultTest > testAuthorizeByResourceTypeWithAllPrincipalAce() STARTED
AuthorizerInterfaceDefaultTest > testAuthorizeByResourceTypeWithAllPrincipalAce() PASSED
AclAuthorizerWithZkSaslTest > testAclUpdateWithSessionExpiration() STARTED
AclAuthorizerWithZkSaslTest > testAclUpdateWithSessionExpiration() PASSED
AclAuthorizerWithZkSaslTest > testAclUpdateWithAuthFailure() STARTED
AclAuthorizerWithZkSaslTest > testAclUpdateWithAuthFailure() PASSED
KafkaMetadataLogTest > testFailToIncreaseLogStartPastHighWatermark() STARTED
KafkaMetadataLogTest > testFailToIncreaseLogStartPastHighWatermark() PASSED
KafkaMetadataLogTest > testCreateReplicatedLogTruncatesFully() STARTED
KafkaMetadataLogTest > testCreateReplicatedLogTruncatesFully() PASSED
KafkaMetadataLogTest > testCreateSnapshot() STARTED
KafkaMetadataLogTest > testCreateSnapshot() PASSED
KafkaMetadataLogTest > testUpdateLogStartOffset() STARTED
KafkaMetadataLogTest > testUpdateLogStartOffset() PASSED
KafkaMetadataLogTest > testUnexpectedAppendOffset() STARTED
KafkaMetadataLogTest > testUnexpectedAppendOffset() PASSED
KafkaMetadataLogTest > testCleanupSnapshots() STARTED
KafkaMetadataLogTest > testCleanupSnapshots() PASSED
KafkaMetadataLogTest > testTruncateFullyToLatestSnapshot() STARTED
KafkaMetadataLogTest > testTruncateFullyToLatestSnapshot() PASSED
KafkaMetadataLogTest > testDoesntTruncateFully() STARTED
KafkaMetadataLogTest > testDoesntTruncateFully() PASSED
KafkaMetadataLogTest > testUpdateLogStartOffsetWithMissingSnapshot() STARTED
KafkaMetadataLogTest > testUpdateLogStartOffsetWithMissingSnapshot() PASSED
KafkaMetadataLogTest > testReadMissingSnapshot() STARTED
KafkaMetadataLogTest > testReadMissingSnapshot() PASSED
ControllerApisTest > testUnauthorizedBrokerRegistration() STARTED
ControllerApisTest > testUnauthorizedBrokerRegistration() PASSED
3448 tests completed, 1 failed, 7 skipped
> Task :core:test FAILED
FAILURE: Build failed with an exception.
* What went wrong:
Execution failed for task ':core:test'.
> There were failing tests. See the report at: file://<https://ci-builds.apache.org/job/Kafka/job/kafka-trunk-jdk15/ws/core/build/reports/tests/test/index.html>
* Try:
Run with --stacktrace option to get the stack trace. Run with --info or --debug option to get more log output. Run with --scan to get full insights.
* Get more help at https://help.gradle.org
Deprecated Gradle features were used in this build, making it incompatible with Gradle 7.0.
Use '--warning-mode all' to show the individual deprecation warnings.
See https://docs.gradle.org/6.8.1/userguide/command_line_interface.html#sec:command_line_warnings
BUILD FAILED in 1h 22m 54s
257 actionable tasks: 220 executed, 37 up-to-date
Build step 'Execute shell' marked build as failure
Recording test results
Not sending mail to unregistered user github@hugo-hirsch.de
Build failed in Jenkins: Kafka » kafka-trunk-jdk15 #591
Posted by Apache Jenkins Server <je...@builds.apache.org>.
See <https://ci-builds.apache.org/job/Kafka/job/kafka-trunk-jdk15/591/display/redirect?page=changes>
Changes:
[github] KAFKA-12284: Wait for mirrored topics to be created (#10185)
------------------------------------------
[...truncated 3.66 MB...]
ProducerFailureHandlingTest > testCannotSendToInternalTopic() PASSED
ProducerFailureHandlingTest > testTooLargeRecordWithAckOne() STARTED
ProducerFailureHandlingTest > testTooLargeRecordWithAckOne() PASSED
ProducerFailureHandlingTest > testWrongBrokerList() STARTED
ProducerFailureHandlingTest > testWrongBrokerList() PASSED
ProducerFailureHandlingTest > testNotEnoughReplicas() STARTED
ProducerFailureHandlingTest > testNotEnoughReplicas() PASSED
ProducerFailureHandlingTest > testResponseTooLargeForReplicationWithAckAll() STARTED
ProducerFailureHandlingTest > testResponseTooLargeForReplicationWithAckAll() PASSED
ProducerFailureHandlingTest > testNonExistentTopic() STARTED
ProducerFailureHandlingTest > testNonExistentTopic() PASSED
ProducerFailureHandlingTest > testInvalidPartition() STARTED
ProducerFailureHandlingTest > testInvalidPartition() PASSED
ProducerFailureHandlingTest > testSendAfterClosed() STARTED
ProducerFailureHandlingTest > testSendAfterClosed() PASSED
ProducerFailureHandlingTest > testTooLargeRecordWithAckZero() STARTED
ProducerFailureHandlingTest > testTooLargeRecordWithAckZero() PASSED
ProducerFailureHandlingTest > testPartitionTooLargeForReplicationWithAckAll() STARTED
ProducerFailureHandlingTest > testPartitionTooLargeForReplicationWithAckAll() PASSED
ProducerFailureHandlingTest > testNotEnoughReplicasAfterBrokerShutdown() STARTED
ProducerFailureHandlingTest > testNotEnoughReplicasAfterBrokerShutdown() PASSED
ApiVersionTest > testApiVersionUniqueIds() STARTED
ApiVersionTest > testApiVersionUniqueIds() PASSED
ApiVersionTest > testMinSupportedVersionFor() STARTED
ApiVersionTest > testMinSupportedVersionFor() PASSED
ApiVersionTest > testShortVersion() STARTED
ApiVersionTest > testShortVersion() PASSED
ApiVersionTest > shouldReturnAllKeysWhenMagicIsCurrentValueAndThrottleMsIsDefaultThrottle() STARTED
ApiVersionTest > shouldReturnAllKeysWhenMagicIsCurrentValueAndThrottleMsIsDefaultThrottle() PASSED
ApiVersionTest > testApply() STARTED
ApiVersionTest > testApply() PASSED
ApiVersionTest > testMetadataQuorumApisAreDisabled() STARTED
ApiVersionTest > testMetadataQuorumApisAreDisabled() PASSED
ApiVersionTest > shouldReturnFeatureKeysWhenMagicIsCurrentValueAndThrottleMsIsDefaultThrottle() STARTED
ApiVersionTest > shouldReturnFeatureKeysWhenMagicIsCurrentValueAndThrottleMsIsDefaultThrottle() PASSED
ApiVersionTest > shouldCreateApiResponseOnlyWithKeysSupportedByMagicValue() STARTED
ApiVersionTest > shouldCreateApiResponseOnlyWithKeysSupportedByMagicValue() PASSED
ApiVersionTest > testApiVersionValidator() STARTED
ApiVersionTest > testApiVersionValidator() PASSED
ControllerContextTest > testPartitionFullReplicaAssignmentReturnsEmptyAssignmentIfTopicOrPartitionDoesNotExist() STARTED
ControllerContextTest > testPartitionFullReplicaAssignmentReturnsEmptyAssignmentIfTopicOrPartitionDoesNotExist() PASSED
ControllerContextTest > testPartitionReplicaAssignmentForTopicReturnsEmptyMapIfTopicDoesNotExist() STARTED
ControllerContextTest > testPartitionReplicaAssignmentForTopicReturnsEmptyMapIfTopicDoesNotExist() PASSED
ControllerContextTest > testPreferredReplicaImbalanceMetric() STARTED
ControllerContextTest > testPreferredReplicaImbalanceMetric() PASSED
ControllerContextTest > testPartitionReplicaAssignmentForTopicReturnsExpectedReplicaAssignments() STARTED
ControllerContextTest > testPartitionReplicaAssignmentForTopicReturnsExpectedReplicaAssignments() PASSED
ControllerContextTest > testReassignTo() STARTED
ControllerContextTest > testReassignTo() PASSED
ControllerContextTest > testPartitionReplicaAssignment() STARTED
ControllerContextTest > testPartitionReplicaAssignment() PASSED
ControllerContextTest > testUpdatePartitionFullReplicaAssignmentUpdatesReplicaAssignment() STARTED
ControllerContextTest > testUpdatePartitionFullReplicaAssignmentUpdatesReplicaAssignment() PASSED
ControllerContextTest > testReassignToIdempotence() STARTED
ControllerContextTest > testReassignToIdempotence() PASSED
ControllerContextTest > testPartitionReplicaAssignmentReturnsEmptySeqIfTopicOrPartitionDoesNotExist() STARTED
ControllerContextTest > testPartitionReplicaAssignmentReturnsEmptySeqIfTopicOrPartitionDoesNotExist() PASSED
DefaultMessageFormatterTest > [1] name=print nothing, record=ConsumerRecord(topic = someTopic, partition = 9, leaderEpoch = null, offset = 9876, CreateTime = 1234, serialized key size = 0, serialized value size = 0, headers = RecordHeaders(headers = [RecordHeader(key = h1, value = [118, 49]), RecordHeader(key = h2, value = [118, 50])], isReadOnly = false), key = [B@3bc21f4d, value = [B@4d0a7a61), properties=Map(print.value -> false), expected= STARTED
DefaultMessageFormatterTest > [1] name=print nothing, record=ConsumerRecord(topic = someTopic, partition = 9, leaderEpoch = null, offset = 9876, CreateTime = 1234, serialized key size = 0, serialized value size = 0, headers = RecordHeaders(headers = [RecordHeader(key = h1, value = [118, 49]), RecordHeader(key = h2, value = [118, 50])], isReadOnly = false), key = [B@3bc21f4d, value = [B@4d0a7a61), properties=Map(print.value -> false), expected= PASSED
DefaultMessageFormatterTest > [2] name=print key, record=ConsumerRecord(topic = someTopic, partition = 9, leaderEpoch = null, offset = 9876, CreateTime = 1234, serialized key size = 0, serialized value size = 0, headers = RecordHeaders(headers = [RecordHeader(key = h1, value = [118, 49]), RecordHeader(key = h2, value = [118, 50])], isReadOnly = false), key = [B@37ce6a0b, value = [B@2989d7e1), properties=Map(print.key -> true, print.value -> false), expected=someKey
STARTED
DefaultMessageFormatterTest > [2] name=print key, record=ConsumerRecord(topic = someTopic, partition = 9, leaderEpoch = null, offset = 9876, CreateTime = 1234, serialized key size = 0, serialized value size = 0, headers = RecordHeaders(headers = [RecordHeader(key = h1, value = [118, 49]), RecordHeader(key = h2, value = [118, 50])], isReadOnly = false), key = [B@37ce6a0b, value = [B@2989d7e1), properties=Map(print.key -> true, print.value -> false), expected=someKey
PASSED
DefaultMessageFormatterTest > [3] name=print value, record=ConsumerRecord(topic = someTopic, partition = 9, leaderEpoch = null, offset = 9876, CreateTime = 1234, serialized key size = 0, serialized value size = 0, headers = RecordHeaders(headers = [RecordHeader(key = h1, value = [118, 49]), RecordHeader(key = h2, value = [118, 50])], isReadOnly = false), key = [B@178a4f88, value = [B@629743b5), properties=Map(), expected=someValue
STARTED
DefaultMessageFormatterTest > [3] name=print value, record=ConsumerRecord(topic = someTopic, partition = 9, leaderEpoch = null, offset = 9876, CreateTime = 1234, serialized key size = 0, serialized value size = 0, headers = RecordHeaders(headers = [RecordHeader(key = h1, value = [118, 49]), RecordHeader(key = h2, value = [118, 50])], isReadOnly = false), key = [B@178a4f88, value = [B@629743b5), properties=Map(), expected=someValue
PASSED
DefaultMessageFormatterTest > [4] name=print empty timestamp, record=ConsumerRecord(topic = someTopic, partition = 9, leaderEpoch = null, offset = 9876, NoTimestampType = 1234, serialized key size = 0, serialized value size = 0, headers = RecordHeaders(headers = [RecordHeader(key = h1, value = [118, 49]), RecordHeader(key = h2, value = [118, 50])], isReadOnly = false), key = [B@26cde3de, value = [B@419c1e39), properties=Map(print.timestamp -> true, print.value -> false), expected=NO_TIMESTAMP
STARTED
DefaultMessageFormatterTest > [4] name=print empty timestamp, record=ConsumerRecord(topic = someTopic, partition = 9, leaderEpoch = null, offset = 9876, NoTimestampType = 1234, serialized key size = 0, serialized value size = 0, headers = RecordHeaders(headers = [RecordHeader(key = h1, value = [118, 49]), RecordHeader(key = h2, value = [118, 50])], isReadOnly = false), key = [B@26cde3de, value = [B@419c1e39), properties=Map(print.timestamp -> true, print.value -> false), expected=NO_TIMESTAMP
PASSED
DefaultMessageFormatterTest > [5] name=print log append time timestamp, record=ConsumerRecord(topic = someTopic, partition = 9, leaderEpoch = null, offset = 9876, LogAppendTime = 1234, serialized key size = 0, serialized value size = 0, headers = RecordHeaders(headers = [RecordHeader(key = h1, value = [118, 49]), RecordHeader(key = h2, value = [118, 50])], isReadOnly = false), key = [B@42fff8d, value = [B@5c7d8e56), properties=Map(print.timestamp -> true, print.value -> false), expected=LogAppendTime:1234
STARTED
DefaultMessageFormatterTest > [5] name=print log append time timestamp, record=ConsumerRecord(topic = someTopic, partition = 9, leaderEpoch = null, offset = 9876, LogAppendTime = 1234, serialized key size = 0, serialized value size = 0, headers = RecordHeaders(headers = [RecordHeader(key = h1, value = [118, 49]), RecordHeader(key = h2, value = [118, 50])], isReadOnly = false), key = [B@42fff8d, value = [B@5c7d8e56), properties=Map(print.timestamp -> true, print.value -> false), expected=LogAppendTime:1234
PASSED
DefaultMessageFormatterTest > [6] name=print create time timestamp, record=ConsumerRecord(topic = someTopic, partition = 9, leaderEpoch = null, offset = 9876, CreateTime = 1234, serialized key size = 0, serialized value size = 0, headers = RecordHeaders(headers = [RecordHeader(key = h1, value = [118, 49]), RecordHeader(key = h2, value = [118, 50])], isReadOnly = false), key = [B@15674514, value = [B@342bec57), properties=Map(print.timestamp -> true, print.value -> false), expected=CreateTime:1234
STARTED
DefaultMessageFormatterTest > [6] name=print create time timestamp, record=ConsumerRecord(topic = someTopic, partition = 9, leaderEpoch = null, offset = 9876, CreateTime = 1234, serialized key size = 0, serialized value size = 0, headers = RecordHeaders(headers = [RecordHeader(key = h1, value = [118, 49]), RecordHeader(key = h2, value = [118, 50])], isReadOnly = false), key = [B@15674514, value = [B@342bec57), properties=Map(print.timestamp -> true, print.value -> false), expected=CreateTime:1234
PASSED
DefaultMessageFormatterTest > [7] name=print partition, record=ConsumerRecord(topic = someTopic, partition = 9, leaderEpoch = null, offset = 9876, CreateTime = 1234, serialized key size = 0, serialized value size = 0, headers = RecordHeaders(headers = [RecordHeader(key = h1, value = [118, 49]), RecordHeader(key = h2, value = [118, 50])], isReadOnly = false), key = [B@4f03bec8, value = [B@7fbc8640), properties=Map(print.partition -> true, print.value -> false), expected=Partition:9
STARTED
DefaultMessageFormatterTest > [7] name=print partition, record=ConsumerRecord(topic = someTopic, partition = 9, leaderEpoch = null, offset = 9876, CreateTime = 1234, serialized key size = 0, serialized value size = 0, headers = RecordHeaders(headers = [RecordHeader(key = h1, value = [118, 49]), RecordHeader(key = h2, value = [118, 50])], isReadOnly = false), key = [B@4f03bec8, value = [B@7fbc8640), properties=Map(print.partition -> true, print.value -> false), expected=Partition:9
PASSED
DefaultMessageFormatterTest > [8] name=print offset, record=ConsumerRecord(topic = someTopic, partition = 9, leaderEpoch = null, offset = 9876, CreateTime = 1234, serialized key size = 0, serialized value size = 0, headers = RecordHeaders(headers = [RecordHeader(key = h1, value = [118, 49]), RecordHeader(key = h2, value = [118, 50])], isReadOnly = false), key = [B@505c3346, value = [B@3bfe244e), properties=Map(print.offset -> true, print.value -> false), expected=Offset:9876
STARTED
DefaultMessageFormatterTest > [8] name=print offset, record=ConsumerRecord(topic = someTopic, partition = 9, leaderEpoch = null, offset = 9876, CreateTime = 1234, serialized key size = 0, serialized value size = 0, headers = RecordHeaders(headers = [RecordHeader(key = h1, value = [118, 49]), RecordHeader(key = h2, value = [118, 50])], isReadOnly = false), key = [B@505c3346, value = [B@3bfe244e), properties=Map(print.offset -> true, print.value -> false), expected=Offset:9876
PASSED
DefaultMessageFormatterTest > [9] name=print headers, record=ConsumerRecord(topic = someTopic, partition = 9, leaderEpoch = null, offset = 9876, CreateTime = 1234, serialized key size = 0, serialized value size = 0, headers = RecordHeaders(headers = [RecordHeader(key = h1, value = [118, 49]), RecordHeader(key = h2, value = [118, 50])], isReadOnly = false), key = [B@69593807, value = [B@72cc2dea), properties=Map(print.headers -> true, print.value -> false), expected=h1:v1,h2:v2
STARTED
DefaultMessageFormatterTest > [9] name=print headers, record=ConsumerRecord(topic = someTopic, partition = 9, leaderEpoch = null, offset = 9876, CreateTime = 1234, serialized key size = 0, serialized value size = 0, headers = RecordHeaders(headers = [RecordHeader(key = h1, value = [118, 49]), RecordHeader(key = h2, value = [118, 50])], isReadOnly = false), key = [B@69593807, value = [B@72cc2dea), properties=Map(print.headers -> true, print.value -> false), expected=h1:v1,h2:v2
PASSED
DefaultMessageFormatterTest > [10] name=print empty headers, record=ConsumerRecord(topic = someTopic, partition = 9, leaderEpoch = null, offset = 9876, CreateTime = 1234, serialized key size = 0, serialized value size = 0, headers = RecordHeaders(headers = [], isReadOnly = false), key = [B@92d769b, value = [B@2994eeb9), properties=Map(print.headers -> true, print.value -> false), expected=NO_HEADERS
STARTED
DefaultMessageFormatterTest > [10] name=print empty headers, record=ConsumerRecord(topic = someTopic, partition = 9, leaderEpoch = null, offset = 9876, CreateTime = 1234, serialized key size = 0, serialized value size = 0, headers = RecordHeaders(headers = [], isReadOnly = false), key = [B@92d769b, value = [B@2994eeb9), properties=Map(print.headers -> true, print.value -> false), expected=NO_HEADERS
PASSED
DefaultMessageFormatterTest > [11] name=print all possible fields with default delimiters, record=ConsumerRecord(topic = someTopic, partition = 9, leaderEpoch = null, offset = 9876, CreateTime = 1234, serialized key size = 0, serialized value size = 0, headers = RecordHeaders(headers = [RecordHeader(key = h1, value = [118, 49]), RecordHeader(key = h2, value = [118, 50])], isReadOnly = false), key = [B@3aa4351c, value = [B@263468f8), properties=Map(print.key -> true, print.headers -> true, print.partition -> true, print.offset -> true, print.timestamp -> true, print.value -> true), expected=CreateTime:1234 Partition:9 Offset:9876 h1:v1,h2:v2 someKey someValue
STARTED
DefaultMessageFormatterTest > [11] name=print all possible fields with default delimiters, record=ConsumerRecord(topic = someTopic, partition = 9, leaderEpoch = null, offset = 9876, CreateTime = 1234, serialized key size = 0, serialized value size = 0, headers = RecordHeaders(headers = [RecordHeader(key = h1, value = [118, 49]), RecordHeader(key = h2, value = [118, 50])], isReadOnly = false), key = [B@3aa4351c, value = [B@263468f8), properties=Map(print.key -> true, print.headers -> true, print.partition -> true, print.offset -> true, print.timestamp -> true, print.value -> true), expected=CreateTime:1234 Partition:9 Offset:9876 h1:v1,h2:v2 someKey someValue
PASSED
DefaultMessageFormatterTest > [12] name=print all possible fields with custom delimiters, record=ConsumerRecord(topic = someTopic, partition = 9, leaderEpoch = null, offset = 9876, CreateTime = 1234, serialized key size = 0, serialized value size = 0, headers = RecordHeaders(headers = [RecordHeader(key = h1, value = [118, 49]), RecordHeader(key = h2, value = [118, 50])], isReadOnly = false), key = [B@44cf5b0b, value = [B@4aa0940d), properties=Map(line.separator -> ^, print.key -> true, headers.separator -> #, print.headers -> true, key.separator -> |, print.partition -> true, print.offset -> true, print.timestamp -> true, print.value -> true), expected=CreateTime:1234|Partition:9|Offset:9876|h1:v1#h2:v2|someKey|someValue^ STARTED
DefaultMessageFormatterTest > [12] name=print all possible fields with custom delimiters, record=ConsumerRecord(topic = someTopic, partition = 9, leaderEpoch = null, offset = 9876, CreateTime = 1234, serialized key size = 0, serialized value size = 0, headers = RecordHeaders(headers = [RecordHeader(key = h1, value = [118, 49]), RecordHeader(key = h2, value = [118, 50])], isReadOnly = false), key = [B@44cf5b0b, value = [B@4aa0940d), properties=Map(line.separator -> ^, print.key -> true, headers.separator -> #, print.headers -> true, key.separator -> |, print.partition -> true, print.offset -> true, print.timestamp -> true, print.value -> true), expected=CreateTime:1234|Partition:9|Offset:9876|h1:v1#h2:v2|someKey|someValue^ PASSED
DefaultMessageFormatterTest > [13] name=print key with custom deserializer, record=ConsumerRecord(topic = someTopic, partition = 9, leaderEpoch = null, offset = 9876, CreateTime = 1234, serialized key size = 0, serialized value size = 0, headers = RecordHeaders(headers = [RecordHeader(key = h1, value = [118, 49]), RecordHeader(key = h2, value = [118, 50])], isReadOnly = false), key = [B@51375490, value = [B@54c185e6), properties=Map(print.key -> true, print.headers -> true, print.value -> true, key.deserializer -> unit.kafka.tools.UpperCaseDeserializer), expected=h1:v1,h2:v2 SOMEKEY someValue
STARTED
DefaultMessageFormatterTest > [13] name=print key with custom deserializer, record=ConsumerRecord(topic = someTopic, partition = 9, leaderEpoch = null, offset = 9876, CreateTime = 1234, serialized key size = 0, serialized value size = 0, headers = RecordHeaders(headers = [RecordHeader(key = h1, value = [118, 49]), RecordHeader(key = h2, value = [118, 50])], isReadOnly = false), key = [B@51375490, value = [B@54c185e6), properties=Map(print.key -> true, print.headers -> true, print.value -> true, key.deserializer -> unit.kafka.tools.UpperCaseDeserializer), expected=h1:v1,h2:v2 SOMEKEY someValue
PASSED
DefaultMessageFormatterTest > [14] name=print value with custom deserializer, record=ConsumerRecord(topic = someTopic, partition = 9, leaderEpoch = null, offset = 9876, CreateTime = 1234, serialized key size = 0, serialized value size = 0, headers = RecordHeaders(headers = [RecordHeader(key = h1, value = [118, 49]), RecordHeader(key = h2, value = [118, 50])], isReadOnly = false), key = [B@24266ada, value = [B@4f5e291a), properties=Map(print.key -> true, print.headers -> true, print.value -> true, value.deserializer -> unit.kafka.tools.UpperCaseDeserializer), expected=h1:v1,h2:v2 someKey SOMEVALUE
STARTED
DefaultMessageFormatterTest > [14] name=print value with custom deserializer, record=ConsumerRecord(topic = someTopic, partition = 9, leaderEpoch = null, offset = 9876, CreateTime = 1234, serialized key size = 0, serialized value size = 0, headers = RecordHeaders(headers = [RecordHeader(key = h1, value = [118, 49]), RecordHeader(key = h2, value = [118, 50])], isReadOnly = false), key = [B@24266ada, value = [B@4f5e291a), properties=Map(print.key -> true, print.headers -> true, print.value -> true, value.deserializer -> unit.kafka.tools.UpperCaseDeserializer), expected=h1:v1,h2:v2 someKey SOMEVALUE
PASSED
DefaultMessageFormatterTest > [15] name=print headers with custom deserializer, record=ConsumerRecord(topic = someTopic, partition = 9, leaderEpoch = null, offset = 9876, CreateTime = 1234, serialized key size = 0, serialized value size = 0, headers = RecordHeaders(headers = [RecordHeader(key = h1, value = [118, 49]), RecordHeader(key = h2, value = [118, 50])], isReadOnly = false), key = [B@17686ba2, value = [B@3975e102), properties=Map(print.key -> true, print.headers -> true, print.value -> true, headers.deserializer -> unit.kafka.tools.UpperCaseDeserializer), expected=h1:V1,h2:V2 someKey someValue
STARTED
DefaultMessageFormatterTest > [15] name=print headers with custom deserializer, record=ConsumerRecord(topic = someTopic, partition = 9, leaderEpoch = null, offset = 9876, CreateTime = 1234, serialized key size = 0, serialized value size = 0, headers = RecordHeaders(headers = [RecordHeader(key = h1, value = [118, 49]), RecordHeader(key = h2, value = [118, 50])], isReadOnly = false), key = [B@17686ba2, value = [B@3975e102), properties=Map(print.key -> true, print.headers -> true, print.value -> true, headers.deserializer -> unit.kafka.tools.UpperCaseDeserializer), expected=h1:V1,h2:V2 someKey someValue
PASSED
DefaultMessageFormatterTest > [16] name=print key and value, record=ConsumerRecord(topic = someTopic, partition = 9, leaderEpoch = null, offset = 9876, CreateTime = 1234, serialized key size = 0, serialized value size = 0, headers = RecordHeaders(headers = [RecordHeader(key = h1, value = [118, 49]), RecordHeader(key = h2, value = [118, 50])], isReadOnly = false), key = [B@2e123c4c, value = [B@103ac66d), properties=Map(print.key -> true, print.value -> true), expected=someKey someValue
STARTED
DefaultMessageFormatterTest > [16] name=print key and value, record=ConsumerRecord(topic = someTopic, partition = 9, leaderEpoch = null, offset = 9876, CreateTime = 1234, serialized key size = 0, serialized value size = 0, headers = RecordHeaders(headers = [RecordHeader(key = h1, value = [118, 49]), RecordHeader(key = h2, value = [118, 50])], isReadOnly = false), key = [B@2e123c4c, value = [B@103ac66d), properties=Map(print.key -> true, print.value -> true), expected=someKey someValue
PASSED
DefaultMessageFormatterTest > [17] name=print fields in the beginning, middle and the end, record=ConsumerRecord(topic = someTopic, partition = 9, leaderEpoch = null, offset = 9876, CreateTime = 1234, serialized key size = 0, serialized value size = 0, headers = RecordHeaders(headers = [RecordHeader(key = h1, value = [118, 49]), RecordHeader(key = h2, value = [118, 50])], isReadOnly = false), key = [B@33269b26, value = [B@61329ddf), properties=Map(print.key -> true, print.value -> true, print.partition -> true), expected=Partition:9 someKey someValue
STARTED
DefaultMessageFormatterTest > [17] name=print fields in the beginning, middle and the end, record=ConsumerRecord(topic = someTopic, partition = 9, leaderEpoch = null, offset = 9876, CreateTime = 1234, serialized key size = 0, serialized value size = 0, headers = RecordHeaders(headers = [RecordHeader(key = h1, value = [118, 49]), RecordHeader(key = h2, value = [118, 50])], isReadOnly = false), key = [B@33269b26, value = [B@61329ddf), properties=Map(print.key -> true, print.value -> true, print.partition -> true), expected=Partition:9 someKey someValue
PASSED
DefaultMessageFormatterTest > [18] name=null value without custom null literal, record=ConsumerRecord(topic = someTopic, partition = 9, leaderEpoch = null, offset = 9876, CreateTime = 1234, serialized key size = 0, serialized value size = 0, headers = RecordHeaders(headers = [RecordHeader(key = h1, value = [118, 49]), RecordHeader(key = h2, value = [118, 50])], isReadOnly = false), key = [B@7119ea34, value = null), properties=Map(print.key -> true), expected=someKey null
STARTED
DefaultMessageFormatterTest > [18] name=null value without custom null literal, record=ConsumerRecord(topic = someTopic, partition = 9, leaderEpoch = null, offset = 9876, CreateTime = 1234, serialized key size = 0, serialized value size = 0, headers = RecordHeaders(headers = [RecordHeader(key = h1, value = [118, 49]), RecordHeader(key = h2, value = [118, 50])], isReadOnly = false), key = [B@7119ea34, value = null), properties=Map(print.key -> true), expected=someKey null
PASSED
DefaultMessageFormatterTest > [19] name=null value with custom null literal, record=ConsumerRecord(topic = someTopic, partition = 9, leaderEpoch = null, offset = 9876, CreateTime = 1234, serialized key size = 0, serialized value size = 0, headers = RecordHeaders(headers = [RecordHeader(key = h1, value = [118, 49]), RecordHeader(key = h2, value = [118, 50])], isReadOnly = false), key = [B@5a9559fc, value = null), properties=Map(print.key -> true, null.literal -> NULL), expected=someKey NULL
STARTED
DefaultMessageFormatterTest > [19] name=null value with custom null literal, record=ConsumerRecord(topic = someTopic, partition = 9, leaderEpoch = null, offset = 9876, CreateTime = 1234, serialized key size = 0, serialized value size = 0, headers = RecordHeaders(headers = [RecordHeader(key = h1, value = [118, 49]), RecordHeader(key = h2, value = [118, 50])], isReadOnly = false), key = [B@5a9559fc, value = null), properties=Map(print.key -> true, null.literal -> NULL), expected=someKey NULL
PASSED
TransactionsWithMaxInFlightOneTest > testTransactionalProducerSingleBrokerMaxInFlightOne() STARTED
TransactionsWithMaxInFlightOneTest > testTransactionalProducerSingleBrokerMaxInFlightOne() PASSED
FAILURE: Build failed with an exception.
* What went wrong:
Execution failed for task ':connect:runtime:test'.
> There were failing tests. See the report at: file://<https://ci-builds.apache.org/job/Kafka/job/kafka-trunk-jdk15/ws/connect/runtime/build/reports/tests/test/index.html>
* Try:
Run with --stacktrace option to get the stack trace. Run with --info or --debug option to get more log output. Run with --scan to get full insights.
* Get more help at https://help.gradle.org
Deprecated Gradle features were used in this build, making it incompatible with Gradle 7.0.
Use '--warning-mode all' to show the individual deprecation warnings.
See https://docs.gradle.org/6.8.1/userguide/command_line_interface.html#sec:command_line_warnings
BUILD FAILED in 1h 32m 43s
257 actionable tasks: 220 executed, 37 up-to-date
Build step 'Execute shell' marked build as failure
Recording test results
Not sending mail to unregistered user github@hugo-hirsch.de