You are viewing a plain text version of this content. The canonical link for it is here.
Posted to dev@ode.apache.org by Apache Jenkins Server <je...@builds.apache.org> on 2014/10/13 13:18:19 UTC
Build failed in Jenkins: ODE-1.x #466
See <https://builds.apache.org/job/ODE-1.x/466/changes>
Changes:
[sathwik] ODE-928: Got rid of some of the printstacks
[sathwik] ODE-1022: Upgraded to OpenJPA 1.2.3
------------------------------------------
Started by an SCM change
Building remotely on ubuntu-4 (docker Ubuntu ubuntu4 ubuntu) in workspace <https://builds.apache.org/job/ODE-1.x/ws/>
> git rev-parse --is-inside-work-tree
Fetching changes from the remote Git repository
> git config remote.origin.url https://git-wip-us.apache.org/repos/asf/ode.git
Fetching upstream changes from https://git-wip-us.apache.org/repos/asf/ode.git
> git --version
> git fetch --tags --progress https://git-wip-us.apache.org/repos/asf/ode.git +refs/heads/*:refs/remotes/origin/*
> git rev-parse origin/ode-1.3.x^{commit}
Checking out Revision a5deb77acb70f2e1e7b876f9823f30bd8e8fe646 (origin/ode-1.3.x)
> git config core.sparsecheckout
> git checkout -f a5deb77acb70f2e1e7b876f9823f30bd8e8fe646
> git rev-list 6c0a99579314dd471080313b89d6d30df6214256
[locks-and-latches] Checking to see if we really have the locks
[locks-and-latches] Have all the locks, build can start
[ODE-1.x] $ /bin/bash /tmp/hudson3194127621392233957.sh
Warning, new version of rvm available '1.25.33', you are using older version '1.25.32'.
You can disable this warning with: echo rvm_autoupdate_flag=0 >> ~/.rvmrc
You can enable auto-update with: echo rvm_autoupdate_flag=2 >> ~/.rvmrc
Searching for binary rubies, this might take some time.
Found remote file http://jruby.org.s3.amazonaws.com/downloads/1.7.13/jruby-bin-1.7.13.tar.gz
Checking requirements for ubuntu.
Missing required packages: gawk
RVM autolibs is now configured with mode '2' => 'check and stop if missing',
please run `rvm autolibs enable` to let RVM do its job or run and read `rvm autolibs [help]`
or visit https://rvm.io/rvm/autolibs for more information.
Requirements installation failed with status: 1.
jruby-1.7.13 is not installed.
To install do: 'rvm install jruby-1.7.13'
/tmp/hudson3194127621392233957.sh: line 8: jruby: command not found
/tmp/hudson3194127621392233957.sh: line 9: bundle: command not found
/tmp/hudson3194127621392233957.sh: line 13: buildr: command not found
Build step 'Execute shell' marked build as failure
[locks-and-latches] Releasing all the locks
[locks-and-latches] All the locks released
Recording fingerprints
Archiving artifacts
Recording test results
TestNG Reports Processing: START
Looking for TestNG results report in workspace using pattern: **/reports/testng/testng-results.xml
Did not find any matching files.
Updating ODE-928
Updating ODE-1022
Jenkins build is back to normal : ODE-1.x #473
Posted by Apache Jenkins Server <je...@builds.apache.org>.
See <https://builds.apache.org/job/ODE-1.x/473/>
Build failed in Jenkins: ODE-1.x #472
Posted by Apache Jenkins Server <je...@builds.apache.org>.
See <https://builds.apache.org/job/ODE-1.x/472/>
------------------------------------------
Started by user Tammo van Lessen
Building remotely on ubuntu-4 (docker Ubuntu ubuntu4 ubuntu) in workspace <https://builds.apache.org/job/ODE-1.x/ws/>
> git rev-parse --is-inside-work-tree
Fetching changes from the remote Git repository
> git config remote.origin.url https://git-wip-us.apache.org/repos/asf/ode.git
Fetching upstream changes from https://git-wip-us.apache.org/repos/asf/ode.git
> git --version
> git fetch --tags --progress https://git-wip-us.apache.org/repos/asf/ode.git +refs/heads/*:refs/remotes/origin/*
> git rev-parse origin/ode-1.3.x^{commit}
Checking out Revision d5f4fe1d0c05b2689c7724b33569d18878a6633a (origin/ode-1.3.x)
> git config core.sparsecheckout
> git checkout -f d5f4fe1d0c05b2689c7724b33569d18878a6633a
> git rev-list d5f4fe1d0c05b2689c7724b33569d18878a6633a
[locks-and-latches] Checking to see if we really have the locks
[locks-and-latches] Have all the locks, build can start
[ODE-1.x] $ /bin/bash /tmp/hudson2293182843797782512.sh
Fetching gem metadata from https://rubygems.org/......
Resolving dependencies...
sudo: no tty present and no askpass program specified
Gem::Exception: Cannot load gem at [/var/lib/gems/1.9.1/cache/rake-0.9.2.2.gem] in <https://builds.apache.org/job/ODE-1.x/ws/>
An error occurred while installing rake (0.9.2.2), and Bundler cannot continue.
Make sure that `gem install rake -v '0.9.2.2'` succeeds before bundling.
/tmp/hudson2293182843797782512.sh: line 13: buildr: command not found
Build step 'Execute shell' marked build as failure
[locks-and-latches] Releasing all the locks
[locks-and-latches] All the locks released
Recording fingerprints
Archiving artifacts
Recording test results
TestNG Reports Processing: START
Looking for TestNG results report in workspace using pattern: **/reports/testng/testng-results.xml
Did not find any matching files.
Build failed in Jenkins: ODE-1.x #471
Posted by Apache Jenkins Server <je...@builds.apache.org>.
See <https://builds.apache.org/job/ODE-1.x/471/>
------------------------------------------
Started by user Tammo van Lessen
Building remotely on ubuntu-4 (docker Ubuntu ubuntu4 ubuntu) in workspace <https://builds.apache.org/job/ODE-1.x/ws/>
> git rev-parse --is-inside-work-tree
Fetching changes from the remote Git repository
> git config remote.origin.url https://git-wip-us.apache.org/repos/asf/ode.git
Fetching upstream changes from https://git-wip-us.apache.org/repos/asf/ode.git
> git --version
> git fetch --tags --progress https://git-wip-us.apache.org/repos/asf/ode.git +refs/heads/*:refs/remotes/origin/*
> git rev-parse origin/ode-1.3.x^{commit}
Checking out Revision d5f4fe1d0c05b2689c7724b33569d18878a6633a (origin/ode-1.3.x)
> git config core.sparsecheckout
> git checkout -f d5f4fe1d0c05b2689c7724b33569d18878a6633a
> git rev-list d5f4fe1d0c05b2689c7724b33569d18878a6633a
[locks-and-latches] Checking to see if we really have the locks
[locks-and-latches] Have all the locks, build can start
[ODE-1.x] $ /bin/bash /tmp/hudson4808026472156035702.sh
Warning, new version of rvm available '1.25.33', you are using older version '1.25.32'.
You can disable this warning with: echo rvm_autoupdate_flag=0 >> ~/.rvmrc
You can enable auto-update with: echo rvm_autoupdate_flag=2 >> ~/.rvmrc
Searching for binary rubies, this might take some time.
Found remote file http://jruby.org.s3.amazonaws.com/downloads/1.7.13/jruby-bin-1.7.13.tar.gz
Checking requirements for ubuntu.
Missing required packages: gawk
RVM autolibs is now configured with mode '2' => 'check and stop if missing',
please run `rvm autolibs enable` to let RVM do its job or run and read `rvm autolibs [help]`
or visit https://rvm.io/rvm/autolibs for more information.
Requirements installation failed with status: 1.
jruby-1.7.13 is not installed.
To install do: 'rvm install jruby-1.7.13'
/tmp/hudson4808026472156035702.sh: line 8: jruby: command not found
Fetching gem metadata from https://rubygems.org/......
Resolving dependencies...
sudo: no tty present and no askpass program specified
Gem::Exception: Cannot load gem at [/var/lib/gems/1.9.1/cache/rake-0.9.2.2.gem] in <https://builds.apache.org/job/ODE-1.x/ws/>
An error occurred while installing rake (0.9.2.2), and Bundler cannot continue.
Make sure that `gem install rake -v '0.9.2.2'` succeeds before bundling.
/tmp/hudson4808026472156035702.sh: line 13: buildr: command not found
Build step 'Execute shell' marked build as failure
[locks-and-latches] Releasing all the locks
[locks-and-latches] All the locks released
Recording fingerprints
Archiving artifacts
Recording test results
TestNG Reports Processing: START
Looking for TestNG results report in workspace using pattern: **/reports/testng/testng-results.xml
Did not find any matching files.
Build failed in Jenkins: ODE-1.x #470
Posted by Apache Jenkins Server <je...@builds.apache.org>.
See <https://builds.apache.org/job/ODE-1.x/470/changes>
Changes:
[sathwik] Fixed errors occurring during random execution of test methods in VersionedRedployTest and BasicActivities20Test
------------------------------------------
Started by an SCM change
Building remotely on ubuntu-4 (docker Ubuntu ubuntu4 ubuntu) in workspace <https://builds.apache.org/job/ODE-1.x/ws/>
> git rev-parse --is-inside-work-tree
Fetching changes from the remote Git repository
> git config remote.origin.url https://git-wip-us.apache.org/repos/asf/ode.git
Fetching upstream changes from https://git-wip-us.apache.org/repos/asf/ode.git
> git --version
> git fetch --tags --progress https://git-wip-us.apache.org/repos/asf/ode.git +refs/heads/*:refs/remotes/origin/*
> git rev-parse origin/ode-1.3.x^{commit}
Checking out Revision d5f4fe1d0c05b2689c7724b33569d18878a6633a (origin/ode-1.3.x)
> git config core.sparsecheckout
> git checkout -f d5f4fe1d0c05b2689c7724b33569d18878a6633a
> git rev-list 6298251678a5efb9f006fbf0f064ad25c41462e4
[locks-and-latches] Checking to see if we really have the locks
[locks-and-latches] Have all the locks, build can start
[ODE-1.x] $ /bin/bash /tmp/hudson2603108606414409348.sh
Warning, new version of rvm available '1.25.33', you are using older version '1.25.32'.
You can disable this warning with: echo rvm_autoupdate_flag=0 >> ~/.rvmrc
You can enable auto-update with: echo rvm_autoupdate_flag=2 >> ~/.rvmrc
Searching for binary rubies, this might take some time.
Found remote file http://jruby.org.s3.amazonaws.com/downloads/1.7.13/jruby-bin-1.7.13.tar.gz
Checking requirements for ubuntu.
Missing required packages: gawk
RVM autolibs is now configured with mode '2' => 'check and stop if missing',
please run `rvm autolibs enable` to let RVM do its job or run and read `rvm autolibs [help]`
or visit https://rvm.io/rvm/autolibs for more information.
Requirements installation failed with status: 1.
jruby-1.7.13 is not installed.
To install do: 'rvm install jruby-1.7.13'
/tmp/hudson2603108606414409348.sh: line 8: jruby: command not found
Fetching gem metadata from https://rubygems.org/......
Resolving dependencies...
sudo: no tty present and no askpass program specified
Gem::Exception: Cannot load gem at [/var/lib/gems/1.9.1/cache/rake-0.9.2.2.gem] in <https://builds.apache.org/job/ODE-1.x/ws/>
An error occurred while installing rake (0.9.2.2), and Bundler cannot continue.
Make sure that `gem install rake -v '0.9.2.2'` succeeds before bundling.
/tmp/hudson2603108606414409348.sh: line 13: buildr: command not found
Build step 'Execute shell' marked build as failure
[locks-and-latches] Releasing all the locks
[locks-and-latches] All the locks released
Recording fingerprints
Archiving artifacts
Recording test results
TestNG Reports Processing: START
Looking for TestNG results report in workspace using pattern: **/reports/testng/testng-results.xml
Did not find any matching files.
Build failed in Jenkins: ODE-1.x #469
Posted by Apache Jenkins Server <je...@builds.apache.org>.
See <https://builds.apache.org/job/ODE-1.x/469/changes>
Changes:
[sathwik] Added missing imports in CronSchedulerTest
------------------------------------------
Started by an SCM change
Building remotely on ubuntu-4 (docker Ubuntu ubuntu4 ubuntu) in workspace <https://builds.apache.org/job/ODE-1.x/ws/>
> git rev-parse --is-inside-work-tree
Fetching changes from the remote Git repository
> git config remote.origin.url https://git-wip-us.apache.org/repos/asf/ode.git
Fetching upstream changes from https://git-wip-us.apache.org/repos/asf/ode.git
> git --version
> git fetch --tags --progress https://git-wip-us.apache.org/repos/asf/ode.git +refs/heads/*:refs/remotes/origin/*
> git rev-parse origin/ode-1.3.x^{commit}
Checking out Revision 6298251678a5efb9f006fbf0f064ad25c41462e4 (origin/ode-1.3.x)
> git config core.sparsecheckout
> git checkout -f 6298251678a5efb9f006fbf0f064ad25c41462e4
> git rev-list 4e4451a7a38f54e13c5281ae30606f491d85692e
[locks-and-latches] Checking to see if we really have the locks
[locks-and-latches] Have all the locks, build can start
[ODE-1.x] $ /bin/bash /tmp/hudson4604275112276917559.sh
Warning, new version of rvm available '1.25.33', you are using older version '1.25.32'.
You can disable this warning with: echo rvm_autoupdate_flag=0 >> ~/.rvmrc
You can enable auto-update with: echo rvm_autoupdate_flag=2 >> ~/.rvmrc
Searching for binary rubies, this might take some time.
Found remote file http://jruby.org.s3.amazonaws.com/downloads/1.7.13/jruby-bin-1.7.13.tar.gz
Checking requirements for ubuntu.
Missing required packages: gawk
RVM autolibs is now configured with mode '2' => 'check and stop if missing',
please run `rvm autolibs enable` to let RVM do its job or run and read `rvm autolibs [help]`
or visit https://rvm.io/rvm/autolibs for more information.
Requirements installation failed with status: 1.
jruby-1.7.13 is not installed.
To install do: 'rvm install jruby-1.7.13'
/tmp/hudson4604275112276917559.sh: line 8: jruby: command not found
Fetching gem metadata from https://rubygems.org/......
Resolving dependencies...
sudo: no tty present and no askpass program specified
Gem::Exception: Cannot load gem at [/var/lib/gems/1.9.1/cache/rake-0.9.2.2.gem] in <https://builds.apache.org/job/ODE-1.x/ws/>
An error occurred while installing rake (0.9.2.2), and Bundler cannot continue.
Make sure that `gem install rake -v '0.9.2.2'` succeeds before bundling.
/tmp/hudson4604275112276917559.sh: line 13: buildr: command not found
Build step 'Execute shell' marked build as failure
[locks-and-latches] Releasing all the locks
[locks-and-latches] All the locks released
Recording fingerprints
Archiving artifacts
Recording test results
TestNG Reports Processing: START
Looking for TestNG results report in workspace using pattern: **/reports/testng/testng-results.xml
Did not find any matching files.
Build failed in Jenkins: ODE-1.x #468
Posted by Apache Jenkins Server <je...@builds.apache.org>.
See <https://builds.apache.org/job/ODE-1.x/468/changes>
Changes:
[Tammo van Lessen] upgrade JMock tests from JMock 1.2 to JMock 2.5.x
------------------------------------------
Started by an SCM change
Building remotely on ubuntu-4 (docker Ubuntu ubuntu4 ubuntu) in workspace <https://builds.apache.org/job/ODE-1.x/ws/>
> git rev-parse --is-inside-work-tree
Fetching changes from the remote Git repository
> git config remote.origin.url https://git-wip-us.apache.org/repos/asf/ode.git
Fetching upstream changes from https://git-wip-us.apache.org/repos/asf/ode.git
> git --version
> git fetch --tags --progress https://git-wip-us.apache.org/repos/asf/ode.git +refs/heads/*:refs/remotes/origin/*
> git rev-parse origin/ode-1.3.x^{commit}
Checking out Revision 4e4451a7a38f54e13c5281ae30606f491d85692e (origin/ode-1.3.x)
> git config core.sparsecheckout
> git checkout -f 4e4451a7a38f54e13c5281ae30606f491d85692e
> git rev-list 50cd6568992b5c4c2c4e695a674a507b1c0bb46f
[locks-and-latches] Checking to see if we really have the locks
[locks-and-latches] Have all the locks, build can start
[ODE-1.x] $ /bin/bash /tmp/hudson5575391646666665368.sh
Warning, new version of rvm available '1.25.33', you are using older version '1.25.32'.
You can disable this warning with: echo rvm_autoupdate_flag=0 >> ~/.rvmrc
You can enable auto-update with: echo rvm_autoupdate_flag=2 >> ~/.rvmrc
Searching for binary rubies, this might take some time.
Found remote file http://jruby.org.s3.amazonaws.com/downloads/1.7.13/jruby-bin-1.7.13.tar.gz
Checking requirements for ubuntu.
Missing required packages: gawk
RVM autolibs is now configured with mode '2' => 'check and stop if missing',
please run `rvm autolibs enable` to let RVM do its job or run and read `rvm autolibs [help]`
or visit https://rvm.io/rvm/autolibs for more information.
Requirements installation failed with status: 1.
jruby-1.7.13 is not installed.
To install do: 'rvm install jruby-1.7.13'
/tmp/hudson5575391646666665368.sh: line 8: jruby: command not found
Fetching gem metadata from https://rubygems.org/......
Resolving dependencies...
sudo: no tty present and no askpass program specified
Gem::Exception: Cannot load gem at [/var/lib/gems/1.9.1/cache/rake-0.9.2.2.gem] in <https://builds.apache.org/job/ODE-1.x/ws/>
An error occurred while installing rake (0.9.2.2), and Bundler cannot continue.
Make sure that `gem install rake -v '0.9.2.2'` succeeds before bundling.
/tmp/hudson5575391646666665368.sh: line 13: buildr: command not found
Build step 'Execute shell' marked build as failure
[locks-and-latches] Releasing all the locks
[locks-and-latches] All the locks released
Recording fingerprints
Archiving artifacts
Recording test results
TestNG Reports Processing: START
Looking for TestNG results report in workspace using pattern: **/reports/testng/testng-results.xml
Did not find any matching files.
Build failed in Jenkins: ODE-1.x #467
Posted by Apache Jenkins Server <je...@builds.apache.org>.
See <https://builds.apache.org/job/ODE-1.x/467/changes>
Changes:
[Tammo van Lessen] bump jmock version to 2.5.1
------------------------------------------
[...truncated 936 lines...]
^
/x1/jenkins/jenkins-slave/workspace/ODE-1.x/bpel-runtime/src/test/java/org/apache/ode/bpel/runtime/ActivityRecoveryTest.java:171: cannot find symbol
symbol : method returnValue(boolean)
location: class org.apache.ode.bpel.runtime.ActivityRecoveryTest
_testService.expects(exactly(1)).method("invoke").will(returnValue(false));
^
/x1/jenkins/jenkins-slave/workspace/ODE-1.x/bpel-runtime/src/test/java/org/apache/ode/bpel/runtime/ActivityRecoveryTest.java:171: cannot find symbol
symbol : method exactly(int)
location: class org.apache.ode.bpel.runtime.ActivityRecoveryTest
_testService.expects(exactly(1)).method("invoke").will(returnValue(false));
^
/x1/jenkins/jenkins-slave/workspace/ODE-1.x/bpel-runtime/src/test/java/org/apache/ode/bpel/runtime/ActivityRecoveryTest.java:172: cannot find symbol
symbol : method never()
location: class org.apache.ode.bpel.runtime.ActivityRecoveryTest
_testService.expects(never()).method("completed").after("invoke");
^
/x1/jenkins/jenkins-slave/workspace/ODE-1.x/bpel-runtime/src/test/java/org/apache/ode/bpel/runtime/ActivityRecoveryTest.java:175: cannot find symbol
symbol : method assertNotNull(org.apache.ode.bpel.pmapi.TInstanceInfo)
location: class org.apache.ode.bpel.runtime.ActivityRecoveryTest
assertNotNull(lastInstance(TInstanceStatus.FAILED));
^
/x1/jenkins/jenkins-slave/workspace/ODE-1.x/bpel-runtime/src/test/java/org/apache/ode/bpel/runtime/ActivityRecoveryTest.java:176: cannot find symbol
symbol : method assertEquals(javax.xml.namespace.QName,javax.xml.namespace.QName)
location: class org.apache.ode.bpel.runtime.ActivityRecoveryTest
assertEquals(OFailureHandling.FAILURE_FAULT_NAME, lastInstance(TInstanceStatus.FAILED).getFaultInfo().getName());
^
/x1/jenkins/jenkins-slave/workspace/ODE-1.x/bpel-runtime/src/test/java/org/apache/ode/bpel/runtime/ActivityRecoveryTest.java:183: cannot find symbol
symbol : method exactly(int)
location: class org.apache.ode.bpel.runtime.ActivityRecoveryTest
_testService.expects(exactly(3)).method("invoke").will(failTheFirst(2));
^
/x1/jenkins/jenkins-slave/workspace/ODE-1.x/bpel-runtime/src/test/java/org/apache/ode/bpel/runtime/ActivityRecoveryTest.java:184: cannot find symbol
symbol : method once()
location: class org.apache.ode.bpel.runtime.ActivityRecoveryTest
_testService.expects(once()).method("completed").after("invoke");
^
/x1/jenkins/jenkins-slave/workspace/ODE-1.x/bpel-runtime/src/test/java/org/apache/ode/bpel/runtime/ActivityRecoveryTest.java:187: cannot find symbol
symbol : method assertNotNull(org.apache.ode.bpel.pmapi.TInstanceInfo)
location: class org.apache.ode.bpel.runtime.ActivityRecoveryTest
assertNotNull(lastInstance(TInstanceStatus.COMPLETED));
^
/x1/jenkins/jenkins-slave/workspace/ODE-1.x/bpel-runtime/src/test/java/org/apache/ode/bpel/runtime/ActivityRecoveryTest.java:195: cannot find symbol
symbol : method exactly(int)
location: class org.apache.ode.bpel.runtime.ActivityRecoveryTest
_testService.expects(exactly(4)).method("invoke").will(failTheFirst(3));
^
/x1/jenkins/jenkins-slave/workspace/ODE-1.x/bpel-runtime/src/test/java/org/apache/ode/bpel/runtime/ActivityRecoveryTest.java:196: cannot find symbol
symbol : method once()
location: class org.apache.ode.bpel.runtime.ActivityRecoveryTest
_testService.expects(once()).method("completed").after("invoke");
^
/x1/jenkins/jenkins-slave/workspace/ODE-1.x/bpel-runtime/src/test/java/org/apache/ode/bpel/runtime/ActivityRecoveryTest.java:201: cannot find symbol
symbol : method exactly(int)
location: class org.apache.ode.bpel.runtime.ActivityRecoveryTest
_testService.expects(exactly(3)).method("invoke").will(failTheFirst(3));
^
/x1/jenkins/jenkins-slave/workspace/ODE-1.x/bpel-runtime/src/test/java/org/apache/ode/bpel/runtime/ActivityRecoveryTest.java:206: cannot find symbol
symbol : method exactly(int)
location: class org.apache.ode.bpel.runtime.ActivityRecoveryTest
_testService.expects(exactly(3)).method("invoke").will(failTheFirst(3));
^
/x1/jenkins/jenkins-slave/workspace/ODE-1.x/bpel-runtime/src/test/java/org/apache/ode/bpel/runtime/ActivityRecoveryTest.java:215: cannot find symbol
symbol : method assertTrue(boolean)
location: class org.apache.ode.bpel.runtime.ActivityRecoveryTest
assertTrue(instances.getCount() == 1);
^
/x1/jenkins/jenkins-slave/workspace/ODE-1.x/bpel-runtime/src/test/java/org/apache/ode/bpel/runtime/ActivityRecoveryTest.java:218: cannot find symbol
symbol : method assertTrue(boolean)
location: class org.apache.ode.bpel.runtime.ActivityRecoveryTest
assertTrue(instances.getCount() == 1);
^
/x1/jenkins/jenkins-slave/workspace/ODE-1.x/bpel-runtime/src/test/java/org/apache/ode/bpel/runtime/ActivityRecoveryTest.java:221: cannot find symbol
symbol : method assertTrue(boolean)
location: class org.apache.ode.bpel.runtime.ActivityRecoveryTest
assertTrue(instances.getCount() == 1);
^
/x1/jenkins/jenkins-slave/workspace/ODE-1.x/bpel-runtime/src/test/java/org/apache/ode/bpel/runtime/ActivityRecoveryTest.java:224: cannot find symbol
symbol : method assertTrue(boolean)
location: class org.apache.ode.bpel.runtime.ActivityRecoveryTest
assertTrue(instances.getCount() == 0);
^
/x1/jenkins/jenkins-slave/workspace/ODE-1.x/bpel-runtime/src/test/java/org/apache/ode/bpel/runtime/ActivityRecoveryTest.java:228: cannot find symbol
symbol : method assertTrue(boolean)
location: class org.apache.ode.bpel.runtime.ActivityRecoveryTest
assertTrue(summary.getFailures().getCount() == 1);
^
/x1/jenkins/jenkins-slave/workspace/ODE-1.x/bpel-runtime/src/test/java/org/apache/ode/bpel/runtime/ActivityRecoveryTest.java:229: cannot find symbol
symbol : method assertNotNull(java.util.Calendar)
location: class org.apache.ode.bpel.runtime.ActivityRecoveryTest
assertNotNull(summary.getFailures().getDtFailure());
^
/x1/jenkins/jenkins-slave/workspace/ODE-1.x/bpel-runtime/src/test/java/org/apache/ode/bpel/runtime/ActivityRecoveryTest.java:235: cannot find symbol
symbol : method mock(java.lang.Class<org.apache.ode.bpel.runtime.ActivityRecoveryTest.TestService>)
location: class org.apache.ode.bpel.runtime.ActivityRecoveryTest
_testService = mock(TestService.class);
^
/x1/jenkins/jenkins-slave/workspace/ODE-1.x/bpel-runtime/src/test/java/org/apache/ode/bpel/runtime/ActivityRecoveryTest.java:237: cannot find symbol
symbol : class Mock
location: class org.apache.ode.bpel.runtime.ActivityRecoveryTest
final Mock partner = mock(MessageExchangeContext.class);
^
/x1/jenkins/jenkins-slave/workspace/ODE-1.x/bpel-runtime/src/test/java/org/apache/ode/bpel/runtime/ActivityRecoveryTest.java:237: cannot find symbol
symbol : method mock(java.lang.Class<org.apache.ode.bpel.iapi.MessageExchangeContext>)
location: class org.apache.ode.bpel.runtime.ActivityRecoveryTest
final Mock partner = mock(MessageExchangeContext.class);
^
/x1/jenkins/jenkins-slave/workspace/ODE-1.x/bpel-runtime/src/test/java/org/apache/ode/bpel/runtime/ActivityRecoveryTest.java:239: cannot find symbol
symbol : class CustomStub
location: class org.apache.ode.bpel.runtime.ActivityRecoveryTest
partner.expects(atMostOnce()).match(invokeOnOperation("respond")).will(new CustomStub("process completed") {
^
/x1/jenkins/jenkins-slave/workspace/ODE-1.x/bpel-runtime/src/test/java/org/apache/ode/bpel/runtime/ActivityRecoveryTest.java:239: cannot find symbol
symbol : method atMostOnce()
location: class org.apache.ode.bpel.runtime.ActivityRecoveryTest
partner.expects(atMostOnce()).match(invokeOnOperation("respond")).will(new CustomStub("process completed") {
^
/x1/jenkins/jenkins-slave/workspace/ODE-1.x/bpel-runtime/src/test/java/org/apache/ode/bpel/runtime/ActivityRecoveryTest.java:246: cannot find symbol
symbol : class CustomStub
location: class org.apache.ode.bpel.runtime.ActivityRecoveryTest
partner.expects(atLeastOnce()).match(invokeOnOperation("invoke")).will(new CustomStub("invoke failing service") {
^
/x1/jenkins/jenkins-slave/workspace/ODE-1.x/bpel-runtime/src/test/java/org/apache/ode/bpel/runtime/ActivityRecoveryTest.java:246: cannot find symbol
symbol : method atLeastOnce()
location: class org.apache.ode.bpel.runtime.ActivityRecoveryTest
partner.expects(atLeastOnce()).match(invokeOnOperation("invoke")).will(new CustomStub("invoke failing service") {
^
/x1/jenkins/jenkins-slave/workspace/ODE-1.x/bpel-runtime/src/test/java/org/apache/ode/bpel/runtime/ActivityRecoveryTest.java:261: cannot find symbol
symbol : class CustomStub
location: class org.apache.ode.bpel.runtime.ActivityRecoveryTest
partner.expects(atMostOnce()).method("onAsyncReply").will(new CustomStub("async reply") {
^
/x1/jenkins/jenkins-slave/workspace/ODE-1.x/bpel-runtime/src/test/java/org/apache/ode/bpel/runtime/ActivityRecoveryTest.java:261: cannot find symbol
symbol : method atMostOnce()
location: class org.apache.ode.bpel.runtime.ActivityRecoveryTest
partner.expects(atMostOnce()).method("onAsyncReply").will(new CustomStub("async reply") {
^
/x1/jenkins/jenkins-slave/workspace/ODE-1.x/bpel-runtime/src/test/java/org/apache/ode/bpel/runtime/ActivityRecoveryTest.java:272: cannot find symbol
symbol : method getClass()
location: class org.apache.ode.bpel.runtime.ActivityRecoveryTest
_server.deploy(new File(new URI(this.getClass().getResource("/recovery").toString())));
^
/x1/jenkins/jenkins-slave/workspace/ODE-1.x/bpel-runtime/src/test/java/org/apache/ode/bpel/runtime/ActivityRecoveryTest.java:286: cannot find symbol
symbol : class Stub
location: class org.apache.ode.bpel.runtime.ActivityRecoveryTest
Stub[] stubs = new Stub[times + 1];
^
/x1/jenkins/jenkins-slave/workspace/ODE-1.x/bpel-runtime/src/test/java/org/apache/ode/bpel/runtime/ActivityRecoveryTest.java:286: cannot find symbol
symbol : class Stub
location: class org.apache.ode.bpel.runtime.ActivityRecoveryTest
Stub[] stubs = new Stub[times + 1];
^
/x1/jenkins/jenkins-slave/workspace/ODE-1.x/bpel-runtime/src/test/java/org/apache/ode/bpel/runtime/ActivityRecoveryTest.java:288: cannot find symbol
symbol : method returnValue(boolean)
location: class org.apache.ode.bpel.runtime.ActivityRecoveryTest
stubs[i] = returnValue(false);
^
/x1/jenkins/jenkins-slave/workspace/ODE-1.x/bpel-runtime/src/test/java/org/apache/ode/bpel/runtime/ActivityRecoveryTest.java:289: cannot find symbol
symbol : method returnValue(boolean)
location: class org.apache.ode.bpel.runtime.ActivityRecoveryTest
stubs[times] = returnValue(true);
^
/x1/jenkins/jenkins-slave/workspace/ODE-1.x/bpel-runtime/src/test/java/org/apache/ode/bpel/runtime/ActivityRecoveryTest.java:290: cannot find symbol
symbol : class StubSequence
location: class org.apache.ode.bpel.runtime.ActivityRecoveryTest
return new StubSequence(stubs);
^
/x1/jenkins/jenkins-slave/workspace/ODE-1.x/bpel-runtime/src/test/java/org/apache/ode/bpel/runtime/ActivityRecoveryTest.java:295: cannot find symbol
symbol : class StatelessInvocationMatcher
location: class org.apache.ode.bpel.runtime.ActivityRecoveryTest
return new StatelessInvocationMatcher() {
^
/x1/jenkins/jenkins-slave/workspace/ODE-1.x/bpel-runtime/src/test/java/org/apache/ode/bpel/runtime/ActivityRecoveryTest.java:322: cannot find symbol
symbol : method assertTrue(boolean)
location: class org.apache.ode.bpel.runtime.ActivityRecoveryTest
assertTrue(failures == null || failures.getCount() == 0);
^
/x1/jenkins/jenkins-slave/workspace/ODE-1.x/bpel-runtime/src/test/java/org/apache/ode/bpel/runtime/ActivityRecoveryTest.java:324: cannot find symbol
symbol : method assertTrue(boolean)
location: class org.apache.ode.bpel.runtime.ActivityRecoveryTest
assertTrue(failures == null || failures.getCount() == 0);
^
/x1/jenkins/jenkins-slave/workspace/ODE-1.x/bpel-runtime/src/test/java/org/apache/ode/bpel/runtime/ActivityRecoveryTest.java:367: cannot find symbol
symbol : method assertNotNull(org.apache.ode.bpel.pmapi.TInstanceInfo)
location: class org.apache.ode.bpel.runtime.ActivityRecoveryTest
assertNotNull(lastInstance(TInstanceStatus.ACTIVE));
^
/x1/jenkins/jenkins-slave/workspace/ODE-1.x/bpel-runtime/src/test/java/org/apache/ode/bpel/runtime/ActivityRecoveryTest.java:387: cannot find symbol
symbol : method assertTrue(boolean)
location: class org.apache.ode.bpel.runtime.ActivityRecoveryTest
assertTrue(recoveries.size() == 1);
^
/x1/jenkins/jenkins-slave/workspace/ODE-1.x/bpel-runtime/src/test/java/org/apache/ode/bpel/runtime/ActivityRecoveryTest.java:389: cannot find symbol
symbol : method assertTrue(boolean)
location: class org.apache.ode.bpel.runtime.ActivityRecoveryTest
assertTrue(failure.getRetries() == invoked - 1);
^
/x1/jenkins/jenkins-slave/workspace/ODE-1.x/bpel-runtime/src/test/java/org/apache/ode/bpel/runtime/ActivityRecoveryTest.java:390: cannot find symbol
symbol : method assertTrue(boolean)
location: class org.apache.ode.bpel.runtime.ActivityRecoveryTest
assertTrue(failure.getReason().equals("BangGoesInvoke"));
^
/x1/jenkins/jenkins-slave/workspace/ODE-1.x/bpel-runtime/src/test/java/org/apache/ode/bpel/runtime/ActivityRecoveryTest.java:391: cannot find symbol
symbol : method assertTrue(boolean)
location: class org.apache.ode.bpel.runtime.ActivityRecoveryTest
assertTrue(failure.getDtFailure() != null);
^
/x1/jenkins/jenkins-slave/workspace/ODE-1.x/bpel-runtime/src/test/java/org/apache/ode/bpel/runtime/ActivityRecoveryTest.java:396: cannot find symbol
symbol : method assertTrue(boolean)
location: class org.apache.ode.bpel.runtime.ActivityRecoveryTest
assertTrue(actionSet.remove(action));
^
/x1/jenkins/jenkins-slave/workspace/ODE-1.x/bpel-runtime/src/test/java/org/apache/ode/bpel/runtime/ActivityRecoveryTest.java:405: cannot find symbol
symbol : method assertTrue(boolean)
location: class org.apache.ode.bpel.runtime.ActivityRecoveryTest
assertTrue(recoveries.size() == 1);
^
/x1/jenkins/jenkins-slave/workspace/ODE-1.x/bpel-runtime/src/test/java/org/apache/ode/bpel/runtime/ActivityRecoveryTest.java:407: cannot find symbol
symbol : method assertNotNull(org.apache.ode.bpel.pmapi.TActivityInfo)
location: class org.apache.ode.bpel.runtime.ActivityRecoveryTest
assertNotNull(activity);
^
/x1/jenkins/jenkins-slave/workspace/ODE-1.x/bpel-runtime/src/test/java/org/apache/ode/bpel/runtime/ActivityRecoveryTest.java:444: cannot find symbol
symbol : method assertNotNull(org.apache.ode.bpel.pmapi.TFailureInfo)
location: class org.apache.ode.bpel.runtime.ActivityRecoveryTest
assertNotNull(activity.getFailure());
^
/x1/jenkins/jenkins-slave/workspace/ODE-1.x/bpel-runtime/src/test/java/org/apache/ode/bpel/runtime/ActivityRecoveryTest.java:447: cannot find symbol
symbol : method assertNull(org.apache.ode.bpel.pmapi.TFailureInfo)
location: class org.apache.ode.bpel.runtime.ActivityRecoveryTest
assertNull(activity.getFailure());
^
Note: /x1/jenkins/jenkins-slave/workspace/ODE-1.x/bpel-runtime/src/test/java/org/apache/ode/bpel/elang/URIResolverTest.java uses or overrides a deprecated API.
Note: Recompile with -Xlint:deprecation for details.
Note: Some input files use unchecked or unsafe operations.
Note: Recompile with -Xlint:unchecked for details.
99 errors
Buildr aborted!
RuntimeError : Failed to compile, see errors above
(See full trace by running task with --trace)
Build step 'Execute shell' marked build as failure
[locks-and-latches] Releasing all the locks
[locks-and-latches] All the locks released
Recording fingerprints
Archiving artifacts
Recording test results
TestNG Reports Processing: START
Looking for TestNG results report in workspace using pattern: **/reports/testng/testng-results.xml
Did not find any matching files.