You are viewing a plain text version of this content. The canonical link for it is here.
Posted to issues@nifi.apache.org by "Joey Frazee (Jira)" <ji...@apache.org> on 2020/06/17 14:06:00 UTC
[jira] [Resolved] (NIFI-4760) TestListenSMTP tests fail on OSX
[ https://issues.apache.org/jira/browse/NIFI-4760?page=com.atlassian.jira.plugin.system.issuetabpanels:all-tabpanel ]
Joey Frazee resolved NIFI-4760.
-------------------------------
Resolution: Fixed
> TestListenSMTP tests fail on OSX
> --------------------------------
>
> Key: NIFI-4760
> URL: https://issues.apache.org/jira/browse/NIFI-4760
> Project: Apache NiFi
> Issue Type: Test
> Affects Versions: 1.5.0
> Reporter: Jeffrey T. Zemerick
> Assignee: Joey Frazee
> Priority: Minor
>
> When building 1.5.0 on OSX High Sierra with the following command:
> mvn clean install -Pcontrib-check
> (At first I thought it was because I was doing -T 1C but it fails without parallel, too.)
> Some tests in TestListenSMTP reliably fail:
> Results :
> Failed tests:
> TestListenSMTP.validateSuccessfulInteraction:88
> TestListenSMTP.validateSuccessfulInteractionWithTls:150
> TestListenSMTP.validateTooLargeMessage:192
> The relevant test output:
> validateSuccessfulInteraction(org.apache.nifi.processors.email.TestListenSMTP) Time elapsed: 15.069 sec <<< FAILURE!
> java.lang.AssertionError
> at org.apache.nifi.processors.email.TestListenSMTP.validateSuccessfulInteraction(TestListenSMTP.java:88)
> validateSuccessfulInteractionWithTls(org.apache.nifi.processors.email.TestListenSMTP) Time elapsed: 16.514 sec <<< FAILURE!
> java.lang.AssertionError
> at org.apache.nifi.processors.email.TestListenSMTP.validateSuccessfulInteractionWithTls(TestListenSMTP.java:150)
> validateTooLargeMessage(org.apache.nifi.processors.email.TestListenSMTP) Time elapsed: 21.516 sec <<< FAILURE!
> java.lang.AssertionError
> at org.apache.nifi.processors.email.TestListenSMTP.validateTooLargeMessage(TestListenSMTP.java:192)
--
This message was sent by Atlassian Jira
(v8.3.4#803005)