You are viewing a plain text version of this content. The canonical link for it is here.
Posted to dev@lucene.apache.org by bu...@flonkings.com on 2014/05/08 05:50:12 UTC

[JENKINS] Lucene-4x-Linux-Java7-64-test-only - Build # 20903 - Failure!

Build: builds.flonkings.com/job/Lucene-4x-Linux-Java7-64-test-only/20903/

1 tests failed.
REGRESSION:  org.apache.lucene.index.TestIndexWriterOutOfMemory.testBasics

Error Message:
this codec cannot write docvalues

Stack Trace:
java.lang.UnsupportedOperationException: this codec cannot write docvalues
	at __randomizedtesting.SeedInfo.seed([7EFC2D1C7BE5858:3A376CFDFF500628]:0)
	at org.apache.lucene.codecs.lucene3x.Lucene3xCodec$1.fieldsConsumer(Lucene3xCodec.java:73)
	at org.apache.lucene.index.DefaultIndexingChain.writeDocValues(DefaultIndexingChain.java:140)
	at org.apache.lucene.index.DefaultIndexingChain.flush(DefaultIndexingChain.java:98)
	at org.apache.lucene.index.DocumentsWriterPerThread.flush(DocumentsWriterPerThread.java:415)
	at org.apache.lucene.index.DocumentsWriter.doFlush(DocumentsWriter.java:512)
	at org.apache.lucene.index.DocumentsWriter.flushAllThreads(DocumentsWriter.java:622)
	at org.apache.lucene.index.IndexWriter.prepareCommitInternal(IndexWriter.java:2942)
	at org.apache.lucene.index.IndexWriter.commitInternal(IndexWriter.java:3101)
	at org.apache.lucene.index.IndexWriter.commit(IndexWriter.java:3068)
	at org.apache.lucene.index.TestIndexWriterOutOfMemory.testBasics(TestIndexWriterOutOfMemory.java:210)
	at sun.reflect.NativeMethodAccessorImpl.invoke0(Native Method)
	at sun.reflect.NativeMethodAccessorImpl.invoke(NativeMethodAccessorImpl.java:57)
	at sun.reflect.DelegatingMethodAccessorImpl.invoke(DelegatingMethodAccessorImpl.java:43)
	at java.lang.reflect.Method.invoke(Method.java:606)
	at com.carrotsearch.randomizedtesting.RandomizedRunner.invoke(RandomizedRunner.java:1618)
	at com.carrotsearch.randomizedtesting.RandomizedRunner$6.evaluate(RandomizedRunner.java:827)
	at com.carrotsearch.randomizedtesting.RandomizedRunner$7.evaluate(RandomizedRunner.java:863)
	at com.carrotsearch.randomizedtesting.RandomizedRunner$8.evaluate(RandomizedRunner.java:877)
	at org.apache.lucene.util.TestRuleSetupTeardownChained$1.evaluate(TestRuleSetupTeardownChained.java:50)
	at org.apache.lucene.util.TestRuleFieldCacheSanity$1.evaluate(TestRuleFieldCacheSanity.java:51)
	at org.apache.lucene.util.AbstractBeforeAfterRule$1.evaluate(AbstractBeforeAfterRule.java:46)
	at com.carrotsearch.randomizedtesting.rules.SystemPropertiesInvariantRule$1.evaluate(SystemPropertiesInvariantRule.java:55)
	at org.apache.lucene.util.TestRuleThreadAndTestName$1.evaluate(TestRuleThreadAndTestName.java:49)
	at org.apache.lucene.util.TestRuleIgnoreAfterMaxFailures$1.evaluate(TestRuleIgnoreAfterMaxFailures.java:65)
	at org.apache.lucene.util.TestRuleMarkFailure$1.evaluate(TestRuleMarkFailure.java:48)
	at com.carrotsearch.randomizedtesting.rules.StatementAdapter.evaluate(StatementAdapter.java:36)
	at com.carrotsearch.randomizedtesting.ThreadLeakControl$StatementRunner.run(ThreadLeakControl.java:360)
	at com.carrotsearch.randomizedtesting.ThreadLeakControl.forkTimeoutingTask(ThreadLeakControl.java:793)
	at com.carrotsearch.randomizedtesting.ThreadLeakControl$3.evaluate(ThreadLeakControl.java:453)
	at com.carrotsearch.randomizedtesting.RandomizedRunner.runSingleTest(RandomizedRunner.java:836)
	at com.carrotsearch.randomizedtesting.RandomizedRunner$3.evaluate(RandomizedRunner.java:738)
	at com.carrotsearch.randomizedtesting.RandomizedRunner$4.evaluate(RandomizedRunner.java:772)
	at com.carrotsearch.randomizedtesting.RandomizedRunner$5.evaluate(RandomizedRunner.java:783)
	at org.apache.lucene.util.AbstractBeforeAfterRule$1.evaluate(AbstractBeforeAfterRule.java:46)
	at org.apache.lucene.util.TestRuleStoreClassName$1.evaluate(TestRuleStoreClassName.java:42)
	at com.carrotsearch.randomizedtesting.rules.SystemPropertiesInvariantRule$1.evaluate(SystemPropertiesInvariantRule.java:55)
	at com.carrotsearch.randomizedtesting.rules.NoShadowingOrOverridesOnMethodsRule$1.evaluate(NoShadowingOrOverridesOnMethodsRule.java:39)
	at com.carrotsearch.randomizedtesting.rules.NoShadowingOrOverridesOnMethodsRule$1.evaluate(NoShadowingOrOverridesOnMethodsRule.java:39)
	at com.carrotsearch.randomizedtesting.rules.StatementAdapter.evaluate(StatementAdapter.java:36)
	at com.carrotsearch.randomizedtesting.rules.StatementAdapter.evaluate(StatementAdapter.java:36)
	at com.carrotsearch.randomizedtesting.rules.StatementAdapter.evaluate(StatementAdapter.java:36)
	at org.apache.lucene.util.TestRuleAssertionsRequired$1.evaluate(TestRuleAssertionsRequired.java:43)
	at org.apache.lucene.util.TestRuleMarkFailure$1.evaluate(TestRuleMarkFailure.java:48)
	at org.apache.lucene.util.TestRuleIgnoreAfterMaxFailures$1.evaluate(TestRuleIgnoreAfterMaxFailures.java:65)
	at org.apache.lucene.util.TestRuleIgnoreTestSuites$1.evaluate(TestRuleIgnoreTestSuites.java:55)
	at com.carrotsearch.randomizedtesting.rules.StatementAdapter.evaluate(StatementAdapter.java:36)
	at com.carrotsearch.randomizedtesting.ThreadLeakControl$StatementRunner.run(ThreadLeakControl.java:360)
	at java.lang.Thread.run(Thread.java:724)




Build Log:
[...truncated 793 lines...]
   [junit4] Suite: org.apache.lucene.index.TestIndexWriterOutOfMemory
   [junit4]   1> Unexpected exception: dumping fake-exception-log:...
   [junit4]   1> 
   [junit4]   2> NOTE: reproduce with: ant test  -Dtestcase=TestIndexWriterOutOfMemory -Dtests.method=testBasics -Dtests.seed=7EFC2D1C7BE5858 -Dtests.slow=true -Dtests.locale=zh_CN -Dtests.timezone=Brazil/East -Dtests.file.encoding=UTF-8
   [junit4] ERROR   0.46s J5 | TestIndexWriterOutOfMemory.testBasics <<<
   [junit4]    > Throwable #1: java.lang.UnsupportedOperationException: this codec cannot write docvalues
   [junit4]    > 	at __randomizedtesting.SeedInfo.seed([7EFC2D1C7BE5858:3A376CFDFF500628]:0)
   [junit4]    > 	at org.apache.lucene.codecs.lucene3x.Lucene3xCodec$1.fieldsConsumer(Lucene3xCodec.java:73)
   [junit4]    > 	at org.apache.lucene.index.DefaultIndexingChain.writeDocValues(DefaultIndexingChain.java:140)
   [junit4]    > 	at org.apache.lucene.index.DefaultIndexingChain.flush(DefaultIndexingChain.java:98)
   [junit4]    > 	at org.apache.lucene.index.DocumentsWriterPerThread.flush(DocumentsWriterPerThread.java:415)
   [junit4]    > 	at org.apache.lucene.index.DocumentsWriter.doFlush(DocumentsWriter.java:512)
   [junit4]    > 	at org.apache.lucene.index.DocumentsWriter.flushAllThreads(DocumentsWriter.java:622)
   [junit4]    > 	at org.apache.lucene.index.IndexWriter.prepareCommitInternal(IndexWriter.java:2942)
   [junit4]    > 	at org.apache.lucene.index.IndexWriter.commitInternal(IndexWriter.java:3101)
   [junit4]    > 	at org.apache.lucene.index.IndexWriter.commit(IndexWriter.java:3068)
   [junit4]    > 	at org.apache.lucene.index.TestIndexWriterOutOfMemory.testBasics(TestIndexWriterOutOfMemory.java:210)
   [junit4]    > 	at java.lang.Thread.run(Thread.java:724)
   [junit4]   2> NOTE: test params are: codec=Lucene3x, sim=RandomSimilarityProvider(queryNorm=true,coord=yes): {text_vectors=DFR I(n)1, text1=IB LL-L2, text_payloads=IB SPL-D2}, locale=zh_CN, timezone=Brazil/East
   [junit4]   2> NOTE: Linux 3.2.0-26-generic amd64/Oracle Corporation 1.7.0_25 (64-bit)/cpus=8,threads=1,free=131773376,total=252837888
   [junit4]   2> NOTE: All tests run in this JVM: [TestCharFilter, TestTransactionRollback, TestSpanExplanations, TestSpanMultiTermQueryWrapper, TestNot, TestElevationComparator, TestBytesStore, TestRateLimiter, TestFieldCacheRewriteMethod, TestCompressingTermVectorsFormat, TestStringHelper, TestCharsRef, TestBooleanMinShouldMatch, TestAddIndexes, TestBooleanQuery, TestTermdocPerf, TestQueryWrapperFilter, TestTermScorer, TestSnapshotDeletionPolicy, TestRecyclingByteBlockAllocator, TestPerSegmentDeletes, Test2BTerms, TestBooleanOr, TestIndexWriterOutOfMemory]
   [junit4] Completed on J5 in 0.62s, 1 test, 1 error <<< FAILURES!

[...truncated 728 lines...]
BUILD FAILED
/var/lib/jenkins/workspace/Lucene-4x-Linux-Java7-64-test-only/checkout/lucene/build.xml:49: The following error occurred while executing this line:
/var/lib/jenkins/workspace/Lucene-4x-Linux-Java7-64-test-only/checkout/lucene/common-build.xml:1297: The following error occurred while executing this line:
/var/lib/jenkins/workspace/Lucene-4x-Linux-Java7-64-test-only/checkout/lucene/common-build.xml:921: There were test failures: 404 suites, 3133 tests, 1 error, 96 ignored (86 assumptions)

Total time: 6 minutes 7 seconds
Build step 'Invoke Ant' marked build as failure
Recording test results
Email was triggered for: Failure
Sending email for trigger: Failure