You are viewing a plain text version of this content. The canonical link for it is here.
Posted to commits@servicemix.apache.org by Apache Jenkins Server <je...@builds.apache.org> on 2019/09/30 00:34:52 UTC
Build failed in Jenkins: ServiceMix-Bundles #3789
See <https://builds.apache.org/job/ServiceMix-Bundles/3789/display/redirect?page=changes>
Changes:
[jbonofre] [maven-release-plugin] prepare release
[jbonofre] [maven-release-plugin] prepare for next development iteration
[jbonofre] [maven-release-plugin] prepare release
[jbonofre] [maven-release-plugin] prepare for next development iteration
[jbonofre] [maven-release-plugin] prepare release
[jbonofre] [maven-release-plugin] prepare for next development iteration
[jbonofre] [maven-release-plugin] prepare release
[jbonofre] [maven-release-plugin] prepare for next development iteration
[jbonofre] [maven-release-plugin] prepare release
[jbonofre] [maven-release-plugin] prepare for next development iteration
[jbonofre] [maven-release-plugin] prepare release
[jbonofre] [maven-release-plugin] prepare for next development iteration
[jbonofre] [maven-release-plugin] prepare release
[jbonofre] [maven-release-plugin] prepare for next development iteration
[jbonofre] Remove already released bundles
[jbonofre] [maven-release-plugin] prepare release
[jbonofre] [maven-release-plugin] prepare for next development iteration
[jbonofre] [maven-release-plugin] prepare release
[jbonofre] [maven-release-plugin] prepare for next development iteration
[jbonofre] [maven-release-plugin] prepare release
[jbonofre] [maven-release-plugin] prepare for next development iteration
[jbonofre] [maven-release-plugin] prepare release
[jbonofre] [maven-release-plugin] prepare for next development iteration
[jbonofre] [maven-release-plugin] prepare release
[jbonofre] [maven-release-plugin] prepare for next development iteration
[jbonofre] [maven-release-plugin] prepare release
[jbonofre] [maven-release-plugin] prepare for next development iteration
[jbonofre] [maven-release-plugin] prepare release
[jbonofre] [maven-release-plugin] prepare for next development iteration
[jbonofre] [maven-release-plugin] prepare release
[jbonofre] [maven-release-plugin] prepare for next development iteration
[jbonofre] [maven-release-plugin] prepare release
[jbonofre] [maven-release-plugin] prepare for next development iteration
[jbonofre] [maven-release-plugin] prepare release
[jbonofre] [maven-release-plugin] prepare for next development iteration
[jbonofre] [maven-release-plugin] prepare release
[jbonofre] [maven-release-plugin] prepare for next development iteration
[jbonofre] [maven-release-plugin] prepare release
[jbonofre] [maven-release-plugin] prepare for next development iteration
[jbonofre] [maven-release-plugin] prepare release
[jbonofre] [maven-release-plugin] prepare for next development iteration
------------------------------------------
Started by an SCM change
Running as SYSTEM
[EnvInject] - Loading node environment variables.
Building remotely on H42 (ubuntu xenial) in workspace <https://builds.apache.org/job/ServiceMix-Bundles/ws/>
No credentials specified
> git rev-parse --is-inside-work-tree # timeout=10
Fetching changes from the remote Git repository
> git config remote.origin.url https://git-wip-us.apache.org/repos/asf/servicemix-bundles.git # timeout=10
Fetching upstream changes from https://git-wip-us.apache.org/repos/asf/servicemix-bundles.git
> git --version # timeout=10
> git fetch --tags --progress https://git-wip-us.apache.org/repos/asf/servicemix-bundles.git +refs/heads/*:refs/remotes/origin/*
> git rev-parse refs/remotes/origin/master^{commit} # timeout=10
> git rev-parse refs/remotes/origin/origin/master^{commit} # timeout=10
Checking out Revision 64fd2c2ca96a0067cca06fe607289cffc8344fe7 (refs/remotes/origin/master)
> git config core.sparsecheckout # timeout=10
> git checkout -f 64fd2c2ca96a0067cca06fe607289cffc8344fe7
Commit message: "[maven-release-plugin] prepare for next development iteration"
> git rev-list --no-walk e2c3312f7283ef7a0b5da1a69c8e5d5ee734fca8 # timeout=10
Parsing POMs
ERROR: Failed to parse POMs
hudson.remoting.ProxyException: hudson.maven.MavenModuleSetBuild$MavenExecutionException: org.apache.maven.project.ProjectBuildingException: Some problems were encountered while processing the POMs:
[ERROR] Child module <https://builds.apache.org/job/ServiceMix-Bundles/ws/elasticsearch-client-6.1.1> of <https://builds.apache.org/job/ServiceMix-Bundles/ws/pom.xml> does not exist @
[ERROR] Child module <https://builds.apache.org/job/ServiceMix-Bundles/ws/elasticsearch-6.1.1> of <https://builds.apache.org/job/ServiceMix-Bundles/ws/pom.xml> does not exist @
at hudson.maven.MavenModuleSetBuild$PomParser.invoke(MavenModuleSetBuild.java:1390)
at hudson.maven.MavenModuleSetBuild$PomParser.invoke(MavenModuleSetBuild.java:1126)
at hudson.FilePath$FileCallableWrapper.call(FilePath.java:3052)
at hudson.remoting.UserRequest.perform(UserRequest.java:212)
at hudson.remoting.UserRequest.perform(UserRequest.java:54)
at hudson.remoting.Request$2.run(Request.java:369)
at hudson.remoting.InterceptingExecutorService$1.call(InterceptingExecutorService.java:72)
at java.util.concurrent.FutureTask.run(FutureTask.java:266)
at java.util.concurrent.ThreadPoolExecutor.runWorker(ThreadPoolExecutor.java:1142)
at java.util.concurrent.ThreadPoolExecutor$Worker.run(ThreadPoolExecutor.java:617)
at java.lang.Thread.run(Thread.java:748)
Suppressed: hudson.remoting.Channel$CallSiteStackTrace: Remote call to H42
at hudson.remoting.Channel.attachCallSiteStackTrace(Channel.java:1743)
at hudson.remoting.UserRequest$ExceptionResponse.retrieve(UserRequest.java:357)
at hudson.remoting.Channel.call(Channel.java:957)
at hudson.FilePath.act(FilePath.java:1072)
at hudson.FilePath.act(FilePath.java:1061)
at hudson.maven.MavenModuleSetBuild$MavenModuleSetBuildExecution.parsePoms(MavenModuleSetBuild.java:987)
at hudson.maven.MavenModuleSetBuild$MavenModuleSetBuildExecution.doRun(MavenModuleSetBuild.java:691)
at hudson.model.AbstractBuild$AbstractBuildExecution.run(AbstractBuild.java:504)
at hudson.model.Run.execute(Run.java:1815)
at hudson.maven.MavenModuleSetBuild.run(MavenModuleSetBuild.java:543)
at hudson.model.ResourceController.execute(ResourceController.java:97)
at hudson.model.Executor.run(Executor.java:429)
Caused by: hudson.remoting.ProxyException: org.apache.maven.project.ProjectBuildingException: Some problems were encountered while processing the POMs:
[ERROR] Child module <https://builds.apache.org/job/ServiceMix-Bundles/ws/elasticsearch-client-6.1.1> of <https://builds.apache.org/job/ServiceMix-Bundles/ws/pom.xml> does not exist @
[ERROR] Child module <https://builds.apache.org/job/ServiceMix-Bundles/ws/elasticsearch-6.1.1> of <https://builds.apache.org/job/ServiceMix-Bundles/ws/pom.xml> does not exist @
at org.apache.maven.project.DefaultProjectBuilder.build(DefaultProjectBuilder.java:383)
at hudson.maven.MavenEmbedder.buildProjects(MavenEmbedder.java:370)
at hudson.maven.MavenEmbedder.readProjects(MavenEmbedder.java:340)
at hudson.maven.MavenModuleSetBuild$PomParser.invoke(MavenModuleSetBuild.java:1329)
... 10 more
Build failed in Jenkins: ServiceMix-Bundles #3792
Posted by Apache Jenkins Server <je...@builds.apache.org>.
See <https://builds.apache.org/job/ServiceMix-Bundles/3792/display/redirect?page=changes>
Changes:
[ancosen] Started a new release cycle
[ancosen] [SM-4200] Create OSGi bundle for Fastjson 1.2.62
------------------------------------------
Started by an SCM change
Running as SYSTEM
[EnvInject] - Loading node environment variables.
Building remotely on H42 (ubuntu xenial) in workspace <https://builds.apache.org/job/ServiceMix-Bundles/ws/>
No credentials specified
> git rev-parse --is-inside-work-tree # timeout=10
Fetching changes from the remote Git repository
> git config remote.origin.url https://git-wip-us.apache.org/repos/asf/servicemix-bundles.git # timeout=10
Fetching upstream changes from https://git-wip-us.apache.org/repos/asf/servicemix-bundles.git
> git --version # timeout=10
> git fetch --tags --progress https://git-wip-us.apache.org/repos/asf/servicemix-bundles.git +refs/heads/*:refs/remotes/origin/*
> git rev-parse refs/remotes/origin/master^{commit} # timeout=10
> git rev-parse refs/remotes/origin/origin/master^{commit} # timeout=10
Checking out Revision 9357c491eb2605bb6a379f65a77002a376cf32a9 (refs/remotes/origin/master)
> git config core.sparsecheckout # timeout=10
> git checkout -f 9357c491eb2605bb6a379f65a77002a376cf32a9
Commit message: "[SM-4200] Create OSGi bundle for Fastjson 1.2.62"
> git rev-list --no-walk f1c4b60d8655ab0bee157a54c0f05e26fc25efc6 # timeout=10
Parsing POMs
Downloaded artifact https://repo.maven.apache.org/maven2/org/apache/servicemix/servicemix-pom/5/servicemix-pom-5.pom
Downloaded artifact https://repo.maven.apache.org/maven2/org/apache/apache/7/apache-7.pom
Downloaded artifact https://repo.maven.apache.org/maven2/org/apache/servicemix/bundles/bundles-pom/14/bundles-pom-14.pom
Modules changed, recalculating dependency graph
Established TCP socket on 37883
maven3-agent.jar already up to date
maven3-interceptor.jar already up to date
maven3-interceptor-commons.jar already up to date
[ServiceMix-Bundles] $ /home/jenkins/tools/java/latest1.7/bin/java -da -dsa -XX:MaxPermSize=192m -Xmx512M -cp /home/jenkins/jenkins-slave/maven3-agent.jar:/home/jenkins/tools/maven/apache-maven-3.0.4/boot/plexus-classworlds-2.4.jar org.jvnet.hudson.maven3.agent.Maven3Main /home/jenkins/tools/maven/apache-maven-3.0.4 /home/jenkins/jenkins-slave/remoting.jar /home/jenkins/jenkins-slave/maven3-interceptor.jar /home/jenkins/jenkins-slave/maven3-interceptor-commons.jar 37883
Exception in thread "main" java.lang.UnsupportedClassVersionError: org/jvnet/hudson/maven3/agent/Maven3Main : Unsupported major.minor version 52.0
at java.lang.ClassLoader.defineClass1(Native Method)
at java.lang.ClassLoader.defineClass(ClassLoader.java:800)
at java.security.SecureClassLoader.defineClass(SecureClassLoader.java:142)
at java.net.URLClassLoader.defineClass(URLClassLoader.java:449)
at java.net.URLClassLoader.access$100(URLClassLoader.java:71)
at java.net.URLClassLoader$1.run(URLClassLoader.java:361)
at java.net.URLClassLoader$1.run(URLClassLoader.java:355)
at java.security.AccessController.doPrivileged(Native Method)
at java.net.URLClassLoader.findClass(URLClassLoader.java:354)
at java.lang.ClassLoader.loadClass(ClassLoader.java:425)
at sun.misc.Launcher$AppClassLoader.loadClass(Launcher.java:308)
at java.lang.ClassLoader.loadClass(ClassLoader.java:358)
at sun.launcher.LauncherHelper.checkAndLoadMain(LauncherHelper.java:482)
ERROR: Failed to launch Maven. Exit code = 1
Build failed in Jenkins: ServiceMix-Bundles #3791
Posted by Apache Jenkins Server <je...@builds.apache.org>.
See <https://builds.apache.org/job/ServiceMix-Bundles/3791/display/redirect?page=changes>
Changes:
[jbonofre] [maven-release-plugin] prepare release
[jbonofre] [maven-release-plugin] prepare for next development iteration
[jbonofre] [maven-release-plugin] prepare release
[jbonofre] [maven-release-plugin] prepare for next development iteration
[jbonofre] [maven-release-plugin] prepare release
[jbonofre] [maven-release-plugin] prepare for next development iteration
[jbonofre] [maven-release-plugin] prepare release
[jbonofre] [maven-release-plugin] prepare for next development iteration
------------------------------------------
Started by an SCM change
Running as SYSTEM
[EnvInject] - Loading node environment variables.
Building remotely on H31 (ubuntu xenial) in workspace <https://builds.apache.org/job/ServiceMix-Bundles/ws/>
No credentials specified
Cloning the remote Git repository
Cloning repository https://git-wip-us.apache.org/repos/asf/servicemix-bundles.git
> git init <https://builds.apache.org/job/ServiceMix-Bundles/ws/> # timeout=10
Fetching upstream changes from https://git-wip-us.apache.org/repos/asf/servicemix-bundles.git
> git --version # timeout=10
> git fetch --tags --progress -- https://git-wip-us.apache.org/repos/asf/servicemix-bundles.git +refs/heads/*:refs/remotes/origin/*
> git config remote.origin.url https://git-wip-us.apache.org/repos/asf/servicemix-bundles.git # timeout=10
> git config --add remote.origin.fetch +refs/heads/*:refs/remotes/origin/* # timeout=10
> git config remote.origin.url https://git-wip-us.apache.org/repos/asf/servicemix-bundles.git # timeout=10
Fetching upstream changes from https://git-wip-us.apache.org/repos/asf/servicemix-bundles.git
> git fetch --tags --progress -- https://git-wip-us.apache.org/repos/asf/servicemix-bundles.git +refs/heads/*:refs/remotes/origin/*
> git rev-parse refs/remotes/origin/master^{commit} # timeout=10
> git rev-parse refs/remotes/origin/origin/master^{commit} # timeout=10
Checking out Revision f1c4b60d8655ab0bee157a54c0f05e26fc25efc6 (refs/remotes/origin/master)
> git config core.sparsecheckout # timeout=10
> git checkout -f f1c4b60d8655ab0bee157a54c0f05e26fc25efc6
Commit message: "[maven-release-plugin] prepare for next development iteration"
> git rev-list --no-walk d509defb0cadae4167433837fae8a1cc1f07a86f # timeout=10
ERROR: Maven Home /home/jenkins/tools/maven/apache-maven-3.0.4 doesnt exist
Build failed in Jenkins: ServiceMix-Bundles #3790
Posted by Apache Jenkins Server <je...@builds.apache.org>.
See <https://builds.apache.org/job/ServiceMix-Bundles/3790/display/redirect?page=changes>
Changes:
[jbonofre] [maven-release-plugin] prepare release
[jbonofre] [maven-release-plugin] prepare for next development iteration
[jbonofre] Revert "Remove already released bundles"
[jbonofre] [maven-release-plugin] prepare release
[jbonofre] [maven-release-plugin] prepare for next development iteration
[jbonofre] [maven-release-plugin] prepare release
[jbonofre] [maven-release-plugin] prepare for next development iteration
[jbonofre] [SM-4185] Create OSGi bundle for elasticsearch-client 7.3.2
[jbonofre] [maven-release-plugin] prepare release
[jbonofre] [maven-release-plugin] prepare for next development iteration
[jbonofre] [maven-release-plugin] prepare release
[jbonofre] [maven-release-plugin] prepare for next development iteration
------------------------------------------
Started by an SCM change
Running as SYSTEM
[EnvInject] - Loading node environment variables.
Building remotely on H42 (ubuntu xenial) in workspace <https://builds.apache.org/job/ServiceMix-Bundles/ws/>
No credentials specified
> git rev-parse --is-inside-work-tree # timeout=10
Fetching changes from the remote Git repository
> git config remote.origin.url https://git-wip-us.apache.org/repos/asf/servicemix-bundles.git # timeout=10
Fetching upstream changes from https://git-wip-us.apache.org/repos/asf/servicemix-bundles.git
> git --version # timeout=10
> git fetch --tags --progress https://git-wip-us.apache.org/repos/asf/servicemix-bundles.git +refs/heads/*:refs/remotes/origin/*
> git rev-parse refs/remotes/origin/master^{commit} # timeout=10
> git rev-parse refs/remotes/origin/origin/master^{commit} # timeout=10
Checking out Revision d509defb0cadae4167433837fae8a1cc1f07a86f (refs/remotes/origin/master)
> git config core.sparsecheckout # timeout=10
> git checkout -f d509defb0cadae4167433837fae8a1cc1f07a86f
Commit message: "[maven-release-plugin] prepare for next development iteration"
> git rev-list --no-walk 64fd2c2ca96a0067cca06fe607289cffc8344fe7 # timeout=10
Parsing POMs
Modules changed, recalculating dependency graph
Established TCP socket on 35950
Copied maven3-agent.jar
Copied maven3-interceptor.jar
maven3-interceptor-commons.jar already up to date
[ServiceMix-Bundles] $ /home/jenkins/tools/java/latest1.7/bin/java -da -dsa -XX:MaxPermSize=192m -Xmx512M -cp /home/jenkins/jenkins-slave/maven3-agent.jar:/home/jenkins/tools/maven/apache-maven-3.0.4/boot/plexus-classworlds-2.4.jar org.jvnet.hudson.maven3.agent.Maven3Main /home/jenkins/tools/maven/apache-maven-3.0.4 /home/jenkins/jenkins-slave/remoting.jar /home/jenkins/jenkins-slave/maven3-interceptor.jar /home/jenkins/jenkins-slave/maven3-interceptor-commons.jar 35950
Exception in thread "main" java.lang.UnsupportedClassVersionError: org/jvnet/hudson/maven3/agent/Maven3Main : Unsupported major.minor version 52.0
at java.lang.ClassLoader.defineClass1(Native Method)
at java.lang.ClassLoader.defineClass(ClassLoader.java:800)
at java.security.SecureClassLoader.defineClass(SecureClassLoader.java:142)
at java.net.URLClassLoader.defineClass(URLClassLoader.java:449)
at java.net.URLClassLoader.access$100(URLClassLoader.java:71)
at java.net.URLClassLoader$1.run(URLClassLoader.java:361)
at java.net.URLClassLoader$1.run(URLClassLoader.java:355)
at java.security.AccessController.doPrivileged(Native Method)
at java.net.URLClassLoader.findClass(URLClassLoader.java:354)
at java.lang.ClassLoader.loadClass(ClassLoader.java:425)
at sun.misc.Launcher$AppClassLoader.loadClass(Launcher.java:308)
at java.lang.ClassLoader.loadClass(ClassLoader.java:358)
at sun.launcher.LauncherHelper.checkAndLoadMain(LauncherHelper.java:482)
ERROR: Failed to launch Maven. Exit code = 1