You are viewing a plain text version of this content. The canonical link for it is here.
Posted to dev@flink.apache.org by "Matthias (Jira)" <ji...@apache.org> on 2020/11/16 22:10:00 UTC

[jira] [Created] (FLINK-20176) CompactionITCaseBase.testNonPartition failed with Timeout

Matthias created FLINK-20176:
--------------------------------

             Summary: CompactionITCaseBase.testNonPartition failed with Timeout
                 Key: FLINK-20176
                 URL: https://issues.apache.org/jira/browse/FLINK-20176
             Project: Flink
          Issue Type: Test
          Components: Formats (JSON, Avro, Parquet, ORC, SequenceFile)
    Affects Versions: 1.11.2
            Reporter: Matthias


The test {{CompactionITCaseBase.testNonPartition}} failed with {{TestTimeOut}} [in this build|https://dev.azure.com/mapohl/flink/_build/results?buildId=108&view=logs&j=dafbab6d-4616-5d7b-ee37-3c54e4828fd7&t=777327ab-6d4e-582e-3e76-4a9391c57e59&s=ab6e269b-88b2-5ded-2544-4aa5b1124530].


{quote}
[ERROR] Tests run: 2, Failures: 0, Errors: 1, Skipped: 0, Time elapsed: 105.375 s <<< FAILURE! - in org.apache.flink.formats.json.JsonFileCompactionITCase
[ERROR] testNonPartition(org.apache.flink.formats.json.JsonFileCompactionITCase)  Time elapsed: 90.015 s  <<< ERROR!
org.junit.runners.model.TestTimedOutException: test timed out after 90 seconds
	at sun.misc.Unsafe.park(Native Method)
	at java.util.concurrent.locks.LockSupport.park(LockSupport.java:175)
	at java.util.concurrent.CompletableFuture$Signaller.block(CompletableFuture.java:1707)
	at java.util.concurrent.ForkJoinPool.managedBlock(ForkJoinPool.java:3323)
	at java.util.concurrent.CompletableFuture.waitingGet(CompletableFuture.java:1742)
	at java.util.concurrent.CompletableFuture.get(CompletableFuture.java:1908)
	at org.apache.flink.table.api.internal.TableResultImpl.awaitInternal(TableResultImpl.java:119)
	at org.apache.flink.table.api.internal.TableResultImpl.await(TableResultImpl.java:86)
	at org.apache.flink.table.planner.runtime.stream.sql.CompactionITCaseBase.testNonPartition(CompactionITCaseBase.java:95)
	at sun.reflect.NativeMethodAccessorImpl.invoke0(Native Method)
	at sun.reflect.NativeMethodAccessorImpl.invoke(NativeMethodAccessorImpl.java:62)
	at sun.reflect.DelegatingMethodAccessorImpl.invoke(DelegatingMethodAccessorImpl.java:43)
	at java.lang.reflect.Method.invoke(Method.java:498)
	at org.junit.runners.model.FrameworkMethod$1.runReflectiveCall(FrameworkMethod.java:50)
	at org.junit.internal.runners.model.ReflectiveCallable.run(ReflectiveCallable.java:12)
	at org.junit.runners.model.FrameworkMethod.invokeExplosively(FrameworkMethod.java:47)
	at org.junit.internal.runners.statements.InvokeMethod.evaluate(InvokeMethod.java:17)
	at org.junit.internal.runners.statements.RunBefores.evaluate(RunBefores.java:26)
	at org.junit.internal.runners.statements.RunAfters.evaluate(RunAfters.java:27)
	at org.junit.rules.ExpectedException$ExpectedExceptionStatement.evaluate(ExpectedException.java:239)
	at org.junit.rules.ExternalResource$1.evaluate(ExternalResource.java:48)
	at org.junit.internal.runners.statements.FailOnTimeout$CallableStatement.call(FailOnTimeout.java:298)
	at org.junit.internal.runners.statements.FailOnTimeout$CallableStatement.call(FailOnTimeout.java:292)
	at java.util.concurrent.FutureTask.run(FutureTask.java:266)
	at java.lang.Thread.run(Thread.java:748)
{quote}




--
This message was sent by Atlassian Jira
(v8.3.4#803005)