You are viewing a plain text version of this content. The canonical link for it is here.
Posted to dev@lucene.apache.org by Policeman Jenkins Server <je...@thetaphi.de> on 2017/02/13 21:54:17 UTC
[JENKINS] Lucene-Solr-master-Windows (32bit/jdk1.8.0_121) - Build #
6393 - Still unstable!
Build: https://jenkins.thetaphi.de/job/Lucene-Solr-master-Windows/6393/
Java: 32bit/jdk1.8.0_121 -client -XX:+UseParallelGC
2 tests failed.
FAILED: junit.framework.TestSuite.org.apache.solr.cloud.TestCloudRecovery
Error Message:
Could not remove the following files (in the order of attempts): C:\Users\jenkins\workspace\Lucene-Solr-master-Windows\solr\build\solr-core\test\J0\temp\solr.cloud.TestCloudRecovery_D27AB8772F76557A-001\tempDir-001\node2\collection1_shard2_replica2\data\tlog\tlog.0000000000000000004: java.nio.file.FileSystemException: C:\Users\jenkins\workspace\Lucene-Solr-master-Windows\solr\build\solr-core\test\J0\temp\solr.cloud.TestCloudRecovery_D27AB8772F76557A-001\tempDir-001\node2\collection1_shard2_replica2\data\tlog\tlog.0000000000000000004: The process cannot access the file because it is being used by another process. C:\Users\jenkins\workspace\Lucene-Solr-master-Windows\solr\build\solr-core\test\J0\temp\solr.cloud.TestCloudRecovery_D27AB8772F76557A-001\tempDir-001\node2\collection1_shard2_replica2\data\tlog: java.nio.file.DirectoryNotEmptyException: C:\Users\jenkins\workspace\Lucene-Solr-master-Windows\solr\build\solr-core\test\J0\temp\solr.cloud.TestCloudRecovery_D27AB8772F76557A-001\tempDir-001\node2\collection1_shard2_replica2\data\tlog C:\Users\jenkins\workspace\Lucene-Solr-master-Windows\solr\build\solr-core\test\J0\temp\solr.cloud.TestCloudRecovery_D27AB8772F76557A-001\tempDir-001\node2\collection1_shard2_replica2\data: java.nio.file.DirectoryNotEmptyException: C:\Users\jenkins\workspace\Lucene-Solr-master-Windows\solr\build\solr-core\test\J0\temp\solr.cloud.TestCloudRecovery_D27AB8772F76557A-001\tempDir-001\node2\collection1_shard2_replica2\data C:\Users\jenkins\workspace\Lucene-Solr-master-Windows\solr\build\solr-core\test\J0\temp\solr.cloud.TestCloudRecovery_D27AB8772F76557A-001\tempDir-001\node2\collection1_shard2_replica2: java.nio.file.DirectoryNotEmptyException: C:\Users\jenkins\workspace\Lucene-Solr-master-Windows\solr\build\solr-core\test\J0\temp\solr.cloud.TestCloudRecovery_D27AB8772F76557A-001\tempDir-001\node2\collection1_shard2_replica2 C:\Users\jenkins\workspace\Lucene-Solr-master-Windows\solr\build\solr-core\test\J0\temp\solr.cloud.TestCloudRecovery_D27AB8772F76557A-001\tempDir-001\node2\collection1_shard1_replica2\data\tlog\tlog.0000000000000000004: java.nio.file.FileSystemException: C:\Users\jenkins\workspace\Lucene-Solr-master-Windows\solr\build\solr-core\test\J0\temp\solr.cloud.TestCloudRecovery_D27AB8772F76557A-001\tempDir-001\node2\collection1_shard1_replica2\data\tlog\tlog.0000000000000000004: The process cannot access the file because it is being used by another process. C:\Users\jenkins\workspace\Lucene-Solr-master-Windows\solr\build\solr-core\test\J0\temp\solr.cloud.TestCloudRecovery_D27AB8772F76557A-001\tempDir-001\node2\collection1_shard1_replica2\data\tlog: java.nio.file.DirectoryNotEmptyException: C:\Users\jenkins\workspace\Lucene-Solr-master-Windows\solr\build\solr-core\test\J0\temp\solr.cloud.TestCloudRecovery_D27AB8772F76557A-001\tempDir-001\node2\collection1_shard1_replica2\data\tlog C:\Users\jenkins\workspace\Lucene-Solr-master-Windows\solr\build\solr-core\test\J0\temp\solr.cloud.TestCloudRecovery_D27AB8772F76557A-001\tempDir-001\node2\collection1_shard1_replica2\data: java.nio.file.DirectoryNotEmptyException: C:\Users\jenkins\workspace\Lucene-Solr-master-Windows\solr\build\solr-core\test\J0\temp\solr.cloud.TestCloudRecovery_D27AB8772F76557A-001\tempDir-001\node2\collection1_shard1_replica2\data C:\Users\jenkins\workspace\Lucene-Solr-master-Windows\solr\build\solr-core\test\J0\temp\solr.cloud.TestCloudRecovery_D27AB8772F76557A-001\tempDir-001\node2\collection1_shard1_replica2: java.nio.file.DirectoryNotEmptyException: C:\Users\jenkins\workspace\Lucene-Solr-master-Windows\solr\build\solr-core\test\J0\temp\solr.cloud.TestCloudRecovery_D27AB8772F76557A-001\tempDir-001\node2\collection1_shard1_replica2 C:\Users\jenkins\workspace\Lucene-Solr-master-Windows\solr\build\solr-core\test\J0\temp\solr.cloud.TestCloudRecovery_D27AB8772F76557A-001\tempDir-001\node2: java.nio.file.DirectoryNotEmptyException: C:\Users\jenkins\workspace\Lucene-Solr-master-Windows\solr\build\solr-core\test\J0\temp\solr.cloud.TestCloudRecovery_D27AB8772F76557A-001\tempDir-001\node2 C:\Users\jenkins\workspace\Lucene-Solr-master-Windows\solr\build\solr-core\test\J0\temp\solr.cloud.TestCloudRecovery_D27AB8772F76557A-001\tempDir-001\node1\collection1_shard2_replica1\data\tlog\tlog.0000000000000000004: java.nio.file.FileSystemException: C:\Users\jenkins\workspace\Lucene-Solr-master-Windows\solr\build\solr-core\test\J0\temp\solr.cloud.TestCloudRecovery_D27AB8772F76557A-001\tempDir-001\node1\collection1_shard2_replica1\data\tlog\tlog.0000000000000000004: The process cannot access the file because it is being used by another process. C:\Users\jenkins\workspace\Lucene-Solr-master-Windows\solr\build\solr-core\test\J0\temp\solr.cloud.TestCloudRecovery_D27AB8772F76557A-001\tempDir-001\node1\collection1_shard2_replica1\data\tlog: java.nio.file.DirectoryNotEmptyException: C:\Users\jenkins\workspace\Lucene-Solr-master-Windows\solr\build\solr-core\test\J0\temp\solr.cloud.TestCloudRecovery_D27AB8772F76557A-001\tempDir-001\node1\collection1_shard2_replica1\data\tlog C:\Users\jenkins\workspace\Lucene-Solr-master-Windows\solr\build\solr-core\test\J0\temp\solr.cloud.TestCloudRecovery_D27AB8772F76557A-001\tempDir-001\node1\collection1_shard2_replica1\data: java.nio.file.DirectoryNotEmptyException: C:\Users\jenkins\workspace\Lucene-Solr-master-Windows\solr\build\solr-core\test\J0\temp\solr.cloud.TestCloudRecovery_D27AB8772F76557A-001\tempDir-001\node1\collection1_shard2_replica1\data C:\Users\jenkins\workspace\Lucene-Solr-master-Windows\solr\build\solr-core\test\J0\temp\solr.cloud.TestCloudRecovery_D27AB8772F76557A-001\tempDir-001\node1\collection1_shard2_replica1: java.nio.file.DirectoryNotEmptyException: C:\Users\jenkins\workspace\Lucene-Solr-master-Windows\solr\build\solr-core\test\J0\temp\solr.cloud.TestCloudRecovery_D27AB8772F76557A-001\tempDir-001\node1\collection1_shard2_replica1 C:\Users\jenkins\workspace\Lucene-Solr-master-Windows\solr\build\solr-core\test\J0\temp\solr.cloud.TestCloudRecovery_D27AB8772F76557A-001\tempDir-001\node1\collection1_shard1_replica1\data\tlog\tlog.0000000000000000004: java.nio.file.FileSystemException: C:\Users\jenkins\workspace\Lucene-Solr-master-Windows\solr\build\solr-core\test\J0\temp\solr.cloud.TestCloudRecovery_D27AB8772F76557A-001\tempDir-001\node1\collection1_shard1_replica1\data\tlog\tlog.0000000000000000004: The process cannot access the file because it is being used by another process. C:\Users\jenkins\workspace\Lucene-Solr-master-Windows\solr\build\solr-core\test\J0\temp\solr.cloud.TestCloudRecovery_D27AB8772F76557A-001\tempDir-001\node1\collection1_shard1_replica1\data\tlog: java.nio.file.DirectoryNotEmptyException: C:\Users\jenkins\workspace\Lucene-Solr-master-Windows\solr\build\solr-core\test\J0\temp\solr.cloud.TestCloudRecovery_D27AB8772F76557A-001\tempDir-001\node1\collection1_shard1_replica1\data\tlog C:\Users\jenkins\workspace\Lucene-Solr-master-Windows\solr\build\solr-core\test\J0\temp\solr.cloud.TestCloudRecovery_D27AB8772F76557A-001\tempDir-001\node1\collection1_shard1_replica1\data: java.nio.file.DirectoryNotEmptyException: C:\Users\jenkins\workspace\Lucene-Solr-master-Windows\solr\build\solr-core\test\J0\temp\solr.cloud.TestCloudRecovery_D27AB8772F76557A-001\tempDir-001\node1\collection1_shard1_replica1\data C:\Users\jenkins\workspace\Lucene-Solr-master-Windows\solr\build\solr-core\test\J0\temp\solr.cloud.TestCloudRecovery_D27AB8772F76557A-001\tempDir-001\node1\collection1_shard1_replica1: java.nio.file.DirectoryNotEmptyException: C:\Users\jenkins\workspace\Lucene-Solr-master-Windows\solr\build\solr-core\test\J0\temp\solr.cloud.TestCloudRecovery_D27AB8772F76557A-001\tempDir-001\node1\collection1_shard1_replica1 C:\Users\jenkins\workspace\Lucene-Solr-master-Windows\solr\build\solr-core\test\J0\temp\solr.cloud.TestCloudRecovery_D27AB8772F76557A-001\tempDir-001\node1: java.nio.file.DirectoryNotEmptyException: C:\Users\jenkins\workspace\Lucene-Solr-master-Windows\solr\build\solr-core\test\J0\temp\solr.cloud.TestCloudRecovery_D27AB8772F76557A-001\tempDir-001\node1 C:\Users\jenkins\workspace\Lucene-Solr-master-Windows\solr\build\solr-core\test\J0\temp\solr.cloud.TestCloudRecovery_D27AB8772F76557A-001\tempDir-001: java.nio.file.DirectoryNotEmptyException: C:\Users\jenkins\workspace\Lucene-Solr-master-Windows\solr\build\solr-core\test\J0\temp\solr.cloud.TestCloudRecovery_D27AB8772F76557A-001\tempDir-001 C:\Users\jenkins\workspace\Lucene-Solr-master-Windows\solr\build\solr-core\test\J0\temp\solr.cloud.TestCloudRecovery_D27AB8772F76557A-001: java.nio.file.DirectoryNotEmptyException: C:\Users\jenkins\workspace\Lucene-Solr-master-Windows\solr\build\solr-core\test\J0\temp\solr.cloud.TestCloudRecovery_D27AB8772F76557A-001
Stack Trace:
java.io.IOException: Could not remove the following files (in the order of attempts):
C:\Users\jenkins\workspace\Lucene-Solr-master-Windows\solr\build\solr-core\test\J0\temp\solr.cloud.TestCloudRecovery_D27AB8772F76557A-001\tempDir-001\node2\collection1_shard2_replica2\data\tlog\tlog.0000000000000000004: java.nio.file.FileSystemException: C:\Users\jenkins\workspace\Lucene-Solr-master-Windows\solr\build\solr-core\test\J0\temp\solr.cloud.TestCloudRecovery_D27AB8772F76557A-001\tempDir-001\node2\collection1_shard2_replica2\data\tlog\tlog.0000000000000000004: The process cannot access the file because it is being used by another process.
C:\Users\jenkins\workspace\Lucene-Solr-master-Windows\solr\build\solr-core\test\J0\temp\solr.cloud.TestCloudRecovery_D27AB8772F76557A-001\tempDir-001\node2\collection1_shard2_replica2\data\tlog: java.nio.file.DirectoryNotEmptyException: C:\Users\jenkins\workspace\Lucene-Solr-master-Windows\solr\build\solr-core\test\J0\temp\solr.cloud.TestCloudRecovery_D27AB8772F76557A-001\tempDir-001\node2\collection1_shard2_replica2\data\tlog
C:\Users\jenkins\workspace\Lucene-Solr-master-Windows\solr\build\solr-core\test\J0\temp\solr.cloud.TestCloudRecovery_D27AB8772F76557A-001\tempDir-001\node2\collection1_shard2_replica2\data: java.nio.file.DirectoryNotEmptyException: C:\Users\jenkins\workspace\Lucene-Solr-master-Windows\solr\build\solr-core\test\J0\temp\solr.cloud.TestCloudRecovery_D27AB8772F76557A-001\tempDir-001\node2\collection1_shard2_replica2\data
C:\Users\jenkins\workspace\Lucene-Solr-master-Windows\solr\build\solr-core\test\J0\temp\solr.cloud.TestCloudRecovery_D27AB8772F76557A-001\tempDir-001\node2\collection1_shard2_replica2: java.nio.file.DirectoryNotEmptyException: C:\Users\jenkins\workspace\Lucene-Solr-master-Windows\solr\build\solr-core\test\J0\temp\solr.cloud.TestCloudRecovery_D27AB8772F76557A-001\tempDir-001\node2\collection1_shard2_replica2
C:\Users\jenkins\workspace\Lucene-Solr-master-Windows\solr\build\solr-core\test\J0\temp\solr.cloud.TestCloudRecovery_D27AB8772F76557A-001\tempDir-001\node2\collection1_shard1_replica2\data\tlog\tlog.0000000000000000004: java.nio.file.FileSystemException: C:\Users\jenkins\workspace\Lucene-Solr-master-Windows\solr\build\solr-core\test\J0\temp\solr.cloud.TestCloudRecovery_D27AB8772F76557A-001\tempDir-001\node2\collection1_shard1_replica2\data\tlog\tlog.0000000000000000004: The process cannot access the file because it is being used by another process.
C:\Users\jenkins\workspace\Lucene-Solr-master-Windows\solr\build\solr-core\test\J0\temp\solr.cloud.TestCloudRecovery_D27AB8772F76557A-001\tempDir-001\node2\collection1_shard1_replica2\data\tlog: java.nio.file.DirectoryNotEmptyException: C:\Users\jenkins\workspace\Lucene-Solr-master-Windows\solr\build\solr-core\test\J0\temp\solr.cloud.TestCloudRecovery_D27AB8772F76557A-001\tempDir-001\node2\collection1_shard1_replica2\data\tlog
C:\Users\jenkins\workspace\Lucene-Solr-master-Windows\solr\build\solr-core\test\J0\temp\solr.cloud.TestCloudRecovery_D27AB8772F76557A-001\tempDir-001\node2\collection1_shard1_replica2\data: java.nio.file.DirectoryNotEmptyException: C:\Users\jenkins\workspace\Lucene-Solr-master-Windows\solr\build\solr-core\test\J0\temp\solr.cloud.TestCloudRecovery_D27AB8772F76557A-001\tempDir-001\node2\collection1_shard1_replica2\data
C:\Users\jenkins\workspace\Lucene-Solr-master-Windows\solr\build\solr-core\test\J0\temp\solr.cloud.TestCloudRecovery_D27AB8772F76557A-001\tempDir-001\node2\collection1_shard1_replica2: java.nio.file.DirectoryNotEmptyException: C:\Users\jenkins\workspace\Lucene-Solr-master-Windows\solr\build\solr-core\test\J0\temp\solr.cloud.TestCloudRecovery_D27AB8772F76557A-001\tempDir-001\node2\collection1_shard1_replica2
C:\Users\jenkins\workspace\Lucene-Solr-master-Windows\solr\build\solr-core\test\J0\temp\solr.cloud.TestCloudRecovery_D27AB8772F76557A-001\tempDir-001\node2: java.nio.file.DirectoryNotEmptyException: C:\Users\jenkins\workspace\Lucene-Solr-master-Windows\solr\build\solr-core\test\J0\temp\solr.cloud.TestCloudRecovery_D27AB8772F76557A-001\tempDir-001\node2
C:\Users\jenkins\workspace\Lucene-Solr-master-Windows\solr\build\solr-core\test\J0\temp\solr.cloud.TestCloudRecovery_D27AB8772F76557A-001\tempDir-001\node1\collection1_shard2_replica1\data\tlog\tlog.0000000000000000004: java.nio.file.FileSystemException: C:\Users\jenkins\workspace\Lucene-Solr-master-Windows\solr\build\solr-core\test\J0\temp\solr.cloud.TestCloudRecovery_D27AB8772F76557A-001\tempDir-001\node1\collection1_shard2_replica1\data\tlog\tlog.0000000000000000004: The process cannot access the file because it is being used by another process.
C:\Users\jenkins\workspace\Lucene-Solr-master-Windows\solr\build\solr-core\test\J0\temp\solr.cloud.TestCloudRecovery_D27AB8772F76557A-001\tempDir-001\node1\collection1_shard2_replica1\data\tlog: java.nio.file.DirectoryNotEmptyException: C:\Users\jenkins\workspace\Lucene-Solr-master-Windows\solr\build\solr-core\test\J0\temp\solr.cloud.TestCloudRecovery_D27AB8772F76557A-001\tempDir-001\node1\collection1_shard2_replica1\data\tlog
C:\Users\jenkins\workspace\Lucene-Solr-master-Windows\solr\build\solr-core\test\J0\temp\solr.cloud.TestCloudRecovery_D27AB8772F76557A-001\tempDir-001\node1\collection1_shard2_replica1\data: java.nio.file.DirectoryNotEmptyException: C:\Users\jenkins\workspace\Lucene-Solr-master-Windows\solr\build\solr-core\test\J0\temp\solr.cloud.TestCloudRecovery_D27AB8772F76557A-001\tempDir-001\node1\collection1_shard2_replica1\data
C:\Users\jenkins\workspace\Lucene-Solr-master-Windows\solr\build\solr-core\test\J0\temp\solr.cloud.TestCloudRecovery_D27AB8772F76557A-001\tempDir-001\node1\collection1_shard2_replica1: java.nio.file.DirectoryNotEmptyException: C:\Users\jenkins\workspace\Lucene-Solr-master-Windows\solr\build\solr-core\test\J0\temp\solr.cloud.TestCloudRecovery_D27AB8772F76557A-001\tempDir-001\node1\collection1_shard2_replica1
C:\Users\jenkins\workspace\Lucene-Solr-master-Windows\solr\build\solr-core\test\J0\temp\solr.cloud.TestCloudRecovery_D27AB8772F76557A-001\tempDir-001\node1\collection1_shard1_replica1\data\tlog\tlog.0000000000000000004: java.nio.file.FileSystemException: C:\Users\jenkins\workspace\Lucene-Solr-master-Windows\solr\build\solr-core\test\J0\temp\solr.cloud.TestCloudRecovery_D27AB8772F76557A-001\tempDir-001\node1\collection1_shard1_replica1\data\tlog\tlog.0000000000000000004: The process cannot access the file because it is being used by another process.
C:\Users\jenkins\workspace\Lucene-Solr-master-Windows\solr\build\solr-core\test\J0\temp\solr.cloud.TestCloudRecovery_D27AB8772F76557A-001\tempDir-001\node1\collection1_shard1_replica1\data\tlog: java.nio.file.DirectoryNotEmptyException: C:\Users\jenkins\workspace\Lucene-Solr-master-Windows\solr\build\solr-core\test\J0\temp\solr.cloud.TestCloudRecovery_D27AB8772F76557A-001\tempDir-001\node1\collection1_shard1_replica1\data\tlog
C:\Users\jenkins\workspace\Lucene-Solr-master-Windows\solr\build\solr-core\test\J0\temp\solr.cloud.TestCloudRecovery_D27AB8772F76557A-001\tempDir-001\node1\collection1_shard1_replica1\data: java.nio.file.DirectoryNotEmptyException: C:\Users\jenkins\workspace\Lucene-Solr-master-Windows\solr\build\solr-core\test\J0\temp\solr.cloud.TestCloudRecovery_D27AB8772F76557A-001\tempDir-001\node1\collection1_shard1_replica1\data
C:\Users\jenkins\workspace\Lucene-Solr-master-Windows\solr\build\solr-core\test\J0\temp\solr.cloud.TestCloudRecovery_D27AB8772F76557A-001\tempDir-001\node1\collection1_shard1_replica1: java.nio.file.DirectoryNotEmptyException: C:\Users\jenkins\workspace\Lucene-Solr-master-Windows\solr\build\solr-core\test\J0\temp\solr.cloud.TestCloudRecovery_D27AB8772F76557A-001\tempDir-001\node1\collection1_shard1_replica1
C:\Users\jenkins\workspace\Lucene-Solr-master-Windows\solr\build\solr-core\test\J0\temp\solr.cloud.TestCloudRecovery_D27AB8772F76557A-001\tempDir-001\node1: java.nio.file.DirectoryNotEmptyException: C:\Users\jenkins\workspace\Lucene-Solr-master-Windows\solr\build\solr-core\test\J0\temp\solr.cloud.TestCloudRecovery_D27AB8772F76557A-001\tempDir-001\node1
C:\Users\jenkins\workspace\Lucene-Solr-master-Windows\solr\build\solr-core\test\J0\temp\solr.cloud.TestCloudRecovery_D27AB8772F76557A-001\tempDir-001: java.nio.file.DirectoryNotEmptyException: C:\Users\jenkins\workspace\Lucene-Solr-master-Windows\solr\build\solr-core\test\J0\temp\solr.cloud.TestCloudRecovery_D27AB8772F76557A-001\tempDir-001
C:\Users\jenkins\workspace\Lucene-Solr-master-Windows\solr\build\solr-core\test\J0\temp\solr.cloud.TestCloudRecovery_D27AB8772F76557A-001: java.nio.file.DirectoryNotEmptyException: C:\Users\jenkins\workspace\Lucene-Solr-master-Windows\solr\build\solr-core\test\J0\temp\solr.cloud.TestCloudRecovery_D27AB8772F76557A-001
at __randomizedtesting.SeedInfo.seed([D27AB8772F76557A]:0)
at org.apache.lucene.util.IOUtils.rm(IOUtils.java:323)
at org.apache.lucene.util.TestRuleTemporaryFilesCleanup.afterAlways(TestRuleTemporaryFilesCleanup.java:216)
at com.carrotsearch.randomizedtesting.rules.TestRuleAdapter$1.afterAlways(TestRuleAdapter.java:31)
at com.carrotsearch.randomizedtesting.rules.StatementAdapter.evaluate(StatementAdapter.java:43)
at com.carrotsearch.randomizedtesting.rules.StatementAdapter.evaluate(StatementAdapter.java:36)
at org.apache.lucene.util.TestRuleAssertionsRequired$1.evaluate(TestRuleAssertionsRequired.java:53)
at org.apache.lucene.util.TestRuleMarkFailure$1.evaluate(TestRuleMarkFailure.java:47)
at org.apache.lucene.util.TestRuleIgnoreAfterMaxFailures$1.evaluate(TestRuleIgnoreAfterMaxFailures.java:64)
at org.apache.lucene.util.TestRuleIgnoreTestSuites$1.evaluate(TestRuleIgnoreTestSuites.java:54)
at com.carrotsearch.randomizedtesting.rules.StatementAdapter.evaluate(StatementAdapter.java:36)
at com.carrotsearch.randomizedtesting.ThreadLeakControl$StatementRunner.run(ThreadLeakControl.java:368)
at java.lang.Thread.run(Thread.java:745)
FAILED: junit.framework.TestSuite.org.apache.solr.rest.schema.TestBulkSchemaAPI
Error Message:
Could not remove the following files (in the order of attempts): C:\Users\jenkins\workspace\Lucene-Solr-master-Windows\solr\build\solr-core\test\J1\temp\solr.rest.schema.TestBulkSchemaAPI_D27AB8772F76557A-001\tempDir-024\cores\core\data: java.nio.file.DirectoryNotEmptyException: C:\Users\jenkins\workspace\Lucene-Solr-master-Windows\solr\build\solr-core\test\J1\temp\solr.rest.schema.TestBulkSchemaAPI_D27AB8772F76557A-001\tempDir-024\cores\core\data C:\Users\jenkins\workspace\Lucene-Solr-master-Windows\solr\build\solr-core\test\J1\temp\solr.rest.schema.TestBulkSchemaAPI_D27AB8772F76557A-001\tempDir-024\cores\core: java.nio.file.DirectoryNotEmptyException: C:\Users\jenkins\workspace\Lucene-Solr-master-Windows\solr\build\solr-core\test\J1\temp\solr.rest.schema.TestBulkSchemaAPI_D27AB8772F76557A-001\tempDir-024\cores\core C:\Users\jenkins\workspace\Lucene-Solr-master-Windows\solr\build\solr-core\test\J1\temp\solr.rest.schema.TestBulkSchemaAPI_D27AB8772F76557A-001\tempDir-024\cores: java.nio.file.DirectoryNotEmptyException: C:\Users\jenkins\workspace\Lucene-Solr-master-Windows\solr\build\solr-core\test\J1\temp\solr.rest.schema.TestBulkSchemaAPI_D27AB8772F76557A-001\tempDir-024\cores C:\Users\jenkins\workspace\Lucene-Solr-master-Windows\solr\build\solr-core\test\J1\temp\solr.rest.schema.TestBulkSchemaAPI_D27AB8772F76557A-001\tempDir-024: java.nio.file.DirectoryNotEmptyException: C:\Users\jenkins\workspace\Lucene-Solr-master-Windows\solr\build\solr-core\test\J1\temp\solr.rest.schema.TestBulkSchemaAPI_D27AB8772F76557A-001\tempDir-024
Stack Trace:
java.io.IOException: Could not remove the following files (in the order of attempts):
C:\Users\jenkins\workspace\Lucene-Solr-master-Windows\solr\build\solr-core\test\J1\temp\solr.rest.schema.TestBulkSchemaAPI_D27AB8772F76557A-001\tempDir-024\cores\core\data: java.nio.file.DirectoryNotEmptyException: C:\Users\jenkins\workspace\Lucene-Solr-master-Windows\solr\build\solr-core\test\J1\temp\solr.rest.schema.TestBulkSchemaAPI_D27AB8772F76557A-001\tempDir-024\cores\core\data
C:\Users\jenkins\workspace\Lucene-Solr-master-Windows\solr\build\solr-core\test\J1\temp\solr.rest.schema.TestBulkSchemaAPI_D27AB8772F76557A-001\tempDir-024\cores\core: java.nio.file.DirectoryNotEmptyException: C:\Users\jenkins\workspace\Lucene-Solr-master-Windows\solr\build\solr-core\test\J1\temp\solr.rest.schema.TestBulkSchemaAPI_D27AB8772F76557A-001\tempDir-024\cores\core
C:\Users\jenkins\workspace\Lucene-Solr-master-Windows\solr\build\solr-core\test\J1\temp\solr.rest.schema.TestBulkSchemaAPI_D27AB8772F76557A-001\tempDir-024\cores: java.nio.file.DirectoryNotEmptyException: C:\Users\jenkins\workspace\Lucene-Solr-master-Windows\solr\build\solr-core\test\J1\temp\solr.rest.schema.TestBulkSchemaAPI_D27AB8772F76557A-001\tempDir-024\cores
C:\Users\jenkins\workspace\Lucene-Solr-master-Windows\solr\build\solr-core\test\J1\temp\solr.rest.schema.TestBulkSchemaAPI_D27AB8772F76557A-001\tempDir-024: java.nio.file.DirectoryNotEmptyException: C:\Users\jenkins\workspace\Lucene-Solr-master-Windows\solr\build\solr-core\test\J1\temp\solr.rest.schema.TestBulkSchemaAPI_D27AB8772F76557A-001\tempDir-024
at __randomizedtesting.SeedInfo.seed([D27AB8772F76557A]:0)
at org.apache.lucene.util.IOUtils.rm(IOUtils.java:323)
at org.apache.lucene.util.TestRuleTemporaryFilesCleanup.afterAlways(TestRuleTemporaryFilesCleanup.java:216)
at com.carrotsearch.randomizedtesting.rules.TestRuleAdapter$1.afterAlways(TestRuleAdapter.java:31)
at com.carrotsearch.randomizedtesting.rules.StatementAdapter.evaluate(StatementAdapter.java:43)
at com.carrotsearch.randomizedtesting.rules.StatementAdapter.evaluate(StatementAdapter.java:36)
at org.apache.lucene.util.TestRuleAssertionsRequired$1.evaluate(TestRuleAssertionsRequired.java:53)
at org.apache.lucene.util.TestRuleMarkFailure$1.evaluate(TestRuleMarkFailure.java:47)
at org.apache.lucene.util.TestRuleIgnoreAfterMaxFailures$1.evaluate(TestRuleIgnoreAfterMaxFailures.java:64)
at org.apache.lucene.util.TestRuleIgnoreTestSuites$1.evaluate(TestRuleIgnoreTestSuites.java:54)
at com.carrotsearch.randomizedtesting.rules.StatementAdapter.evaluate(StatementAdapter.java:36)
at com.carrotsearch.randomizedtesting.ThreadLeakControl$StatementRunner.run(ThreadLeakControl.java:368)
at java.lang.Thread.run(Thread.java:745)
Build Log:
[...truncated 11238 lines...]
[junit4] Suite: org.apache.solr.cloud.TestCloudRecovery
[junit4] 2> Creating dataDir: C:\Users\jenkins\workspace\Lucene-Solr-master-Windows\solr\build\solr-core\test\J0\temp\solr.cloud.TestCloudRecovery_D27AB8772F76557A-001\init-core-data-001
[junit4] 2> 630008 INFO (SUITE-TestCloudRecovery-seed#[D27AB8772F76557A]-worker) [ ] o.a.s.SolrTestCaseJ4 Using TrieFields
[junit4] 2> 630015 INFO (SUITE-TestCloudRecovery-seed#[D27AB8772F76557A]-worker) [ ] o.a.s.SolrTestCaseJ4 Randomized ssl (false) and clientAuth (false) via: @org.apache.solr.util.RandomizeSSL(reason=, value=NaN, ssl=NaN, clientAuth=NaN)
[junit4] 2> 630018 INFO (SUITE-TestCloudRecovery-seed#[D27AB8772F76557A]-worker) [ ] o.a.s.c.MiniSolrCloudCluster Starting cluster of 2 servers in C:\Users\jenkins\workspace\Lucene-Solr-master-Windows\solr\build\solr-core\test\J0\temp\solr.cloud.TestCloudRecovery_D27AB8772F76557A-001\tempDir-001
[junit4] 2> 630018 INFO (SUITE-TestCloudRecovery-seed#[D27AB8772F76557A]-worker) [ ] o.a.s.c.ZkTestServer STARTING ZK TEST SERVER
[junit4] 2> 630019 INFO (Thread-1047) [ ] o.a.s.c.ZkTestServer client port:0.0.0.0/0.0.0.0:0
[junit4] 2> 630019 INFO (Thread-1047) [ ] o.a.s.c.ZkTestServer Starting server
[junit4] 2> 630120 INFO (SUITE-TestCloudRecovery-seed#[D27AB8772F76557A]-worker) [ ] o.a.s.c.ZkTestServer start zk server on port:62475
[junit4] 2> 630138 INFO (jetty-launcher-1007-thread-2) [ ] o.e.j.s.Server jetty-9.3.14.v20161028
[junit4] 2> 630138 INFO (jetty-launcher-1007-thread-1) [ ] o.e.j.s.Server jetty-9.3.14.v20161028
[junit4] 2> 630141 INFO (jetty-launcher-1007-thread-2) [ ] o.e.j.s.h.ContextHandler Started o.e.j.s.ServletContextHandler@ae6568{/solr,null,AVAILABLE}
[junit4] 2> 630143 INFO (jetty-launcher-1007-thread-1) [ ] o.e.j.s.h.ContextHandler Started o.e.j.s.ServletContextHandler@2d237b{/solr,null,AVAILABLE}
[junit4] 2> 630157 INFO (jetty-launcher-1007-thread-2) [ ] o.e.j.s.AbstractConnector Started ServerConnector@101c2b3{HTTP/1.1,[http/1.1]}{127.0.0.1:62481}
[junit4] 2> 630157 INFO (jetty-launcher-1007-thread-1) [ ] o.e.j.s.AbstractConnector Started ServerConnector@c91ef6{HTTP/1.1,[http/1.1]}{127.0.0.1:62483}
[junit4] 2> 630158 INFO (jetty-launcher-1007-thread-2) [ ] o.e.j.s.Server Started @634102ms
[junit4] 2> 630158 INFO (jetty-launcher-1007-thread-1) [ ] o.e.j.s.Server Started @634102ms
[junit4] 2> 630158 INFO (jetty-launcher-1007-thread-2) [ ] o.a.s.c.s.e.JettySolrRunner Jetty properties: {hostContext=/solr, hostPort=62481}
[junit4] 2> 630158 ERROR (jetty-launcher-1007-thread-2) [ ] o.a.s.s.StartupLoggingUtils Missing Java Option solr.log.dir. Logging may be missing or incomplete.
[junit4] 2> 630159 INFO (jetty-launcher-1007-thread-2) [ ] o.a.s.s.SolrDispatchFilter ___ _ Welcome to Apache Solr™ version 7.0.0
[junit4] 2> 630159 INFO (jetty-launcher-1007-thread-2) [ ] o.a.s.s.SolrDispatchFilter / __| ___| |_ _ Starting in cloud mode on port null
[junit4] 2> 630159 INFO (jetty-launcher-1007-thread-2) [ ] o.a.s.s.SolrDispatchFilter \__ \/ _ \ | '_| Install dir: null
[junit4] 2> 630158 INFO (jetty-launcher-1007-thread-1) [ ] o.a.s.c.s.e.JettySolrRunner Jetty properties: {hostContext=/solr, hostPort=62483}
[junit4] 2> 630159 INFO (jetty-launcher-1007-thread-2) [ ] o.a.s.s.SolrDispatchFilter |___/\___/_|_| Start time: 2017-02-13T20:44:10.063Z
[junit4] 2> 630159 ERROR (jetty-launcher-1007-thread-1) [ ] o.a.s.s.StartupLoggingUtils Missing Java Option solr.log.dir. Logging may be missing or incomplete.
[junit4] 2> 630159 INFO (jetty-launcher-1007-thread-1) [ ] o.a.s.s.SolrDispatchFilter ___ _ Welcome to Apache Solr™ version 7.0.0
[junit4] 2> 630159 INFO (jetty-launcher-1007-thread-1) [ ] o.a.s.s.SolrDispatchFilter / __| ___| |_ _ Starting in cloud mode on port null
[junit4] 2> 630159 INFO (jetty-launcher-1007-thread-1) [ ] o.a.s.s.SolrDispatchFilter \__ \/ _ \ | '_| Install dir: null
[junit4] 2> 630159 INFO (jetty-launcher-1007-thread-1) [ ] o.a.s.s.SolrDispatchFilter |___/\___/_|_| Start time: 2017-02-13T20:44:10.063Z
[junit4] 2> 630168 INFO (jetty-launcher-1007-thread-2) [ ] o.a.s.s.SolrDispatchFilter solr.xml found in ZooKeeper. Loading...
[junit4] 2> 630169 INFO (jetty-launcher-1007-thread-1) [ ] o.a.s.s.SolrDispatchFilter solr.xml found in ZooKeeper. Loading...
[junit4] 2> 630189 WARN (NIOServerCxn.Factory:0.0.0.0/0.0.0.0:0) [ ] o.a.z.s.NIOServerCnxn caught end of stream exception
[junit4] 2> EndOfStreamException: Unable to read additional data from client sessionid 0x15a3937e9490001, likely client has closed socket
[junit4] 2> at org.apache.zookeeper.server.NIOServerCnxn.doIO(NIOServerCnxn.java:228)
[junit4] 2> at org.apache.zookeeper.server.NIOServerCnxnFactory.run(NIOServerCnxnFactory.java:208)
[junit4] 2> at java.lang.Thread.run(Thread.java:745)
[junit4] 2> 630190 WARN (NIOServerCxn.Factory:0.0.0.0/0.0.0.0:0) [ ] o.a.z.s.NIOServerCnxn caught end of stream exception
[junit4] 2> EndOfStreamException: Unable to read additional data from client sessionid 0x15a3937e9490002, likely client has closed socket
[junit4] 2> at org.apache.zookeeper.server.NIOServerCnxn.doIO(NIOServerCnxn.java:228)
[junit4] 2> at org.apache.zookeeper.server.NIOServerCnxnFactory.run(NIOServerCnxnFactory.java:208)
[junit4] 2> at java.lang.Thread.run(Thread.java:745)
[junit4] 2> 630197 INFO (jetty-launcher-1007-thread-2) [ ] o.a.s.c.ZkContainer Zookeeper client=127.0.0.1:62475/solr
[junit4] 2> 630198 INFO (jetty-launcher-1007-thread-1) [ ] o.a.s.c.ZkContainer Zookeeper client=127.0.0.1:62475/solr
[junit4] 2> 630206 WARN (NIOServerCxn.Factory:0.0.0.0/0.0.0.0:0) [ ] o.a.z.s.NIOServerCnxn caught end of stream exception
[junit4] 2> EndOfStreamException: Unable to read additional data from client sessionid 0x15a3937e9490004, likely client has closed socket
[junit4] 2> at org.apache.zookeeper.server.NIOServerCnxn.doIO(NIOServerCnxn.java:228)
[junit4] 2> at org.apache.zookeeper.server.NIOServerCnxnFactory.run(NIOServerCnxnFactory.java:208)
[junit4] 2> at java.lang.Thread.run(Thread.java:745)
[junit4] 2> 630248 INFO (jetty-launcher-1007-thread-1) [n:127.0.0.1:62483_solr ] o.a.s.c.Overseer Overseer (id=null) closing
[junit4] 2> 630248 INFO (jetty-launcher-1007-thread-2) [n:127.0.0.1:62481_solr ] o.a.s.c.Overseer Overseer (id=null) closing
[junit4] 2> 630249 INFO (jetty-launcher-1007-thread-1) [n:127.0.0.1:62483_solr ] o.a.s.c.OverseerElectionContext I am going to be the leader 127.0.0.1:62483_solr
[junit4] 2> 630252 INFO (jetty-launcher-1007-thread-2) [n:127.0.0.1:62481_solr ] o.a.s.c.ZkController Register node as live in ZooKeeper:/live_nodes/127.0.0.1:62481_solr
[junit4] 2> 630253 INFO (jetty-launcher-1007-thread-1) [n:127.0.0.1:62483_solr ] o.a.s.c.Overseer Overseer (id=97453254241746949-127.0.0.1:62483_solr-n_0000000000) starting
[junit4] 2> 630259 INFO (zkCallback-1017-thread-1-processing-n:127.0.0.1:62481_solr) [n:127.0.0.1:62481_solr ] o.a.s.c.c.ZkStateReader Updated live nodes from ZooKeeper... (0) -> (1)
[junit4] 2> 630260 INFO (zkCallback-1018-thread-1-processing-n:127.0.0.1:62483_solr) [n:127.0.0.1:62483_solr ] o.a.s.c.c.ZkStateReader Updated live nodes from ZooKeeper... (0) -> (1)
[junit4] 2> 630283 INFO (jetty-launcher-1007-thread-1) [n:127.0.0.1:62483_solr ] o.a.s.c.ZkController Register node as live in ZooKeeper:/live_nodes/127.0.0.1:62483_solr
[junit4] 2> 630288 INFO (zkCallback-1017-thread-1-processing-n:127.0.0.1:62481_solr) [n:127.0.0.1:62481_solr ] o.a.s.c.c.ZkStateReader Updated live nodes from ZooKeeper... (1) -> (2)
[junit4] 2> 630288 INFO (zkCallback-1018-thread-1-processing-n:127.0.0.1:62483_solr) [n:127.0.0.1:62483_solr ] o.a.s.c.c.ZkStateReader Updated live nodes from ZooKeeper... (1) -> (2)
[junit4] 2> 630606 INFO (jetty-launcher-1007-thread-2) [n:127.0.0.1:62481_solr ] o.a.s.c.CorePropertiesLocator Found 0 core definitions underneath C:\Users\jenkins\workspace\Lucene-Solr-master-Windows\solr\build\solr-core\test\J0\temp\solr.cloud.TestCloudRecovery_D27AB8772F76557A-001\tempDir-001\node2\.
[junit4] 2> 630642 INFO (jetty-launcher-1007-thread-1) [n:127.0.0.1:62483_solr ] o.a.s.c.CorePropertiesLocator Found 0 core definitions underneath C:\Users\jenkins\workspace\Lucene-Solr-master-Windows\solr\build\solr-core\test\J0\temp\solr.cloud.TestCloudRecovery_D27AB8772F76557A-001\tempDir-001\node1\.
[junit4] 2> 630928 WARN (NIOServerCxn.Factory:0.0.0.0/0.0.0.0:0) [ ] o.a.z.s.NIOServerCnxn caught end of stream exception
[junit4] 2> EndOfStreamException: Unable to read additional data from client sessionid 0x15a3937e9490007, likely client has closed socket
[junit4] 2> at org.apache.zookeeper.server.NIOServerCnxn.doIO(NIOServerCnxn.java:228)
[junit4] 2> at org.apache.zookeeper.server.NIOServerCnxnFactory.run(NIOServerCnxnFactory.java:208)
[junit4] 2> at java.lang.Thread.run(Thread.java:745)
[junit4] 2> 630936 INFO (SUITE-TestCloudRecovery-seed#[D27AB8772F76557A]-worker) [ ] o.a.s.c.c.ZkStateReader Updated live nodes from ZooKeeper... (0) -> (2)
[junit4] 2> 630938 INFO (SUITE-TestCloudRecovery-seed#[D27AB8772F76557A]-worker) [ ] o.a.s.c.s.i.ZkClientClusterStateProvider Cluster at 127.0.0.1:62475/solr ready
[junit4] 2> 630950 INFO (qtp12448699-5379) [n:127.0.0.1:62481_solr ] o.a.s.h.a.CollectionsHandler Invoked Collection Action :create with params replicationFactor=2&collection.configName=config&maxShardsPerNode=2&name=collection1&action=CREATE&numShards=2&wt=javabin&version=2 and sendToOCPQueue=true
[junit4] 2> 630954 INFO (OverseerThreadFactory-2176-thread-1-processing-n:127.0.0.1:62483_solr) [n:127.0.0.1:62483_solr ] o.a.s.c.CreateCollectionCmd Create collection collection1
[junit4] 2> 631065 INFO (qtp12448699-5377) [n:127.0.0.1:62481_solr ] o.a.s.h.a.CoreAdminOperation core create command qt=/admin/cores&collection.configName=config&newCollection=true&name=collection1_shard1_replica2&action=CREATE&numShards=2&collection=collection1&shard=shard1&wt=javabin&version=2
[junit4] 2> 631066 INFO (qtp16450629-5388) [n:127.0.0.1:62483_solr ] o.a.s.h.a.CoreAdminOperation core create command qt=/admin/cores&collection.configName=config&newCollection=true&name=collection1_shard2_replica1&action=CREATE&numShards=2&collection=collection1&shard=shard2&wt=javabin&version=2
[junit4] 2> 631070 INFO (qtp12448699-5375) [n:127.0.0.1:62481_solr ] o.a.s.h.a.CoreAdminOperation core create command qt=/admin/cores&collection.configName=config&newCollection=true&name=collection1_shard2_replica2&action=CREATE&numShards=2&collection=collection1&shard=shard2&wt=javabin&version=2
[junit4] 2> 631070 INFO (qtp16450629-5384) [n:127.0.0.1:62483_solr ] o.a.s.h.a.CoreAdminOperation core create command qt=/admin/cores&collection.configName=config&newCollection=true&name=collection1_shard1_replica1&action=CREATE&numShards=2&collection=collection1&shard=shard1&wt=javabin&version=2
[junit4] 2> 631188 INFO (zkCallback-1017-thread-1-processing-n:127.0.0.1:62481_solr) [n:127.0.0.1:62481_solr ] o.a.s.c.c.ZkStateReader A cluster state change: [WatchedEvent state:SyncConnected type:NodeDataChanged path:/collections/collection1/state.json] for collection [collection1] has occurred - updating... (live nodes size: [2])
[junit4] 2> 631188 INFO (zkCallback-1018-thread-1-processing-n:127.0.0.1:62483_solr) [n:127.0.0.1:62483_solr ] o.a.s.c.c.ZkStateReader A cluster state change: [WatchedEvent state:SyncConnected type:NodeDataChanged path:/collections/collection1/state.json] for collection [collection1] has occurred - updating... (live nodes size: [2])
[junit4] 2> 632108 INFO (qtp12448699-5377) [n:127.0.0.1:62481_solr c:collection1 s:shard1 x:collection1_shard1_replica2] o.a.s.c.SolrConfig Using Lucene MatchVersion: 7.0.0
[junit4] 2> 632109 INFO (qtp12448699-5375) [n:127.0.0.1:62481_solr c:collection1 s:shard2 x:collection1_shard2_replica2] o.a.s.c.SolrConfig Using Lucene MatchVersion: 7.0.0
[junit4] 2> 632116 INFO (qtp16450629-5388) [n:127.0.0.1:62483_solr c:collection1 s:shard2 x:collection1_shard2_replica1] o.a.s.c.SolrConfig Using Lucene MatchVersion: 7.0.0
[junit4] 2> 632118 INFO (qtp16450629-5384) [n:127.0.0.1:62483_solr c:collection1 s:shard1 x:collection1_shard1_replica1] o.a.s.c.SolrConfig Using Lucene MatchVersion: 7.0.0
[junit4] 2> 632132 INFO (qtp12448699-5377) [n:127.0.0.1:62481_solr c:collection1 s:shard1 x:collection1_shard1_replica2] o.a.s.s.IndexSchema [collection1_shard1_replica2] Schema name=minimal
[junit4] 2> 632134 INFO (qtp12448699-5375) [n:127.0.0.1:62481_solr c:collection1 s:shard2 x:collection1_shard2_replica2] o.a.s.s.IndexSchema [collection1_shard2_replica2] Schema name=minimal
[junit4] 2> 632138 INFO (qtp16450629-5384) [n:127.0.0.1:62483_solr c:collection1 s:shard1 x:collection1_shard1_replica1] o.a.s.s.IndexSchema [collection1_shard1_replica1] Schema name=minimal
[junit4] 2> 632138 INFO (qtp16450629-5388) [n:127.0.0.1:62483_solr c:collection1 s:shard2 x:collection1_shard2_replica1] o.a.s.s.IndexSchema [collection1_shard2_replica1] Schema name=minimal
[junit4] 2> 632142 INFO (qtp16450629-5384) [n:127.0.0.1:62483_solr c:collection1 s:shard1 x:collection1_shard1_replica1] o.a.s.s.IndexSchema Loaded schema minimal/1.1 with uniqueid field id
[junit4] 2> 632143 INFO (qtp16450629-5388) [n:127.0.0.1:62483_solr c:collection1 s:shard2 x:collection1_shard2_replica1] o.a.s.s.IndexSchema Loaded schema minimal/1.1 with uniqueid field id
[junit4] 2> 632143 INFO (qtp12448699-5375) [n:127.0.0.1:62481_solr c:collection1 s:shard2 x:collection1_shard2_replica2] o.a.s.s.IndexSchema Loaded schema minimal/1.1 with uniqueid field id
[junit4] 2> 632146 INFO (qtp12448699-5377) [n:127.0.0.1:62481_solr c:collection1 s:shard1 x:collection1_shard1_replica2] o.a.s.s.IndexSchema Loaded schema minimal/1.1 with uniqueid field id
[junit4] 2> 632149 INFO (qtp16450629-5384) [n:127.0.0.1:62483_solr c:collection1 s:shard1 x:collection1_shard1_replica1] o.a.s.c.CoreContainer Creating SolrCore 'collection1_shard1_replica1' using configuration from collection collection1
[junit4] 2> 632149 INFO (qtp16450629-5388) [n:127.0.0.1:62483_solr c:collection1 s:shard2 x:collection1_shard2_replica1] o.a.s.c.CoreContainer Creating SolrCore 'collection1_shard2_replica1' using configuration from collection collection1
[junit4] 2> 632149 INFO (qtp12448699-5375) [n:127.0.0.1:62481_solr c:collection1 s:shard2 x:collection1_shard2_replica2] o.a.s.c.CoreContainer Creating SolrCore 'collection1_shard2_replica2' using configuration from collection collection1
[junit4] 2> 632149 INFO (qtp16450629-5388) [n:127.0.0.1:62483_solr c:collection1 s:shard2 x:collection1_shard2_replica1] o.a.s.c.SolrCore [[collection1_shard2_replica1] ] Opening new SolrCore at [C:\Users\jenkins\workspace\Lucene-Solr-master-Windows\solr\build\solr-core\test\J0\temp\solr.cloud.TestCloudRecovery_D27AB8772F76557A-001\tempDir-001\node1\collection1_shard2_replica1], dataDir=[C:\Users\jenkins\workspace\Lucene-Solr-master-Windows\solr\build\solr-core\test\J0\temp\solr.cloud.TestCloudRecovery_D27AB8772F76557A-001\tempDir-001\node1\.\collection1_shard2_replica1\data\]
[junit4] 2> 632149 INFO (qtp16450629-5384) [n:127.0.0.1:62483_solr c:collection1 s:shard1 x:collection1_shard1_replica1] o.a.s.c.SolrCore [[collection1_shard1_replica1] ] Opening new SolrCore at [C:\Users\jenkins\workspace\Lucene-Solr-master-Windows\solr\build\solr-core\test\J0\temp\solr.cloud.TestCloudRecovery_D27AB8772F76557A-001\tempDir-001\node1\collection1_shard1_replica1], dataDir=[C:\Users\jenkins\workspace\Lucene-Solr-master-Windows\solr\build\solr-core\test\J0\temp\solr.cloud.TestCloudRecovery_D27AB8772F76557A-001\tempDir-001\node1\.\collection1_shard1_replica1\data\]
[junit4] 2> 632149 INFO (qtp12448699-5375) [n:127.0.0.1:62481_solr c:collection1 s:shard2 x:collection1_shard2_replica2] o.a.s.c.SolrCore [[collection1_shard2_replica2] ] Opening new SolrCore at [C:\Users\jenkins\workspace\Lucene-Solr-master-Windows\solr\build\solr-core\test\J0\temp\solr.cloud.TestCloudRecovery_D27AB8772F76557A-001\tempDir-001\node2\collection1_shard2_replica2], dataDir=[C:\Users\jenkins\workspace\Lucene-Solr-master-Windows\solr\build\solr-core\test\J0\temp\solr.cloud.TestCloudRecovery_D27AB8772F76557A-001\tempDir-001\node2\.\collection1_shard2_replica2\data\]
[junit4] 2> 632149 INFO (qtp12448699-5377) [n:127.0.0.1:62481_solr c:collection1 s:shard1 x:collection1_shard1_replica2] o.a.s.c.CoreContainer Creating SolrCore 'collection1_shard1_replica2' using configuration from collection collection1
[junit4] 2> 632152 INFO (qtp12448699-5377) [n:127.0.0.1:62481_solr c:collection1 s:shard1 x:collection1_shard1_replica2] o.a.s.c.SolrCore [[collection1_shard1_replica2] ] Opening new SolrCore at [C:\Users\jenkins\workspace\Lucene-Solr-master-Windows\solr\build\solr-core\test\J0\temp\solr.cloud.TestCloudRecovery_D27AB8772F76557A-001\tempDir-001\node2\collection1_shard1_replica2], dataDir=[C:\Users\jenkins\workspace\Lucene-Solr-master-Windows\solr\build\solr-core\test\J0\temp\solr.cloud.TestCloudRecovery_D27AB8772F76557A-001\tempDir-001\node2\.\collection1_shard1_replica2\data\]
[junit4] 2> 632352 INFO (qtp16450629-5388) [n:127.0.0.1:62483_solr c:collection1 s:shard2 x:collection1_shard2_replica1] o.a.s.u.UpdateHandler Using UpdateLog implementation: org.apache.solr.update.UpdateLog
[junit4] 2> 632352 INFO (qtp16450629-5388) [n:127.0.0.1:62483_solr c:collection1 s:shard2 x:collection1_shard2_replica1] o.a.s.u.UpdateLog Initializing UpdateLog: dataDir=null defaultSyncLevel=FLUSH numRecordsToKeep=100 maxNumLogsToKeep=10 numVersionBuckets=65536
[junit4] 2> 632354 INFO (qtp16450629-5388) [n:127.0.0.1:62483_solr c:collection1 s:shard2 x:collection1_shard2_replica1] o.a.s.u.CommitTracker Hard AutoCommit: disabled
[junit4] 2> 632354 INFO (qtp16450629-5388) [n:127.0.0.1:62483_solr c:collection1 s:shard2 x:collection1_shard2_replica1] o.a.s.u.CommitTracker Soft AutoCommit: disabled
[junit4] 2> 632354 INFO (qtp12448699-5375) [n:127.0.0.1:62481_solr c:collection1 s:shard2 x:collection1_shard2_replica2] o.a.s.u.UpdateHandler Using UpdateLog implementation: org.apache.solr.update.UpdateLog
[junit4] 2> 632354 INFO (qtp12448699-5375) [n:127.0.0.1:62481_solr c:collection1 s:shard2 x:collection1_shard2_replica2] o.a.s.u.UpdateLog Initializing UpdateLog: dataDir=null defaultSyncLevel=FLUSH numRecordsToKeep=100 maxNumLogsToKeep=10 numVersionBuckets=65536
[junit4] 2> 632357 INFO (qtp12448699-5375) [n:127.0.0.1:62481_solr c:collection1 s:shard2 x:collection1_shard2_replica2] o.a.s.u.CommitTracker Hard AutoCommit: disabled
[junit4] 2> 632357 INFO (qtp12448699-5375) [n:127.0.0.1:62481_solr c:collection1 s:shard2 x:collection1_shard2_replica2] o.a.s.u.CommitTracker Soft AutoCommit: disabled
[junit4] 2> 632358 INFO (qtp16450629-5384) [n:127.0.0.1:62483_solr c:collection1 s:shard1 x:collection1_shard1_replica1] o.a.s.u.UpdateHandler Using UpdateLog implementation: org.apache.solr.update.UpdateLog
[junit4] 2> 632358 INFO (qtp16450629-5384) [n:127.0.0.1:62483_solr c:collection1 s:shard1 x:collection1_shard1_replica1] o.a.s.u.UpdateLog Initializing UpdateLog: dataDir=null defaultSyncLevel=FLUSH numRecordsToKeep=100 maxNumLogsToKeep=10 numVersionBuckets=65536
[junit4] 2> 632360 INFO (qtp16450629-5384) [n:127.0.0.1:62483_solr c:collection1 s:shard1 x:collection1_shard1_replica1] o.a.s.u.CommitTracker Hard AutoCommit: disabled
[junit4] 2> 632360 INFO (qtp16450629-5384) [n:127.0.0.1:62483_solr c:collection1 s:shard1 x:collection1_shard1_replica1] o.a.s.u.CommitTracker Soft AutoCommit: disabled
[junit4] 2> 632365 INFO (qtp16450629-5388) [n:127.0.0.1:62483_solr c:collection1 s:shard2 x:collection1_shard2_replica1] o.a.s.s.SolrIndexSearcher Opening [Searcher@1685b8b[collection1_shard2_replica1] main]
[junit4] 2> 632368 INFO (qtp12448699-5375) [n:127.0.0.1:62481_solr c:collection1 s:shard2 x:collection1_shard2_replica2] o.a.s.s.SolrIndexSearcher Opening [Searcher@8a7bc4[collection1_shard2_replica2] main]
[junit4] 2> 632370 INFO (qtp16450629-5384) [n:127.0.0.1:62483_solr c:collection1 s:shard1 x:collection1_shard1_replica1] o.a.s.s.SolrIndexSearcher Opening [Searcher@1c1706[collection1_shard1_replica1] main]
[junit4] 2> 632370 INFO (qtp16450629-5388) [n:127.0.0.1:62483_solr c:collection1 s:shard2 x:collection1_shard2_replica1] o.a.s.r.ManagedResourceStorage Configured ZooKeeperStorageIO with znodeBase: /configs/config
[junit4] 2> 632370 INFO (qtp12448699-5375) [n:127.0.0.1:62481_solr c:collection1 s:shard2 x:collection1_shard2_replica2] o.a.s.r.ManagedResourceStorage Configured ZooKeeperStorageIO with znodeBase: /configs/config
[junit4] 2> 632371 INFO (qtp16450629-5388) [n:127.0.0.1:62483_solr c:collection1 s:shard2 x:collection1_shard2_replica1] o.a.s.r.ManagedResourceStorage Loaded null at path _rest_managed.json using ZooKeeperStorageIO:path=/configs/config
[junit4] 2> 632371 INFO (qtp12448699-5375) [n:127.0.0.1:62481_solr c:collection1 s:shard2 x:collection1_shard2_replica2] o.a.s.r.ManagedResourceStorage Loaded null at path _rest_managed.json using ZooKeeperStorageIO:path=/configs/config
[junit4] 2> 632371 INFO (qtp16450629-5388) [n:127.0.0.1:62483_solr c:collection1 s:shard2 x:collection1_shard2_replica1] o.a.s.h.ReplicationHandler Commits will be reserved for 10000
[junit4] 2> 632371 INFO (qtp12448699-5375) [n:127.0.0.1:62481_solr c:collection1 s:shard2 x:collection1_shard2_replica2] o.a.s.h.ReplicationHandler Commits will be reserved for 10000
[junit4] 2> 632372 INFO (qtp12448699-5375) [n:127.0.0.1:62481_solr c:collection1 s:shard2 x:collection1_shard2_replica2] o.a.s.u.UpdateLog Could not find max version in index or recent updates, using new clock 1559252070328958976
[junit4] 2> 632372 INFO (qtp16450629-5388) [n:127.0.0.1:62483_solr c:collection1 s:shard2 x:collection1_shard2_replica1] o.a.s.u.UpdateLog Could not find max version in index or recent updates, using new clock 1559252070328958976
[junit4] 2> 632373 INFO (qtp16450629-5384) [n:127.0.0.1:62483_solr c:collection1 s:shard1 x:collection1_shard1_replica1] o.a.s.r.ManagedResourceStorage Configured ZooKeeperStorageIO with znodeBase: /configs/config
[junit4] 2> 632375 INFO (qtp16450629-5384) [n:127.0.0.1:62483_solr c:collection1 s:shard1 x:collection1_shard1_replica1] o.a.s.r.ManagedResourceStorage Loaded null at path _rest_managed.json using ZooKeeperStorageIO:path=/configs/config
[junit4] 2> 632375 INFO (qtp16450629-5384) [n:127.0.0.1:62483_solr c:collection1 s:shard1 x:collection1_shard1_replica1] o.a.s.h.ReplicationHandler Commits will be reserved for 10000
[junit4] 2> 632376 INFO (qtp16450629-5384) [n:127.0.0.1:62483_solr c:collection1 s:shard1 x:collection1_shard1_replica1] o.a.s.u.UpdateLog Could not find max version in index or recent updates, using new clock 1559252070333153280
[junit4] 2> 632376 INFO (qtp12448699-5377) [n:127.0.0.1:62481_solr c:collection1 s:shard1 x:collection1_shard1_replica2] o.a.s.u.UpdateHandler Using UpdateLog implementation: org.apache.solr.update.UpdateLog
[junit4] 2> 632376 INFO (qtp12448699-5377) [n:127.0.0.1:62481_solr c:collection1 s:shard1 x:collection1_shard1_replica2] o.a.s.u.UpdateLog Initializing UpdateLog: dataDir=null defaultSyncLevel=FLUSH numRecordsToKeep=100 maxNumLogsToKeep=10 numVersionBuckets=65536
[junit4] 2> 632378 INFO (qtp12448699-5377) [n:127.0.0.1:62481_solr c:collection1 s:shard1 x:collection1_shard1_replica2] o.a.s.u.CommitTracker Hard AutoCommit: disabled
[junit4] 2> 632380 INFO (searcherExecutor-2183-thread-1-processing-n:127.0.0.1:62481_solr x:collection1_shard2_replica2 s:shard2 c:collection1) [n:127.0.0.1:62481_solr c:collection1 s:shard2 x:collection1_shard2_replica2] o.a.s.c.SolrCore [collection1_shard2_replica2] Registered new searcher Searcher@8a7bc4[collection1_shard2_replica2] main{ExitableDirectoryReader(UninvertingDirectoryReader())}
[junit4] 2> 632380 INFO (searcherExecutor-2181-thread-1-processing-n:127.0.0.1:62483_solr x:collection1_shard1_replica1 s:shard1 c:collection1) [n:127.0.0.1:62483_solr c:collection1 s:shard1 x:collection1_shard1_replica1] o.a.s.c.SolrCore [collection1_shard1_replica1] Registered new searcher Searcher@1c1706[collection1_shard1_replica1] main{ExitableDirectoryReader(UninvertingDirectoryReader())}
[junit4] 2> 632378 INFO (qtp12448699-5377) [n:127.0.0.1:62481_solr c:collection1 s:shard1 x:collection1_shard1_replica2] o.a.s.u.CommitTracker Soft AutoCommit: disabled
[junit4] 2> 632380 INFO (searcherExecutor-2182-thread-1-processing-n:127.0.0.1:62483_solr x:collection1_shard2_replica1 s:shard2 c:collection1) [n:127.0.0.1:62483_solr c:collection1 s:shard2 x:collection1_shard2_replica1] o.a.s.c.SolrCore [collection1_shard2_replica1] Registered new searcher Searcher@1685b8b[collection1_shard2_replica1] main{ExitableDirectoryReader(UninvertingDirectoryReader())}
[junit4] 2> 632391 INFO (qtp12448699-5377) [n:127.0.0.1:62481_solr c:collection1 s:shard1 x:collection1_shard1_replica2] o.a.s.s.SolrIndexSearcher Opening [Searcher@6286dd[collection1_shard1_replica2] main]
[junit4] 2> 632392 INFO (qtp12448699-5375) [n:127.0.0.1:62481_solr c:collection1 s:shard2 x:collection1_shard2_replica2] o.a.s.c.ShardLeaderElectionContext Enough replicas found to continue.
[junit4] 2> 632392 INFO (qtp12448699-5375) [n:127.0.0.1:62481_solr c:collection1 s:shard2 x:collection1_shard2_replica2] o.a.s.c.ShardLeaderElectionContext I may be the new leader - try and sync
[junit4] 2> 632392 INFO (qtp12448699-5375) [n:127.0.0.1:62481_solr c:collection1 s:shard2 x:collection1_shard2_replica2] o.a.s.c.SyncStrategy Sync replicas to http://127.0.0.1:62481/solr/collection1_shard2_replica2/
[junit4] 2> 632392 INFO (qtp12448699-5375) [n:127.0.0.1:62481_solr c:collection1 s:shard2 x:collection1_shard2_replica2] o.a.s.u.PeerSync PeerSync: core=collection1_shard2_replica2 url=http://127.0.0.1:62481/solr START replicas=[http://127.0.0.1:62483/solr/collection1_shard2_replica1/] nUpdates=100
[junit4] 2> 632393 INFO (qtp12448699-5375) [n:127.0.0.1:62481_solr c:collection1 s:shard2 x:collection1_shard2_replica2] o.a.s.u.PeerSync PeerSync: core=collection1_shard2_replica2 url=http://127.0.0.1:62481/solr DONE. We have no versions. sync failed.
[junit4] 2> 632393 INFO (qtp16450629-5384) [n:127.0.0.1:62483_solr c:collection1 s:shard1 x:collection1_shard1_replica1] o.a.s.c.ShardLeaderElectionContext Waiting until we see more replicas up for shard shard1: total=2 found=1 timeoutin=9999ms
[junit4] 2> 632394 INFO (qtp12448699-5377) [n:127.0.0.1:62481_solr c:collection1 s:shard1 x:collection1_shard1_replica2] o.a.s.r.ManagedResourceStorage Configured ZooKeeperStorageIO with znodeBase: /configs/config
[junit4] 2> 632395 INFO (qtp12448699-5377) [n:127.0.0.1:62481_solr c:collection1 s:shard1 x:collection1_shard1_replica2] o.a.s.r.ManagedResourceStorage Loaded null at path _rest_managed.json using ZooKeeperStorageIO:path=/configs/config
[junit4] 2> 632395 INFO (qtp12448699-5377) [n:127.0.0.1:62481_solr c:collection1 s:shard1 x:collection1_shard1_replica2] o.a.s.h.ReplicationHandler Commits will be reserved for 10000
[junit4] 2> 632395 INFO (searcherExecutor-2184-thread-1-processing-n:127.0.0.1:62481_solr x:collection1_shard1_replica2 s:shard1 c:collection1) [n:127.0.0.1:62481_solr c:collection1 s:shard1 x:collection1_shard1_replica2] o.a.s.c.SolrCore [collection1_shard1_replica2] Registered new searcher Searcher@6286dd[collection1_shard1_replica2] main{ExitableDirectoryReader(UninvertingDirectoryReader())}
[junit4] 2> 632395 INFO (qtp12448699-5377) [n:127.0.0.1:62481_solr c:collection1 s:shard1 x:collection1_shard1_replica2] o.a.s.u.UpdateLog Could not find max version in index or recent updates, using new clock 1559252070353076224
[junit4] 2> 632401 INFO (qtp16450629-5376) [n:127.0.0.1:62483_solr c:collection1 s:shard2 r:core_node2 x:collection1_shard2_replica1] o.a.s.c.S.Request [collection1_shard2_replica1] webapp=/solr path=/get params={distrib=false&qt=/get&fingerprint=false&getVersions=100&wt=javabin&version=2} status=0 QTime=1
[junit4] 2> 632402 INFO (qtp12448699-5375) [n:127.0.0.1:62481_solr c:collection1 s:shard2 x:collection1_shard2_replica2] o.a.s.c.SyncStrategy Leader's attempt to sync with shard failed, moving to the next candidate
[junit4] 2> 632402 INFO (qtp12448699-5375) [n:127.0.0.1:62481_solr c:collection1 s:shard2 x:collection1_shard2_replica2] o.a.s.c.ShardLeaderElectionContext We failed sync, but we have no versions - we can't sync in that case - we were active before, so become leader anyway
[junit4] 2> 632408 INFO (qtp12448699-5375) [n:127.0.0.1:62481_solr c:collection1 s:shard2 x:collection1_shard2_replica2] o.a.s.c.ShardLeaderElectionContext I am the new leader: http://127.0.0.1:62481/solr/collection1_shard2_replica2/ shard2
[junit4] 2> 632514 INFO (zkCallback-1018-thread-2-processing-n:127.0.0.1:62483_solr) [n:127.0.0.1:62483_solr ] o.a.s.c.c.ZkStateReader A cluster state change: [WatchedEvent state:SyncConnected type:NodeDataChanged path:/collections/collection1/state.json] for collection [collection1] has occurred - updating... (live nodes size: [2])
[junit4] 2> 632514 INFO (zkCallback-1017-thread-1-processing-n:127.0.0.1:62481_solr) [n:127.0.0.1:62481_solr ] o.a.s.c.c.ZkStateReader A cluster state change: [WatchedEvent state:SyncConnected type:NodeDataChanged path:/collections/collection1/state.json] for collection [collection1] has occurred - updating... (live nodes size: [2])
[junit4] 2> 632560 INFO (qtp12448699-5375) [n:127.0.0.1:62481_solr c:collection1 s:shard2 x:collection1_shard2_replica2] o.a.s.c.ZkController I am the leader, no recovery necessary
[junit4] 2> 632568 INFO (qtp12448699-5375) [n:127.0.0.1:62481_solr c:collection1 s:shard2 x:collection1_shard2_replica2] o.a.s.s.HttpSolrCall [admin] webapp=null path=/admin/cores params={qt=/admin/cores&collection.configName=config&newCollection=true&name=collection1_shard2_replica2&action=CREATE&numShards=2&collection=collection1&shard=shard2&wt=javabin&version=2} status=0 QTime=1499
[junit4] 2> 632668 INFO (zkCallback-1018-thread-3-processing-n:127.0.0.1:62483_solr) [n:127.0.0.1:62483_solr ] o.a.s.c.c.ZkStateReader A cluster state change: [WatchedEvent state:SyncConnected type:NodeDataChanged path:/collections/collection1/state.json] for collection [collection1] has occurred - updating... (live nodes size: [2])
[junit4] 2> 632668 INFO (zkCallback-1017-thread-1-processing-n:127.0.0.1:62481_solr) [n:127.0.0.1:62481_solr ] o.a.s.c.c.ZkStateReader A cluster state change: [WatchedEvent state:SyncConnected type:NodeDataChanged path:/collections/collection1/state.json] for collection [collection1] has occurred - updating... (live nodes size: [2])
[junit4] 2> 632893 INFO (qtp16450629-5384) [n:127.0.0.1:62483_solr c:collection1 s:shard1 x:collection1_shard1_replica1] o.a.s.c.ShardLeaderElectionContext Enough replicas found to continue.
[junit4] 2> 632894 INFO (qtp16450629-5384) [n:127.0.0.1:62483_solr c:collection1 s:shard1 x:collection1_shard1_replica1] o.a.s.c.ShardLeaderElectionContext I may be the new leader - try and sync
[junit4] 2> 632894 INFO (qtp16450629-5384) [n:127.0.0.1:62483_solr c:collection1 s:shard1 x:collection1_shard1_replica1] o.a.s.c.SyncStrategy Sync replicas to http://127.0.0.1:62483/solr/collection1_shard1_replica1/
[junit4] 2> 632894 INFO (qtp16450629-5384) [n:127.0.0.1:62483_solr c:collection1 s:shard1 x:collection1_shard1_replica1] o.a.s.u.PeerSync PeerSync: core=collection1_shard1_replica1 url=http://127.0.0.1:62483/solr START replicas=[http://127.0.0.1:62481/solr/collection1_shard1_replica2/] nUpdates=100
[junit4] 2> 632894 INFO (qtp16450629-5384) [n:127.0.0.1:62483_solr c:collection1 s:shard1 x:collection1_shard1_replica1] o.a.s.u.PeerSync PeerSync: core=collection1_shard1_replica1 url=http://127.0.0.1:62483/solr DONE. We have no versions. sync failed.
[junit4] 2> 632898 INFO (qtp12448699-5372) [n:127.0.0.1:62481_solr c:collection1 s:shard1 r:core_node1 x:collection1_shard1_replica2] o.a.s.c.S.Request [collection1_shard1_replica2] webapp=/solr path=/get params={distrib=false&qt=/get&fingerprint=false&getVersions=100&wt=javabin&version=2} status=0 QTime=1
[junit4] 2> 632899 INFO (qtp16450629-5384) [n:127.0.0.1:62483_solr c:collection1 s:shard1 x:collection1_shard1_replica1] o.a.s.c.SyncStrategy Leader's attempt to sync with shard failed, moving to the next candidate
[junit4] 2> 632899 INFO (qtp16450629-5384) [n:127.0.0.1:62483_solr c:collection1 s:shard1 x:collection1_shard1_replica1] o.a.s.c.ShardLeaderElectionContext We failed sync, but we have no versions - we can't sync in that case - we were active before, so become leader anyway
[junit4] 2> 632907 INFO (qtp16450629-5384) [n:127.0.0.1:62483_solr c:collection1 s:shard1 x:collection1_shard1_replica1] o.a.s.c.ShardLeaderElectionContext I am the new leader: http://127.0.0.1:62483/solr/collection1_shard1_replica1/ shard1
[junit4] 2> 633012 INFO (zkCallback-1018-thread-1-processing-n:127.0.0.1:62483_solr) [n:127.0.0.1:62483_solr ] o.a.s.c.c.ZkStateReader A cluster state change: [WatchedEvent state:SyncConnected type:NodeDataChanged path:/collections/collection1/state.json] for collection [collection1] has occurred - updating... (live nodes size: [2])
[junit4] 2> 633012 INFO (zkCallback-1017-thread-1-processing-n:127.0.0.1:62481_solr) [n:127.0.0.1:62481_solr ] o.a.s.c.c.ZkStateReader A cluster state change: [WatchedEvent state:SyncConnected type:NodeDataChanged path:/collections/collection1/state.json] for collection [collection1] has occurred - updating... (live nodes size: [2])
[junit4] 2> 633060 INFO (qtp16450629-5384) [n:127.0.0.1:62483_solr c:collection1 s:shard1 x:collection1_shard1_replica1] o.a.s.c.ZkController I am the leader, no recovery necessary
[junit4] 2> 633065 INFO (qtp16450629-5384) [n:127.0.0.1:62483_solr c:collection1 s:shard1 x:collection1_shard1_replica1] o.a.s.s.HttpSolrCall [admin] webapp=null path=/admin/cores params={qt=/admin/cores&collection.configName=config&newCollection=true&name=collection1_shard1_replica1&action=CREATE&numShards=2&collection=collection1&shard=shard1&wt=javabin&version=2} status=0 QTime=1995
[junit4] 2> 633168 INFO (zkCallback-1017-thread-1-processing-n:127.0.0.1:62481_solr) [n:127.0.0.1:62481_solr ] o.a.s.c.c.ZkStateReader A cluster state change: [WatchedEvent state:SyncConnected type:NodeDataChanged path:/collections/collection1/state.json] for collection [collection1] has occurred - updating... (live nodes size: [2])
[junit4] 2> 633168 INFO (zkCallback-1018-thread-2-processing-n:127.0.0.1:62483_solr) [n:127.0.0.1:62483_solr ] o.a.s.c.c.ZkStateReader A cluster state change: [WatchedEvent state:SyncConnected type:NodeDataChanged path:/collections/collection1/state.json] for collection [collection1] has occurred - updating... (live nodes size: [2])
[junit4] 2> 633397 INFO (qtp16450629-5388) [n:127.0.0.1:62483_solr c:collection1 s:shard2 x:collection1_shard2_replica1] o.a.s.s.HttpSolrCall [admin] webapp=null path=/admin/cores params={qt=/admin/cores&collection.configName=config&newCollection=true&name=collection1_shard2_replica1&action=CREATE&numShards=2&collection=collection1&shard=shard2&wt=javabin&version=2} status=0 QTime=2332
[junit4] 2> 633409 INFO (qtp12448699-5377) [n:127.0.0.1:62481_solr c:collection1 s:shard1 x:collection1_shard1_replica2] o.a.s.s.HttpSolrCall [admin] webapp=null path=/admin/cores params={qt=/admin/cores&collection.configName=config&newCollection=true&name=collection1_shard1_replica2&action=CREATE&numShards=2&collection=collection1&shard=shard1&wt=javabin&version=2} status=0 QTime=2344
[junit4] 2> 633414 INFO (qtp12448699-5379) [n:127.0.0.1:62481_solr ] o.a.s.h.a.CollectionsHandler Wait for new collection to be active for at most 30 seconds. Check all shard replicas
[junit4] 2> 633510 INFO (zkCallback-1017-thread-1-processing-n:127.0.0.1:62481_solr) [n:127.0.0.1:62481_solr ] o.a.s.c.c.ZkStateReader A cluster state change: [WatchedEvent state:SyncConnected type:NodeDataChanged path:/collections/collection1/state.json] for collection [collection1] has occurred - updating... (live nodes size: [2])
[junit4] 2> 633510 INFO (zkCallback-1018-thread-3-processing-n:127.0.0.1:62483_solr) [n:127.0.0.1:62483_solr ] o.a.s.c.c.ZkStateReader A cluster state change: [WatchedEvent state:SyncConnected type:NodeDataChanged path:/collections/collection1/state.json] for collection [collection1] has occurred - updating... (live nodes size: [2])
[junit4] 2> 634415 INFO (qtp12448699-5379) [n:127.0.0.1:62481_solr ] o.a.s.s.HttpSolrCall [admin] webapp=null path=/admin/collections params={replicationFactor=2&collection.configName=config&maxShardsPerNode=2&name=collection1&action=CREATE&numShards=2&wt=javabin&version=2} status=0 QTime=3463
[junit4] 2> 634415 INFO (SUITE-TestCloudRecovery-seed#[D27AB8772F76557A]-worker) [ ] o.a.s.c.AbstractDistribZkTestBase Wait for recoveries to finish - collection: collection1 failOnTimeout:true timeout (sec):30
[junit4] 2> 634416 INFO (SUITE-TestCloudRecovery-seed#[D27AB8772F76557A]-worker) [ ] o.a.s.c.AbstractDistribZkTestBase Recoveries finished - collection: collection1
[junit4] 2> 634436 INFO (TEST-TestCloudRecovery.leaderRecoverFromLogOnStartupTest-seed#[D27AB8772F76557A]) [ ] o.a.s.SolrTestCaseJ4 ###Starting leaderRecoverFromLogOnStartupTest
[junit4] 2> 634459 INFO (qtp16450629-5386) [n:127.0.0.1:62483_solr c:collection1 s:shard2 r:core_node2 x:collection1_shard2_replica1] o.a.s.u.p.LogUpdateProcessorFactory [collection1_shard2_replica1] webapp=/solr path=/update params={update.distrib=FROMLEADER&_version_=-1559252072495316992&distrib.from=http://127.0.0.1:62481/solr/collection1_shard2_replica2/&wt=javabin&version=2}{deleteByQuery=*:* (-1559252072495316992)} 0 11
[junit4] 2> 634461 INFO (qtp12448699-5394) [n:127.0.0.1:62481_solr c:collection1 s:shard1 r:core_node1 x:collection1_shard1_replica2] o.a.s.u.p.LogUpdateProcessorFactory [collection1_shard1_replica2] webapp=/solr path=/update params={update.distrib=FROMLEADER&_version_=-1559252072504754176&distrib.from=http://127.0.0.1:62483/solr/collection1_shard1_replica1/&wt=javabin&version=2}{deleteByQuery=*:* (-1559252072504754176)} 0 4
[junit4] 2> 634463 INFO (qtp16450629-5373) [n:127.0.0.1:62483_solr c:collection1 s:shard1 r:core_node4 x:collection1_shard1_replica1] o.a.s.u.p.LogUpdateProcessorFactory [collection1_shard1_replica1] webapp=/solr path=/update params={update.distrib=TOLEADER&distrib.from=http://127.0.0.1:62481/solr/collection1_shard2_replica2/&wt=javabin&version=2}{deleteByQuery=*:* (-1559252072504754176)} 0 16
[junit4] 2> 634464 INFO (qtp12448699-5395) [n:127.0.0.1:62481_solr c:collection1 s:shard2 r:core_node3 x:collection1_shard2_replica2] o.a.s.u.p.LogUpdateProcessorFactory [collection1_shard2_replica2] webapp=/solr path=/update params={wt=javabin&version=2}{deleteByQuery=*:* (-1559252072495316992)} 0 26
[junit4] 2> 634468 INFO (qtp16450629-5391) [n:127.0.0.1:62483_solr c:collection1 s:shard1 r:core_node4 x:collection1_shard1_replica1] o.a.s.u.DirectUpdateHandler2 start commit{,optimize=false,openSearcher=true,waitSearcher=true,expungeDeletes=false,softCommit=false,prepareCommit=false}
[junit4] 2> 634468 INFO (qtp16450629-5391) [n:127.0.0.1:62483_solr c:collection1 s:shard1 r:core_node4 x:collection1_shard1_replica1] o.a.s.u.DirectUpdateHandler2 No uncommitted changes. Skipping IW.commit.
[junit4] 2> 634469 INFO (qtp16450629-5391) [n:127.0.0.1:62483_solr c:collection1 s:shard1 r:core_node4 x:collection1_shard1_replica1] o.a.s.u.DirectUpdateHandler2 end_commit_flush
[junit4] 2> 634470 INFO (qtp12448699-5395) [n:127.0.0.1:62481_solr c:collection1 s:shard1 r:core_node1 x:collection1_shard1_replica2] o.a.s.u.DirectUpdateHandler2 start commit{,optimize=false,openSearcher=true,waitSearcher=true,expungeDeletes=false,softCommit=false,prepareCommit=false}
[junit4] 2> 634470 INFO (qtp12448699-5395) [n:127.0.0.1:62481_solr c:collection1 s:shard1 r:core_node1 x:collection1_shard1_replica2] o.a.s.u.DirectUpdateHandler2 No uncommitted changes. Skipping IW.commit.
[junit4] 2> 634472 INFO (qtp12448699-5395) [n:127.0.0.1:62481_solr c:collection1 s:shard1 r:core_node1 x:collection1_shard1_replica2] o.a.s.u.DirectUpdateHandler2 end_commit_flush
[junit4] 2> 634472 INFO (qtp12448699-5395) [n:127.0.0.1:62481_solr c:collection1 s:shard1 r:core_node1 x:collection1_shard1_replica2] o.a.s.u.p.LogUpdateProcessorFactory [collection1_shard1_replica2] webapp=/solr path=/update params={update.distrib=FROMLEADER&waitSearcher=true&openSearcher=true&commit=true&softCommit=false&distrib.from=http://127.0.0.1:62481/solr/collection1_shard2_replica2/&commit_end_point=true&wt=javabin&version=2&expungeDeletes=false}{commit=} 0 1
[junit4] 2> 634473 INFO (qtp16450629-5390) [n:127.0.0.1:62483_solr c:collection1 s:shard2 r:core_node2 x:collection1_shard2_replica1] o.a.s.u.DirectUpdateHandler2 start commit{,optimize=false,openSearcher=true,waitSearcher=true,expungeDeletes=false,softCommit=false,prepareCommit=false}
[junit4] 2> 634473 INFO (qtp16450629-5390) [n:127.0.0.1:62483_solr c:collection1 s:shard2 r:core_node2 x:collection1_shard2_replica1] o.a.s.u.DirectUpdateHandler2 No uncommitted changes. Skipping IW.commit.
[junit4] 2> 634473 INFO (qtp16450629-5390) [n:127.0.0.1:62483_solr c:collection1 s:shard2 r:core_node2 x:collection1_shard2_replica1] o.a.s.u.DirectUpdateHandler2 end_commit_flush
[junit4] 2> 634474 INFO (qtp12448699-5395) [n:127.0.0.1:62481_solr c:collection1 s:shard2 r:core_node3 x:collection1_shard2_replica2] o.a.s.u.DirectUpdateHandler2 start commit{,optimize=false,openSearcher=true,waitSearcher=true,expungeDeletes=false,softCommit=false,prepareCommit=false}
[junit4] 2> 634474 INFO (qtp12448699-5395) [n:127.0.0.1:62481_solr c:collection1 s:shard2 r:core_node3 x:collection1_shard2_replica2] o.a.s.u.DirectUpdateHandler2 No uncommitted changes. Skipping IW.commit.
[junit4] 2> 634475 INFO (qtp12448699-5395) [n:127.0.0.1:62481_solr c:collection1 s:shard2 r:core_node3 x:collection1_shard2_replica2] o.a.s.u.DirectUpdateHandler2 end_commit_flush
[junit4] 2> 634475 INFO (qtp16450629-5391) [n:127.0.0.1:62483_solr c:collection1 s:shard1 r:core_node4 x:collection1_shard1_replica1] o.a.s.u.p.LogUpdateProcessorFactory [collection1_shard1_replica1] webapp=/solr path=/update params={update.distrib=FROMLEADER&waitSearcher=true&openSearcher=true&commit=true&softCommit=false&distrib.from=http://127.0.0.1:62481/solr/collection1_shard2_replica2/&commit_end_point=true&wt=javabin&version=2&expungeDeletes=false}{commit=} 0 7
[junit4] 2> 634477 INFO (qtp12448699-5395) [n:127.0.0.1:62481_solr c:collection1 s:shard2 r:core_node3 x:collection1_shard2_replica2] o.a.s.u.p.LogUpdateProcessorFactory [collection1_shard2_replica2] webapp=/solr path=/update params={update.distrib=FROMLEADER&waitSearcher=true&openSearcher=true&commit=true&softCommit=false&distrib.from=http://127.0.0.1:62481/solr/collection1_shard2_replica2/&commit_end_point=true&wt=javabin&version=2&expungeDeletes=false}{commit=} 0 2
[junit4] 2> 634477 INFO (qtp16450629-5390) [n:127.0.0.1:62483_solr c:collection1 s:shard2 r:core_node2 x:collection1_shard2_replica1] o.a.s.u.p.LogUpdateProcessorFactory [collection1_shard2_replica1] webapp=/solr path=/update params={update.distrib=FROMLEADER&waitSearcher=true&openSearcher=true&commit=true&softCommit=false&distrib.from=http://127.0.0.1:62481/solr/collection1_shard2_replica2/&commit_end_point=true&wt=javabin&version=2&expungeDeletes=false}{commit=} 0 4
[junit4] 2> 634478 INFO (qtp12448699-5393) [n:127.0.0.1:62481_solr c:collection1 s:shard2 r:core_node3 x:collection1_shard2_replica2] o.a.s.u.p.LogUpdateProcessorFactory [collection1_shard2_replica2] webapp=/solr path=/update params={_stateVer_=collection1:6&waitSearcher=true&commit=true&softCommit=false&wt=javabin&version=2}{commit=} 0 11
[junit4] 2> 634495 INFO (qtp12448699-5374) [n:127.0.0.1:62481_solr c:collection1 s:shard1 r:core_node1 x:collection1_shard1_replica2] o.a.s.u.p.LogUpdateProcessorFactory [collection1_shard1_replica2] webapp=/solr path=/update params={update.distrib=FROMLEADER&distrib.from=http://127.0.0.1:62483/solr/collection1_shard1_replica1/&wt=javabin&version=2}{add=[1 (1559252072544600064)]} 0 3
[junit4] 2> 634497 INFO (qtp16450629-5392) [n:127.0.0.1:62483_solr c:collection1 s:shard1 r:core_node4 x:collection1_shard1_replica1] o.a.s.u.p.LogUpdateProcessorFactory [collection1_shard1_replica1] webapp=/solr path=/update params={wt=javabin&version=2}{add=[1 (1559252072544600064)]} 0 11
[junit4] 2> 634508 INFO (qtp16450629-5376) [n:127.0.0.1:62483_solr c:collection1 s:shard2 r:core_node2 x:collection1_shard2_replica1] o.a.s.u.p.LogUpdateProcessorFactory [collection1_shard2_replica1] webapp=/solr path=/update params={update.distrib=FROMLEADER&distrib.from=http://127.0.0.1:62481/solr/collection1_shard2_replica2/&wt=javabin&version=2}{add=[2 (1559252072559280128)]} 0 3
[junit4] 2> 634509 INFO (qtp12448699-5372) [n:127.0.0.1:62481_solr c:collection1 s:shard2 r:core_node3 x:collection1_shard2_replica2] o.a.s.u.p.LogUpdateProcessorFactory [collection1_shard2_replica2] webapp=/solr path=/update params={wt=javabin&version=2}{add=[2 (1559252072559280128)]} 0 10
[junit4] 2> 634512 INFO (qtp16450629-5384) [n:127.0.0.1:62483_solr c:collection1 s:shard2 r:core_node2 x:collection1_shard2_replica1] o.a.s.u.p.LogUpdateProcessorFactory [collection1_shard2_replica1] webapp=/solr path=/update params={update.distrib=FROMLEADER&distrib.from=http://127.0.0.1:62481/solr/collection1_shard2_replica2/&wt=javabin&version=2}{add=[3 (1559252072571863040)]} 0 1
[junit4] 2> 634512 INFO (qtp12448699-5377) [n:127.0.0.1:62481_solr c:collection1 s:shard2 r:core_node3 x:collection1_shard2_replica2] o.a.s.u.p.LogUpdateProcessorFactory [collection1_shard2_replica2] webapp=/solr path=/update params={wt=javabin&version=2}{add=[3 (1559252072571863040)]} 0 4
[junit4] 2> 634522 INFO (qtp12448699-5379) [n:127.0.0.1:62481_solr c:collection1 s:shard1 r:core_node1 x:collection1_shard1_replica2] o.a.s.u.p.LogUpdateProcessorFactory [collection1_shard1_replica2] webapp=/solr path=/update params={update.distrib=FROMLEADER&distrib.from=http://127.0.0.1:62483/solr/collection1_shard1_replica1/&wt=javabin&version=2}{add=[4 (1559252072579203072)]} 0 1
[junit4] 2> 634523 INFO (qtp16450629-5388) [n:127.0.0.1:62483_solr c:collection1 s:shard1 r:core_node4 x:collection1_shard1_replica1] o.a.s.u.p.LogUpdateProcessorFactory [collection1_shard1_replica1] webapp=/solr path=/update params={wt=javabin&version=2}{add=[4 (1559252072579203072)]} 0 5
[junit4] 2> 634534 INFO (qtp16450629-5386) [n:127.0.0.1:62483_solr c:collection1 s:shard2 r:core_node2 x:collection1_shard2_replica1] o.a.s.c.S.Request [collection1_shard2_replica1] webapp=/solr path=/select params={df=text&distrib=false&_stateVer_=collection1:6&fl=id&fl=score&shards.purpose=4&start=0&fsv=true&shard.url=http://127.0.0.1:62483/solr/collection1_shard2_replica1/|http://127.0.0.1:62481/solr/collection1_shard2_replica2/&rows=10&version=2&q=*:*&NOW=1487018654430&isShard=true&wt=javabin} hits=0 status=0 QTime=3
[junit4] 2> 634542 INFO (qtp12448699-5382) [n:127.0.0.1:62481_solr c:collection1 s:shard1 r:core_node1 x:collection1_shard1_replica2] o.a.s.c.S.Request [collection1_shard1_replica2] webapp=/solr path=/select params={df=text&distrib=false&_stateVer_=collection1:6&fl=id&fl=score&shards.purpose=4&start=0&fsv=true&shard.url=http://127.0.0.1:62481/solr/collection1_shard1_replica2/|http://127.0.0.1:62483/solr/collection1_shard1_replica1/&rows=10&version=2&q=*:*&NOW=1487018654430&isShard=true&wt=javabin} hits=0 status=0 QTime=1
[junit4] 2> 634544 INFO (qtp12448699-5394) [n:127.0.0.1:62481_solr c:collection1 s:shard1 r:core_node1 x:collection1_shard1_replica2] o.a.s.c.S.Request [collection1_shard1_replica2] webapp=/solr path=/select params={q=*:*&_stateVer_=collection1:6&wt=javabin&version=2} hits=0 status=0 QTime=18
[junit4] 2> 634545 INFO (TEST-TestCloudRecovery.leaderRecoverFromLogOnStartupTest-seed#[D27AB8772F76557A]) [ ] o.a.s.c.ChaosMonkey monkey: stop shard! 62481
[junit4] 2> 634545 INFO (TEST-TestCloudRecovery.leaderRecoverFromLogOnStartupTest-seed#[D27AB8772F76557A]) [ ] o.a.s.c.CoreContainer Shutting down CoreContainer instance=31403792
[junit4] 2> 634549 INFO (coreCloseExecutor-2201-thread-1) [n:127.0.0.1:62481_solr c:collection1 s:shard2 r:core_node3 x:collection1_shard2_replica2] o.a.s.c.SolrCore [collection1_shard2_replica2] CLOSING SolrCore org.apache.solr.core.SolrCore@d0a4e2
[junit4] 2> 634549 INFO (coreCloseExecutor-2201-thread-2) [n:127.0.0.1:62481_solr c:collection1 s:shard1 r:core_node1 x:collection1_shard1_replica2] o.a.s.c.SolrCore [collection1_shard1_replica2] CLOSING SolrCore org.apache.solr.core.SolrCore@10fddd9
[junit4] 2> 634564 INFO (coreCloseExecutor-2201-thread-2) [n:127.0.0.1:62481_solr c:collection1 s:shard1 r:core_node1 x:collection1_shard1_replica2] o.a.s.m.SolrMetricManager Closing metric reporters for: solr.core.collection1.shard1.replica2
[junit4] 2> 634566 INFO (coreCloseExecutor-2201-thread-1) [n:127.0.0.1:62481_solr c:collection1 s:shard2 r:core_node3 x:collection1_shard2_replica2] o.a.s.m.SolrMetricManager Closing metric reporters for: solr.core.collection1.shard2.replica2
[junit4] 2> 634570 WARN (NIOServerCxn.Factory:0.0.0.0/0.0.0.0:0) [ ] o.a.z.s.NIOServerCnxn caught end of stream exception
[junit4] 2> EndOfStreamException: Unable to read additional data from client sessionid 0x15a3937e9490006, likely client has closed socket
[junit4] 2> at org.apache.zookeeper.server.NIOServerCnxn.doIO(NIOServerCnxn.java:228)
[junit4] 2> at org.apache.zookeeper.server.NIOServerCnxnFactory.run(NIOServerCnxnFactory.java:208)
[junit4] 2> at java.lang.Thread.run(Thread.java:745)
[junit4] 2> 634571 INFO (TEST-TestCloudRecovery.leaderRecoverFromLogOnStartupTest-seed#[D27AB8772F76557A]) [ ] o.a.s.m.SolrMetricManager Closing metric reporters for: solr.node
[junit4] 2> 634574 INFO (TEST-TestCloudRecovery.leaderRecoverFromLogOnStartupTest-seed#[D27AB8772F76557A]) [ ] o.e.j.s.AbstractConnector Stopped ServerConnector@101c2b3{HTTP/1.1,[http/1.1]}{127.0.0.1:0}
[junit4] 2> 634577 INFO (TEST-TestCloudRecovery.leaderRecoverFromLogOnStartupTest-seed#[D27AB8772F76557A]) [ ] o.e.j.s.h.ContextHandler Stopped o.e.j.s.ServletContextHandler@ae6568{/solr,null,UNAVAILABLE}
[junit4] 2> 634578 INFO (zkCallback-1018-thread-2-processing-n:127.0.0.1:62483_solr) [n:127.0.0.1:62483_solr ] o.a.s.c.c.ZkStateReader Updated live nodes from ZooKeeper... (2) -> (1)
[junit4] 2> 634580 INFO (zkCallback-1024-thread-1) [ ] o.a.s.c.c.ZkStateReader Updated live nodes from ZooKeeper... (2) -> (1)
[junit4] 2> 634587 INFO (TEST-TestCloudRecovery.leaderRecoverFromLogOnStartupTest-seed#[D27AB8772F76557A]) [ ] o.a.s.c.ChaosMonkey monkey: stop shard! 62483
[junit4] 2> 634587 INFO (TEST-TestCloudRecovery.leaderRecoverFromLogOnStartupTest-seed#[D27AB8772F76557A]) [ ] o.a.s.c.CoreContainer Shutting down CoreContainer instance=31313587
[junit4] 2> 634593 INFO (zkCallback-1018-thread-3-processing-n:127.0.0.1:62483_solr) [n:127.0.0.1:62483_solr c:collection1 s:shard2 r:core_node2 x:collection1_shard2_replica1] o.a.s.c.ShardLeaderElectionContext I may be the new leader - try and sync
[junit4] 2> 634599 INFO (coreCloseExecutor-2203-thread-2) [n:127.0.0.1:62483_solr c:collection1 s:shard1 r:core_node4 x:collection1_shard1_replica1] o.a.s.c.SolrCore [collection1_shard1_replica1] CLOSING SolrCore org.apache.solr.core.SolrCore@f3b4aa
[junit4] 2> 634606 INFO (coreCloseExecutor-2203-thread-2) [n:127.0.0.1:62483_solr c:collection1 s:shard1 r:core_node4 x:collection1_shard1_replica1] o.a.s.m.SolrMetricManager Closing metric reporters for: solr.core.collection1.shard1.replica1
[junit4] 2> 634611 INFO (TEST-TestCloudRecovery.leaderRecoverFromLogOnStartupTest-seed#[D27AB8772F76557A]) [ ] o.a.s.c.Overseer Overseer (id=97453254241746949-127.0.0.1:62483_solr-n_0000000000) closing
[junit4] 2> 634613 INFO (OverseerStateUpdate-97453254241746949-127.0.0.1:62483_solr-n_0000000000) [n:127.0.0.1:62483_solr ] o.a.s.c.Overseer Overseer Loop exiting : 127.0.0.1:62483_solr
[junit4] 2> 634616 WARN (zkCallback-1018-thread-1-processing-n:127.0.0.1:62483_solr) [n:127.0.0.1:62483_solr ] o.a.s.c.c.ZkStateReader ZooKeeper watch triggered, but Solr cannot talk to ZK: [KeeperErrorCode = Session expired for /live_nodes]
[junit4] 2> 634620 INFO (zkCallback-1024-thread-1) [ ] o.a.s.c.c.ZkStateReader Updated live nodes from ZooKeeper... (1) -> (0)
[junit4] 2> 637093 WARN (zkCallback-1018-thread-3-processing-n:127.0.0.1:62483_solr) [n:127.0.0.1:62483_solr c:collection1 s:shard2 r:core_node2 x:collection1_shard2_replica1] o.a.s.c.SyncStrategy Closed, skipping sync up.
[junit4] 2> 637093 INFO (zkCallback-1018-thread-3-processing-n:127.0.0.1:62483_solr) [n:127.0.0.1:62483_solr c:collection1 s:shard2 r:core_node2 x:collection1_shard2_replica1] o.a.s.c.SolrCore [collection1_shard2_replica1] CLOSING SolrCore org.apache.solr.core.SolrCore@768c46
[junit4] 2> 637096 INFO (zkCallback-1018-thread-3-processing-n:127.0.0.1:62483_solr) [n:127.0.0.1:62483_solr c:collection1 s:shard2 r:core_node2 x:collection1_shard2_replica1] o.a.s.m.SolrMetricManager Closing metric reporters for: solr.core.collection1.shard2.replica1
[junit4] 2> 637098 INFO (TEST-TestCloudRecovery.leaderRecoverFromLogOnStartupTest-seed#[D27AB8772F76557A]) [ ] o.a.s.m.SolrMetricManager Closing metric reporters for: solr.node
[junit4] 2> 637099 INFO (TEST-TestCloudRecovery.leaderRecoverFromLogOnStartupTest-seed#[D27AB8772F76557A]) [ ] o.e.j.s.AbstractConnector Stopped ServerConnector@c91ef6{HTTP/1.1,[http/1.1]}{127.0.0.1:0}
[junit4] 2> 637099 INFO (TEST-TestCloudRecovery.leaderRecoverFromLogOnStartupTest-seed#[D27AB8772F76557A]) [ ] o.e.j.s.h.ContextHandler Stopped o.e.j.s.ServletContextHandler@2d237b{/solr,null,UNAVAILABLE}
[junit4] 2> 637102 INFO (TEST-TestCloudRecovery.leaderRecoverFromLogOnStartupTest-seed#[D27AB8772F76557A]) [ ] o.e.j.s.Server jetty-9.3.14.v20161028
[junit4] 2> 637105 INFO (TEST-TestCloudRecovery.leaderRecoverFromLogOnStartupTest-seed#[D27AB8772F76557A]) [ ] o.e.j.s.h.ContextHandler Started o.e.j.s.ServletContextHandler@1313959{/solr,null,AVAILABLE}
[junit4] 2> 637106 INFO (TEST-TestCloudRecovery.leaderRecoverFromLogOnStartupTest-seed#[D27AB8772F76557A]) [ ] o.e.j.s.AbstractConnector Started ServerConnector@1e88549{HTTP/1.1,[http/1.1]}{127.0.0.1:62481}
[junit4] 2> 637106 INFO (TEST-TestCloudRecovery.leaderRecoverFromLogOnStartupTest-seed#[D27AB8772F76557A]) [ ] o.e.j.s.Server Started @641050ms
[junit4] 2> 637106 INFO (TEST-TestCloudRecovery.leaderRecoverFromLogOnStartupTest-seed#[D27AB8772F76557A]) [ ] o.a.s.c.s.e.JettySolrRunner Jetty properties: {hostContext=/solr, hostPort=62481}
[junit4] 2> 637107 ERROR (TEST-TestCloudRecovery.leaderRecoverFromLogOnStartupTest-seed#[D27AB8772F76557A]) [ ] o.a.s.s.StartupLoggingUtils Missing Java Option solr.log.dir. Logging may be missing or incomplete.
[junit4] 2> 637107 INFO (TEST-TestCloudRecovery.leaderRecoverFromLogOnStartupTest-seed#[D27AB8772F76557A]) [ ] o.a.s.s.SolrDispatchFilter ___ _ Welcome to Apache Solr™ version 7.0.0
[junit4] 2> 637107 INFO (TEST-TestCloudRecovery.leaderRecoverFromLogOnStartupTest-seed#[D27AB8772F76557A]) [ ] o.a.s.s.SolrDispatchFilter / __| ___| |_ _ Starting in cloud mode on port null
[junit4] 2> 637107 INFO (TEST-TestCloudRecovery.leaderRecoverFromLogOnStartupTest-seed#[D27AB8772F76557A]) [ ] o.a.s.s.SolrDispatchFilter \__ \/ _ \ | '_| Install dir: null
[junit4] 2> 637107 INFO (TEST-TestCloudRecovery.leaderRecoverFromLogOnStartupTest-seed#[D27AB8772F76557A]) [ ] o.a.s.s.SolrDispatchFilter |___/\___/_|_| Start time: 2017-02-13T20:44:17.011Z
[junit4] 2> 637112 INFO (TEST-TestCloudRecovery.leaderRecoverFromLogOnStartupTest-seed#[D27AB8772F76557A]) [ ] o.a.s.s.SolrDispatchFilter solr.xml found in ZooKeeper. Loading...
[junit4] 2> 637137 INFO (TEST-TestCloudRecovery.leaderRecoverFromLogOnStartupTest-seed#[D27AB8772F76557A]) [ ] o.a.s.c.ZkContainer Zookeeper client=127.0.0.1:62475/solr
[junit4] 2> 637164 INFO (TEST-TestCloudRecovery.leaderRecoverFromLogOnStartupTest-seed#[D27AB8772F76557A]) [n:127.0.0.1:62481_solr ] o.a.s.c.Overseer Overseer (id=null) closing
[junit4] 2> 637168 INFO (TEST-TestCloudRecovery.leaderRecoverFromLogOnStartupTest-seed#[D27AB8772F76557A]) [n:127.0.0.1:62481_solr ] o.a.s.c.OverseerElectionContext I am going to be the leader 127.0.0.1:62481_solr
[junit4] 2> 637170 INFO (TEST-TestCloudRecovery.leaderRecoverFromLogOnStartupTest-seed#[D27AB8772F76557A]) [n:127.0.0.1:62481_solr ] o.a.s.c.Overseer Overseer (id=97453254241746955-127.0.0.1:62481_solr-n_0000000002) starting
[junit4] 2> 637182 INFO (TEST-TestCloudRecovery.leaderRecoverFromLogOnStartupTest-seed#[D27AB8772F76557A]) [n:127.0.0.1:62481_solr ] o.a.s.c.ZkController Register node as live in ZooKeeper:/live_nodes/127.0.0.1:62481_solr
[junit4] 2> 637186 INFO (OverseerStateUpdate-97453254241746955-127.0.0.1:62481_solr-n_0000000002) [n:127.0.0.1:62481_solr ] o.a.s.c.c.ZkStateReader Updated live nodes from ZooKeeper... (0) -> (1)
[junit4] 2> 637188 INFO (zkCallback-1024-thread-1) [ ] o.a.s.c.c.ZkStateReader Updated live nodes from ZooKeeper... (0) -> (1)
[junit4] 2> 637581 INFO (TEST-TestCloudRecovery.leaderRecoverFromLogOnStartupTest-seed#[D27AB8772F76557A]) [n:127.0.0.1:62481_solr ] o.a.s.c.CorePropertiesLocator Found 2 core definitions underneath C:\Users\jenkins\workspace\Lucene-Solr-master-Windows\solr\build\solr-core\test\J0\temp\solr.cloud.TestCloudRecovery_D27AB8772F76557A-001\tempDir-001\node2\.
[junit4] 2> 637581 INFO (TEST-TestCloudRecovery.leaderRecoverFromLogOnStartupTest-seed#[D27AB8772F76557A]) [n:127.0.0.1:62481_solr ] o.a.s.c.CorePropertiesLocator Cores are: [collection1_shard1_replica2, collection1_shard2_replica2]
[junit4] 2> 637640 INFO (coreLoadExecutor-2212-thread-1-processing-n:127.0.0.1:62481_solr) [n:127.0.0.1:62481_solr c:collection1 s:shard1 r:core_node1 x:collection1_shard1_replica2] o.a.s.c.SolrConfig Using Lucene MatchVersion: 7.0.0
[junit4] 2> 637648 INFO (coreLoadExecutor-2212-thread-2-processing-n:127.0.0.1:62481_solr) [n:127.0.0.1:62481_solr c:collection1 s:shard2 r:core_node3 x:collection1_shard2_replica2] o.a.s.c.SolrConfig Using Lucene MatchVersion: 7.0.0
[junit4] 2> 637655 INFO (coreLoadExecutor-2212-thread-1-processing-n:127.0.0.1:62481_solr) [n:127.0.0.1:62481_solr c:collection1 s:shard1 r:core_node1 x:collection1_shard1_replica2] o.a.s.s.IndexSchema [collection1_shard1_replica2] Schema name=minimal
[junit4] 2> 637664 INFO (coreLoadExecutor-2212-thread-2-processing-n:127.0.0.1:62481_solr) [n:127.0.0.1:62481_solr c:collection1 s:shard2 r:core_node3 x:collection1_shard2_replica2] o.a.s.s.IndexSchema [collection1_shard2_replica2] Schema name=minimal
[junit4] 2> 637665 INFO (coreLoadExecutor-2212-thread-1-processing-n:127.0.0.1:62481_solr) [n:127.0.0.1:62481_solr c:collection1 s:shard1 r:core_node1 x:collection1_shard1_replica2] o.a.s.s.IndexSchema Loaded schema minimal/1.1 with uniqueid field id
[junit4] 2> 637670 INFO (coreLoadExecutor-2212-thread-2-processing-n:127.0.0.1:62481_solr) [n:127.0.0.1:62481_solr c:collection1 s:shard2 r:core_node3 x:collection1_shard2_replica2] o.a.s.s.IndexSchema Loaded schema minimal/1.1 with uniqueid field id
[junit4] 2> 637672 INFO (coreLoadExecutor-2212-thread-1-processing-n:127.0.0.1:62481_solr) [n:127.0.0.1:62481_solr c:collection1 s:shard1 r:core_node1 x:collection1_shard1_replica2] o.a.s.c.CoreContainer Creating SolrCore 'collection1_shard1_replica2' using configuration from collection collection1
[junit4] 2> 637672 INFO (coreLoadExecutor-2212-thread-2-processing-n:127.0.0.1:62481_solr) [n:127.0.0.1:62481_solr c:collection1 s:shard2 r:core_node3 x:collection1_shard2_replica2] o.a.s.c.CoreContainer Creating SolrCore 'collection1_shard2_replica2' using configuration from collection collection1
[junit4] 2> 637672 INFO (coreLoadExecutor-2212-thread-1-processing-n:127.0.0.1:62481_solr) [n:127.0.0.1:62481_solr c:collection1 s:shard1 r:core_node1 x:collection1_shard1_replica2] o.a.s.c.SolrCore [[collection1_shard1_replica2] ] Opening new SolrCore at [C:\Users\jenkins\workspace\Lucene-Solr-master-Windows\solr\build\solr-core\test\J0\temp\solr.cloud.TestCloudRecovery_D27AB8772F76557A-001\tempDir-001\node2\collection1_shard1_replica2], dataDir=[C:\Users\jenkins\workspace\Lucene-Solr-master-Windows\solr\build\solr-core\test\J0\temp\solr.cloud.TestCloudRecovery_D27AB8772F76557A-001\tempDir-001\node2\.\collection1_shard1_replica2\data\]
[junit4] 2> 637673 INFO (coreLoadExecutor-2212-thread-2-processing-n:127.0.0.1:62481_solr) [n:127.0.0.1:62481_solr c:collection1 s:shard2 r:core_node3 x:collection1_shard2_replica2] o.a.s.c.SolrCore [[collection1_shard2_replica2] ] Opening new SolrCore at [C:\Users\jenkins\workspace\Lucene-Solr-master-Windows\solr\build\solr-core\test\J0\temp\solr.cloud.TestCloudRecovery_D27AB8772F76557A-001\tempDir-001\node2\collection1_shard2_replica2], dataDir=[C:\Users\jenkins\workspace\Lucene-Solr-master-Windows\solr\build\solr-core\test\J0\temp\solr.cloud.TestCloudRecovery_D27AB8772F76557A-001\tempDir-001\node2\.\collection1_shard2_replica2\data\]
[junit4] 2> 637727 INFO (zkCallback-1029-thread-1-processing-n:127.0.0.1:62481_solr) [n:127.0.0.1:62481_solr ] o.a.s.c.c.ZkStateReader A cluster state change: [WatchedEvent state:SyncConnected type:NodeDataChanged path:/collections/collection1/state.json] for collection [collection1] has occurred - updating... (live nodes size: [1])
[junit4] 2> 637843 INFO (coreLoadExecutor-2212-thread-2-processing-n:127.0.0.1:62481_solr) [n:127.0.0.1:62481_solr c:collection1 s:shard2 r:core_node3 x:collection1_shard2_replica2] o.a.s.u.UpdateHandler Using UpdateLog implementation: org.apache.solr.update.UpdateLog
[junit4] 2> 637843 INFO (coreLoadExecutor-2212-thread-2-processing-n:127.0.0.1:62481_solr) [n:127.0.0.1:62481_solr c:collection1 s:shard2 r:core_node3 x:collection1_shard2_replica2] o.a.s.u.UpdateLog Initializing UpdateLog: dataDir=null defaultSyncLevel=FLUSH numRecordsToKeep=100 maxNumLogsToKeep=10 numVersionBuckets=65536
[junit4] 2> 637843 INFO (coreLoadExecutor-2212-thread-1-processing-n:127.0.0.1:62481_solr) [n:127.0.0.1:62481_solr c:collection1 s:shard1 r:core_node1 x:collection1_shard1_replica2] o.a.s.u.UpdateHandler Using UpdateLog implementation: org.apache.solr.update.UpdateLog
[junit4] 2> 637844 INFO (coreLoadExecutor-2212-thread-1-processing-n:127.0.0.1:62481_solr) [n:127.0.0.1:62481_solr c:collection1 s:shard1 r:core_node1 x:collection1_shard1_replica2] o.a.s.u.UpdateLog Initializing UpdateLog: dataDir=null defaultSyncLevel=FLUSH numRecordsToKeep=100 maxNumLogsToKeep=10 numVersionBuckets=65536
[junit4] 2> 637847 INFO (coreLoadExecutor-2212-thread-2-processing-n:127.0.0.1:62481_solr) [n:127.0.0.1:62481_solr c:collection1 s:shard2 r:core_node3 x:collection1_shard2_replica2] o.a.s.u.CommitTracker Hard AutoCommit: disabled
[junit4] 2> 637847 INFO (coreLoadExecutor-2212-thread-2-processing-n:127.0.0.1:62481_solr) [n:127.0.0.1:62481_solr c:collection1 s:shard2 r:core_node3 x:collection1_shard2_replica2] o.a.s.u.CommitTracker Soft AutoCommit: disabled
[junit4] 2> 637847 INFO (coreLoadExecutor-2212-thread-1-processing-n:127.0.0.1:62481_solr) [n:127.0.0.1:62481_solr c:collection1 s:shard1 r:core_node1 x:collection1_shard1_replica2] o.a.s.u.CommitTracker Hard AutoCommit: disabled
[junit4] 2> 637847 INFO (coreLoadExecutor-2212-thread-1-processing-n:127.0.0.1:62481_solr) [n:127.0.0.1:62481_solr c:collection1 s:shard1 r:core_node1 x:collection1_shard1_replica2] o.a.s.u.CommitTracker Soft AutoCommit: disabled
[junit4] 2> 637854 INFO (coreLoadExecutor-2212-thread-1-processing-n:127.0.0.1:62481_solr) [n:127.0.0.1:62481_solr c:collection1 s:shard1 r:core_node1 x:collection1_shard1_replica2] o.a.s.s.SolrIndexSearcher Opening [Searcher@1b32475[collection1_shard1_replica2] main]
[junit4] 2> 637855 INFO (coreLoadExecutor-2212-thread-1-processing-n:127.0.0.1:62481_solr) [n:127.0.0.1:62481_solr c:collection1 s:shard1 r:core_node1 x:collection1_shard1_replica2] o.a.s.r.ManagedResourceStorage Configured ZooKeeperStorageIO with znodeBase: /configs/config
[junit4] 2> 637857 INFO (coreLoadExecutor-2212-thread-1-processing-n:127.0.0.1:62481_solr) [n:127.0.0.1:62481_solr c:collection1 s:shard1 r:core_node1 x:collection1_shard1_replica2] o.a.s.r.ManagedResourceStorage Loaded null at path _rest_managed.json using ZooKeeperStorageIO:path=/configs/config
[junit4] 2> 637857 INFO (coreLoadExecutor-2212-thread-1-processing-n:127.0.0.1:62481_solr) [n:127.0.0.1:62
[...truncated too long message...]
chers to be released
[junit4] 2> 3075483 INFO (SUITE-TestBulkSchemaAPI-seed#[D27AB8772F76557A]-worker) [ ] o.a.s.SolrTestCaseJ4 ------------------------------------------------------- Done waiting for tracked resources to be released
[junit4] 2> NOTE: test params are: codec=Asserting(Lucene70): {}, docValues:{}, maxPointsInLeafNode=560, maxMBSortInHeap=5.192037839233737, sim=RandomSimilarity(queryNorm=false): {}, locale=es-CL, timezone=Antarctica/Troll
[junit4] 2> NOTE: Windows 10 10.0 x86/Oracle Corporation 1.8.0_121 (32-bit)/cpus=3,threads=1,free=133506056,total=489684992
[junit4] 2> NOTE: All tests run in this JVM: [CoreMergeIndexesAdminHandlerTest, TestSchemaNameResource, IndexSchemaTest, TestTolerantUpdateProcessorCloud, TestSolrCoreSnapshots, TestUnifiedSolrHighlighter, DistributedDebugComponentTest, JavabinLoaderTest, NoCacheHeaderTest, ShufflingReplicaListTransformerTest, LeaderFailoverAfterPartitionTest, TestReversedWildcardFilterFactory, TestFieldCacheWithThreads, MultiThreadedOCPTest, SpatialRPTFieldTypeTest, RequestHandlersTest, TestApiFramework, TestWriterPerf, TestMiniSolrCloudClusterSSL, TestBlobHandler, TestDeleteCollectionOnDownNodes, TestFieldSortValues, OpenCloseCoreStressTest, DebugComponentTest, BasicFunctionalityTest, TestSolrQueryParser, DistributedFacetExistsSmallTest, TestDistribIDF, ZkStateWriterTest, DefaultValueUpdateProcessorTest, TestConfigsApi, SolrJmxReporterTest, TestSolrCloudWithDelegationTokens, TestDistributedStatsComponentCardinality, URLClassifyProcessorTest, TestFiltering, SegmentsInfoRequestHandlerTest, CSVRequestHandlerTest, TestSQLHandler, CustomCollectionTest, MinimalSchemaTest, TestOmitPositions, TestRecovery, TestSerializedLuceneMatchVersion, SolrInfoMBeanTest, LoggingHandlerTest, TestQueryUtils, TestAnalyzedSuggestions, TestShortCircuitedRequests, AnalyticsMergeStrategyTest, ResourceLoaderTest, BasicDistributedZk2Test, TestSubQueryTransformerDistrib, TestAuthenticationFramework, QueryParsingTest, FullHLLTest, TermVectorComponentDistributedTest, TestExceedMaxTermLength, TestCrossCoreJoin, BasicAuthIntegrationTest, TestLuceneMatchVersion, ConvertedLegacyTest, TestSolrIndexConfig, TestOrdValues, CollectionsAPIDistributedZkTest, SaslZkACLProviderTest, ActionThrottleTest, RAMDirectoryFactoryTest, TestStressRecovery, TestIntervalFaceting, TestSchemaSimilarityResource, TestJettySolrRunner, TestPHPSerializedResponseWriter, CursorMarkTest, MetricUtilsTest, TestTestInjection, CdcrReplicationDistributedZkTest, CachingDirectoryFactoryTest, HdfsLockFactoryTest, FieldAnalysisRequestHandlerTest, HdfsTlogReplayBufferedWhileIndexingTest, ZkSolrClientTest, TestFieldCache, UpdateRequestProcessorFactoryTest, TestNumericTerms32, ClusterStateTest, TestTrie, SolrCoreMetricManagerTest, SignatureUpdateProcessorFactoryTest, TestFieldCacheSanityChecker, WrapperMergePolicyFactoryTest, DistributedFacetPivotLongTailTest, TestConfigSetImmutable, TestBackupRepositoryFactory, TestDownShardTolerantSearch, TestSolrConfigHandler, TestHdfsCloudBackupRestore, TestJavabinTupleStreamParser, TestFuzzyAnalyzedSuggestions, TestFreeTextSuggestions, SimpleCollectionCreateDeleteTest, FileBasedSpellCheckerTest, TestAtomicUpdateErrorCases, TestFieldCacheSortRandom, TestPKIAuthenticationPlugin, DocValuesMissingTest, SpellPossibilityIteratorTest, TestCloudManagedSchema, TestIndexSearcher, DistributedTermsComponentTest, TestUtils, TestScoreJoinQPScore, DistanceFunctionTest, ConnectionManagerTest, ConcurrentDeleteAndCreateCollectionTest, TestSha256AuthenticationProvider, TestComplexPhraseQParserPlugin, TestFieldCollectionResource, AddSchemaFieldsUpdateProcessorFactoryTest, BitVectorTest, TestSSLRandomization, TestSearchPerf, FullSolrCloudDistribCmdsTest, TestSolrConfigHandlerCloud, TestCloudInspectUtil, TestCopyFieldCollectionResource, MetricsHandlerTest, OverseerStatusTest, TestUninvertingReader, SmileWriterTest, SpellCheckComponentTest, ClassificationUpdateProcessorTest, PreAnalyzedFieldTest, TestManagedSchema, StatsComponentTest, DeleteStatusTest, SuggesterTSTTest, TestPivotHelperCode, TestCodecSupport, TestStandardQParsers, AutoCommitTest, HdfsChaosMonkeySafeLeaderTest, TestSystemIdResolver, TestQueryWrapperFilter, TestClassicSimilarityFactory, TestSolrDeletionPolicy2, BigEndianAscendingWordDeserializerTest, InfixSuggestersTest, TestSearcherReuse, TestJmxMonitoredMap, ReturnFieldsTest, ParsingFieldUpdateProcessorsTest, SolrIndexMetricsTest, BasicZkTest, LukeRequestHandlerTest, TestTrieFacet, DirectoryFactoryTest, TestDynamicFieldCollectionResource, TestUseDocValuesAsStored, TestSolrQueryParserResource, TestNonDefinedSimilarityFactory, TestRTimerTree, AnalysisErrorHandlingTest, TestSolrQueryResponse, BaseCdcrDistributedZkTest, TestSchemaManager, TestFoldingMultitermQuery, TestGeoJSONResponseWriter, TestInitQParser, ChaosMonkeySafeLeaderTest, UnloadDistributedZkTest, OverseerTest, ShardRoutingTest, LeaderElectionTest, TestHashPartitioner, ZkControllerTest, TestRealTimeGet, TestJoin, HardAutoCommitTest, TestRangeQuery, ShowFileRequestHandlerTest, CurrencyFieldOpenExchangeTest, TestCoreDiscovery, SuggesterFSTTest, DocValuesTest, DirectUpdateHandlerOptimizeTest, TestSolrDeletionPolicy1, CacheHeaderTest, StandardRequestHandlerTest, TestQueryTypes, TestValueSourceCache, TestIndexingPerformance, RegexBoostProcessorTest, JsonLoaderTest, PingRequestHandlerTest, HighlighterConfigTest, UpdateParamsTest, SolrIndexConfigTest, MultiTermTest, SampleTest, TestDocSet, TestBinaryField, ExternalFileFieldSortTest, NotRequiredUniqueKeyTest, TestCharFilters, TestSweetSpotSimilarityFactory, TestLMDirichletSimilarityFactory, TestFastWriter, ScriptEngineTest, TestSuggestSpellingConverter, DateFieldTest, TestSolrJ, ZkNodePropsTest, UUIDFieldTest, CircularListTest, CursorPagingTest, TestCursorMarkWithoutUniqueKey, TestDistributedMissingSort, TestPathTrie, TestEmbeddedSolrServerConstructors, AssignTest, AsyncCallRequestStatusResponseTest, CdcrReplicationHandlerTest, CdcrRequestHandlerTest, CdcrVersionReplicationTest, CloudExitableDirectoryReaderTest, CollectionReloadTest, CollectionTooManyReplicasTest, CollectionsAPISolrJTest, DeleteShardTest, DistribCursorPagingTest, DistribJoinFromCollectionTest, DistributedQueueTest, DocValuesNotIndexedTest, ForceLeaderTest, LeaderFailureAfterFreshStartTest, MigrateRouteKeyTest, OutOfBoxZkACLAndCredentialsProvidersTest, OverriddenZkACLAndCredentialsProvidersTest, OverseerModifyCollectionTest, OverseerRolesTest, RemoteQueryErrorTest, ReplaceNodeTest, ReplicationFactorTest, RollingRestartTest, SolrXmlInZkTest, TestCloudDeleteByQuery, TestCloudPseudoReturnFields, TestClusterProperties, TestConfigSetsAPI, TestExclusionRuleCollectionAccess, TestLeaderElectionWithEmptyReplica, TestLeaderInitiatedRecoveryThread, TestOnReconnectListenerSupport, TestRandomFlRTGCloud, TestRandomRequestDistribution, TestRequestForwarding, TestRequestStatusCollectionAPI, TestSolrCloudWithSecureImpersonation, TestStressInPlaceUpdates, TestDynamicLoading, RequestLoggingTest, TestConfigReload, TestSQLHandlerNonCloud, TestSolrConfigHandlerConcurrent, CoreAdminCreateDiscoverTest, CoreAdminRequestStatusTest, TestCollectionAPIs, DistributedExpandComponentTest, DistributedFacetPivotSmallTest, DistributedSuggestComponentTest, SuggestComponentContextFilterQueryTest, SuggestComponentTest, TestExpandComponent, HighlighterMaxOffsetTest, TestSlowCompositeReaderWrapper, CheckHdfsIndexTest, SolrMetricReporterTest, SolrGangliaReporterTest, SolrSlf4jReporterTest, SubstringBytesRefFilterTest, TestMacros, TestBinaryResponseWriter, TestExportWriter, TestPushWriter, TestRawResponseWriter, TestChildDocTransformer, TestManagedResourceStorage, TestBulkSchemaAPI]
[junit4] 2> NOTE: reproduce with: ant test -Dtestcase=TestBulkSchemaAPI -Dtests.seed=D27AB8772F76557A -Dtests.slow=true -Dtests.locale=es-CL -Dtests.timezone=Antarctica/Troll -Dtests.asserts=true -Dtests.file.encoding=UTF-8
[junit4] ERROR 0.00s J1 | TestBulkSchemaAPI (suite) <<<
[junit4] > Throwable #1: java.io.IOException: Could not remove the following files (in the order of attempts):
[junit4] > C:\Users\jenkins\workspace\Lucene-Solr-master-Windows\solr\build\solr-core\test\J1\temp\solr.rest.schema.TestBulkSchemaAPI_D27AB8772F76557A-001\tempDir-024\cores\core\data: java.nio.file.DirectoryNotEmptyException: C:\Users\jenkins\workspace\Lucene-Solr-master-Windows\solr\build\solr-core\test\J1\temp\solr.rest.schema.TestBulkSchemaAPI_D27AB8772F76557A-001\tempDir-024\cores\core\data
[junit4] > C:\Users\jenkins\workspace\Lucene-Solr-master-Windows\solr\build\solr-core\test\J1\temp\solr.rest.schema.TestBulkSchemaAPI_D27AB8772F76557A-001\tempDir-024\cores\core: java.nio.file.DirectoryNotEmptyException: C:\Users\jenkins\workspace\Lucene-Solr-master-Windows\solr\build\solr-core\test\J1\temp\solr.rest.schema.TestBulkSchemaAPI_D27AB8772F76557A-001\tempDir-024\cores\core
[junit4] > C:\Users\jenkins\workspace\Lucene-Solr-master-Windows\solr\build\solr-core\test\J1\temp\solr.rest.schema.TestBulkSchemaAPI_D27AB8772F76557A-001\tempDir-024\cores: java.nio.file.DirectoryNotEmptyException: C:\Users\jenkins\workspace\Lucene-Solr-master-Windows\solr\build\solr-core\test\J1\temp\solr.rest.schema.TestBulkSchemaAPI_D27AB8772F76557A-001\tempDir-024\cores
[junit4] > C:\Users\jenkins\workspace\Lucene-Solr-master-Windows\solr\build\solr-core\test\J1\temp\solr.rest.schema.TestBulkSchemaAPI_D27AB8772F76557A-001\tempDir-024: java.nio.file.DirectoryNotEmptyException: C:\Users\jenkins\workspace\Lucene-Solr-master-Windows\solr\build\solr-core\test\J1\temp\solr.rest.schema.TestBulkSchemaAPI_D27AB8772F76557A-001\tempDir-024
[junit4] > at __randomizedtesting.SeedInfo.seed([D27AB8772F76557A]:0)
[junit4] > at org.apache.lucene.util.IOUtils.rm(IOUtils.java:323)
[junit4] > at java.lang.Thread.run(Thread.java:745)
[junit4] Completed [621/694 (2!)] on J1 in 21.43s, 8 tests, 1 error <<< FAILURES!
[...truncated 54995 lines...]