You are viewing a plain text version of this content. The canonical link for it is here.
Posted to commits@activemq.apache.org by Apache Jenkins Server <je...@builds.apache.org> on 2011/06/13 04:15:23 UTC

Build failed in Jenkins: ActiveMQ-Apollo #332

See <https://builds.apache.org/job/ActiveMQ-Apollo/332/>

------------------------------------------
[...truncated 3802 lines...]
Downloading: http://repo.fusesource.com/nexus/content/groups/public/org/apache/maven/doxia/doxia-module-fml/1.0-alpha-11/doxia-module-fml-1.0-alpha-11.jar
Downloading: http://repo.fusesource.com/nexus/content/groups/public/org/apache/maven/doxia/doxia-module-xdoc/1.0-alpha-11/doxia-module-xdoc-1.0-alpha-11.jar
Downloading: http://repo.fusesource.com/nexus/content/groups/public/org/apache/maven/doxia/doxia-module-xhtml/1.0-alpha-11/doxia-module-xhtml-1.0-alpha-11.jar
Downloading: http://repo.fusesource.com/nexus/content/groups/public/commons-lang/commons-lang/2.1/commons-lang-2.1.jar
Downloaded: http://repo.fusesource.com/nexus/content/groups/public/oro/oro/2.0.8/oro-2.0.8.jar (64 KB at 35.0 KB/sec)
Downloading: http://repo.fusesource.com/nexus/content/groups/public/org/codehaus/plexus/plexus-archiver/1.0-alpha-9/plexus-archiver-1.0-alpha-9.jar
Downloaded: http://repo.fusesource.com/nexus/content/groups/public/commons-collections/commons-collections/3.2/commons-collections-3.2.jar (558 KB at 263.0 KB/sec)
Downloading: http://repo.fusesource.com/nexus/content/groups/public/org/codehaus/plexus/plexus-io/1.0-alpha-1/plexus-io-1.0-alpha-1.jar
Downloading: http://repo.fusesource.com/nexus/content/groups/public/org/codehaus/plexus/plexus-utils/1.5.6/plexus-utils-1.5.6.jar
Downloaded: http://repo.fusesource.com/nexus/content/groups/public/commons-lang/commons-lang/2.1/commons-lang-2.1.jar (203 KB at 118.1 KB/sec)
Downloading: http://scala-tools.org/repo-releases/org/apache/maven/maven-archiver/2.3/maven-archiver-2.3.jar
Downloading: http://scala-tools.org/repo-releases/org/apache/maven/doxia/doxia-sink-api/1.0-alpha-11/doxia-sink-api-1.0-alpha-11.jar
Downloading: http://scala-tools.org/repo-releases/org/apache/maven/doxia/doxia-site-renderer/1.0-alpha-11/doxia-site-renderer-1.0-alpha-11.jar
Downloading: http://scala-tools.org/repo-releases/org/apache/maven/doxia/doxia-core/1.0-alpha-11/doxia-core-1.0-alpha-11.jar
Downloading: http://scala-tools.org/repo-releases/org/codehaus/plexus/plexus-velocity/1.1.7/plexus-velocity-1.1.7.jar
Downloading: http://scala-tools.org/repo-releases/org/apache/velocity/velocity/1.5/velocity-1.5.jar
Downloading: http://scala-tools.org/repo-releases/org/apache/maven/doxia/doxia-decoration-model/1.0-alpha-11/doxia-decoration-model-1.0-alpha-11.jar
Downloading: http://scala-tools.org/repo-releases/org/apache/maven/doxia/doxia-module-apt/1.0-alpha-11/doxia-module-apt-1.0-alpha-11.jar
Downloading: http://scala-tools.org/repo-releases/org/apache/maven/doxia/doxia-module-fml/1.0-alpha-11/doxia-module-fml-1.0-alpha-11.jar
Downloading: http://scala-tools.org/repo-releases/org/apache/maven/doxia/doxia-module-xdoc/1.0-alpha-11/doxia-module-xdoc-1.0-alpha-11.jar
Downloading: http://scala-tools.org/repo-releases/org/apache/maven/doxia/doxia-module-xhtml/1.0-alpha-11/doxia-module-xhtml-1.0-alpha-11.jar
Downloading: http://scala-tools.org/repo-releases/org/codehaus/plexus/plexus-archiver/1.0-alpha-9/plexus-archiver-1.0-alpha-9.jar
Downloading: http://scala-tools.org/repo-releases/org/codehaus/plexus/plexus-io/1.0-alpha-1/plexus-io-1.0-alpha-1.jar
Downloading: http://scala-tools.org/repo-releases/org/codehaus/plexus/plexus-utils/1.5.6/plexus-utils-1.5.6.jar
Downloading: http://download.java.net/maven/2/org/apache/maven/maven-archiver/2.3/maven-archiver-2.3.jar
Downloading: http://download.java.net/maven/2/org/apache/maven/doxia/doxia-sink-api/1.0-alpha-11/doxia-sink-api-1.0-alpha-11.jar
Downloading: http://download.java.net/maven/2/org/apache/maven/doxia/doxia-site-renderer/1.0-alpha-11/doxia-site-renderer-1.0-alpha-11.jar
Downloading: http://download.java.net/maven/2/org/apache/maven/doxia/doxia-core/1.0-alpha-11/doxia-core-1.0-alpha-11.jar
Downloading: http://download.java.net/maven/2/org/codehaus/plexus/plexus-velocity/1.1.7/plexus-velocity-1.1.7.jar
Downloading: http://download.java.net/maven/2/org/apache/velocity/velocity/1.5/velocity-1.5.jar
Downloading: http://download.java.net/maven/2/org/apache/maven/doxia/doxia-decoration-model/1.0-alpha-11/doxia-decoration-model-1.0-alpha-11.jar
Downloading: http://download.java.net/maven/2/org/apache/maven/doxia/doxia-module-apt/1.0-alpha-11/doxia-module-apt-1.0-alpha-11.jar
Downloading: http://download.java.net/maven/2/org/apache/maven/doxia/doxia-module-fml/1.0-alpha-11/doxia-module-fml-1.0-alpha-11.jar
Downloading: http://download.java.net/maven/2/org/apache/maven/doxia/doxia-module-xdoc/1.0-alpha-11/doxia-module-xdoc-1.0-alpha-11.jar
Downloading: http://download.java.net/maven/2/org/apache/maven/doxia/doxia-module-xhtml/1.0-alpha-11/doxia-module-xhtml-1.0-alpha-11.jar
Downloading: http://download.java.net/maven/2/org/codehaus/plexus/plexus-archiver/1.0-alpha-9/plexus-archiver-1.0-alpha-9.jar
Downloading: http://download.java.net/maven/2/org/codehaus/plexus/plexus-io/1.0-alpha-1/plexus-io-1.0-alpha-1.jar
Downloading: http://download.java.net/maven/2/org/codehaus/plexus/plexus-utils/1.5.6/plexus-utils-1.5.6.jar
Downloading: http://repo1.maven.org/maven2/org/apache/maven/maven-archiver/2.3/maven-archiver-2.3.jar
Downloading: http://repo1.maven.org/maven2/org/apache/maven/doxia/doxia-sink-api/1.0-alpha-11/doxia-sink-api-1.0-alpha-11.jar
Downloading: http://repo1.maven.org/maven2/org/apache/maven/doxia/doxia-site-renderer/1.0-alpha-11/doxia-site-renderer-1.0-alpha-11.jar
Downloading: http://repo1.maven.org/maven2/org/apache/maven/doxia/doxia-core/1.0-alpha-11/doxia-core-1.0-alpha-11.jar
Downloading: http://repo1.maven.org/maven2/org/codehaus/plexus/plexus-velocity/1.1.7/plexus-velocity-1.1.7.jar
Downloaded: http://repo1.maven.org/maven2/org/apache/maven/maven-archiver/2.3/maven-archiver-2.3.jar (18 KB at 13.3 KB/sec)
Downloading: http://repo1.maven.org/maven2/org/apache/velocity/velocity/1.5/velocity-1.5.jar
Downloaded: http://repo1.maven.org/maven2/org/apache/maven/doxia/doxia-site-renderer/1.0-alpha-11/doxia-site-renderer-1.0-alpha-11.jar (45 KB at 29.0 KB/sec)
Downloading: http://repo1.maven.org/maven2/org/apache/maven/doxia/doxia-decoration-model/1.0-alpha-11/doxia-decoration-model-1.0-alpha-11.jar
Downloaded: http://repo1.maven.org/maven2/org/apache/maven/doxia/doxia-sink-api/1.0-alpha-11/doxia-sink-api-1.0-alpha-11.jar (10 KB at 5.3 KB/sec)
Downloading: http://repo1.maven.org/maven2/org/apache/maven/doxia/doxia-module-apt/1.0-alpha-11/doxia-module-apt-1.0-alpha-11.jar
Downloaded: http://repo1.maven.org/maven2/org/apache/maven/doxia/doxia-core/1.0-alpha-11/doxia-core-1.0-alpha-11.jar (54 KB at 26.1 KB/sec)
Downloading: http://repo1.maven.org/maven2/org/apache/maven/doxia/doxia-module-fml/1.0-alpha-11/doxia-module-fml-1.0-alpha-11.jar
Downloaded: http://repo1.maven.org/maven2/org/codehaus/plexus/plexus-velocity/1.1.7/plexus-velocity-1.1.7.jar (8 KB at 3.3 KB/sec)
Downloading: http://repo1.maven.org/maven2/org/apache/maven/doxia/doxia-module-xdoc/1.0-alpha-11/doxia-module-xdoc-1.0-alpha-11.jar
Downloaded: http://repo1.maven.org/maven2/org/apache/velocity/velocity/1.5/velocity-1.5.jar (383 KB at 153.2 KB/sec)
Downloading: http://repo1.maven.org/maven2/org/apache/maven/doxia/doxia-module-xhtml/1.0-alpha-11/doxia-module-xhtml-1.0-alpha-11.jar
Downloaded: http://repo1.maven.org/maven2/org/apache/maven/doxia/doxia-decoration-model/1.0-alpha-11/doxia-decoration-model-1.0-alpha-11.jar (49 KB at 19.4 KB/sec)
Downloading: http://repo1.maven.org/maven2/org/codehaus/plexus/plexus-archiver/1.0-alpha-9/plexus-archiver-1.0-alpha-9.jar
Downloaded: http://repo1.maven.org/maven2/org/apache/maven/doxia/doxia-module-apt/1.0-alpha-11/doxia-module-apt-1.0-alpha-11.jar (46 KB at 18.3 KB/sec)
Downloading: http://repo1.maven.org/maven2/org/codehaus/plexus/plexus-io/1.0-alpha-1/plexus-io-1.0-alpha-1.jar
Downloaded: http://repo1.maven.org/maven2/org/apache/maven/doxia/doxia-module-fml/1.0-alpha-11/doxia-module-fml-1.0-alpha-11.jar (18 KB at 7.1 KB/sec)
Downloading: http://repo1.maven.org/maven2/org/codehaus/plexus/plexus-utils/1.5.6/plexus-utils-1.5.6.jar
Downloaded: http://repo1.maven.org/maven2/org/apache/maven/doxia/doxia-module-xdoc/1.0-alpha-11/doxia-module-xdoc-1.0-alpha-11.jar (27 KB at 10.7 KB/sec)
Downloaded: http://repo1.maven.org/maven2/org/apache/maven/doxia/doxia-module-xhtml/1.0-alpha-11/doxia-module-xhtml-1.0-alpha-11.jar (21 KB at 9.3 KB/sec)
Downloaded: http://repo1.maven.org/maven2/org/codehaus/plexus/plexus-archiver/1.0-alpha-9/plexus-archiver-1.0-alpha-9.jar (154 KB at 68.4 KB/sec)
Downloaded: http://repo1.maven.org/maven2/org/codehaus/plexus/plexus-io/1.0-alpha-1/plexus-io-1.0-alpha-1.jar (12 KB at 5.3 KB/sec)
Downloaded: http://repo1.maven.org/maven2/org/codehaus/plexus/plexus-utils/1.5.6/plexus-utils-1.5.6.jar (245 KB at 108.8 KB/sec)
[INFO] Not executing Javadoc as the project is not a Java classpath-capable package
[INFO] 
[INFO] --- maven-jar-plugin:2.3.1:jar (scaladoc) @ apollo-project ---
[WARNING] JAR will be empty - no content was marked for inclusion!
[INFO] Building jar: <https://builds.apache.org/job/ActiveMQ-Apollo/ws/trunk/target/apollo-project-1.0-SNAPSHOT-scaladoc.jar>
[INFO] 
[INFO] --- maven-gpg-plugin:1.1:sign (default) @ apollo-project ---
gpg: directory `/home/hudson/.gnupg' created
gpg: new configuration file `/home/hudson/.gnupg/gpg.conf' created
gpg: WARNING: options in `/home/hudson/.gnupg/gpg.conf' are not yet active during this run
gpg: keyring `/home/hudson/.gnupg/secring.gpg' created
gpg: keyring `/home/hudson/.gnupg/pubring.gpg' created
gpg: no default secret key: secret key not available
gpg: signing failed: secret key not available
mojoFailed org.apache.maven.plugins:maven-gpg-plugin:1.1(default)
projectFailed org.apache.activemq:apollo-project:1.0-SNAPSHOT
[JENKINS] Archiving <https://builds.apache.org/job/ActiveMQ-Apollo/ws/trunk/target/apollo-project-1.0-SNAPSHOT-scaladoc.jar> to /home/hudson/hudson/jobs/ActiveMQ-Apollo/modules/org.apache.activemq$apollo-project/builds/2011-06-13_02-05-27/archive/org.apache.activemq/apollo-project/1.0-SNAPSHOT/apollo-project-1.0-SNAPSHOT-scaladoc.jar
projectSkipped org.apache.activemq:apollo-boot:1.0-SNAPSHOT
[INFO]                                                                         
[INFO] ------------------------------------------------------------------------
[INFO] Skipping apollo-boot
[INFO] This project has been banned from the build due to previous failures.
[INFO] ------------------------------------------------------------------------
projectSkipped org.apache.activemq:apollo-scala:1.0-SNAPSHOT
[INFO]                                                                         
[INFO] ------------------------------------------------------------------------
[INFO] Skipping apollo-scala
[INFO] This project has been banned from the build due to previous failures.
[INFO] ------------------------------------------------------------------------
projectSkipped org.apache.activemq:apollo-util:1.0-SNAPSHOT
[INFO]                                                                         
[INFO] ------------------------------------------------------------------------
[INFO] Skipping apollo-util
[INFO] This project has been banned from the build due to previous failures.
[INFO] ------------------------------------------------------------------------
projectSkipped org.apache.activemq:apollo-transport:1.0-SNAPSHOT
[INFO]                                                                         
[INFO] ------------------------------------------------------------------------
[INFO] Skipping apollo-transport
[INFO] This project has been banned from the build due to previous failures.
[INFO] ------------------------------------------------------------------------
projectSkipped org.apache.activemq:apollo-dto:1.0-SNAPSHOT
[INFO]                                                                         
[INFO] ------------------------------------------------------------------------
[INFO] Skipping apollo-dto
[INFO] This project has been banned from the build due to previous failures.
[INFO] ------------------------------------------------------------------------
projectSkipped org.apache.activemq:apollo-selector:1.0-SNAPSHOT
[INFO]                                                                         
[INFO] ------------------------------------------------------------------------
[INFO] Skipping apollo-selector
[INFO] This project has been banned from the build due to previous failures.
[INFO] ------------------------------------------------------------------------
projectSkipped org.apache.activemq:apollo-broker:1.0-SNAPSHOT
[INFO]                                                                         
[INFO] ------------------------------------------------------------------------
[INFO] Skipping apollo-broker
[INFO] This project has been banned from the build due to previous failures.
[INFO] ------------------------------------------------------------------------
projectSkipped org.apache.activemq:apollo-tcp:1.0-SNAPSHOT
[INFO]                                                                         
[INFO] ------------------------------------------------------------------------
[INFO] Skipping apollo-tcp
[INFO] This project has been banned from the build due to previous failures.
[INFO] ------------------------------------------------------------------------
projectSkipped org.apache.activemq:apollo-web:1.0-SNAPSHOT
[INFO]                                                                         
[INFO] ------------------------------------------------------------------------
[INFO] Skipping apollo-web
[INFO] This project has been banned from the build due to previous failures.
[INFO] ------------------------------------------------------------------------
projectSkipped org.apache.activemq:apollo-bdb:1.0-SNAPSHOT
[INFO]                                                                         
[INFO] ------------------------------------------------------------------------
[INFO] Skipping apollo-bdb
[INFO] This project has been banned from the build due to previous failures.
[INFO] ------------------------------------------------------------------------
projectSkipped org.apache.activemq:apollo-jdbm2:1.0-SNAPSHOT
[INFO]                                                                         
[INFO] ------------------------------------------------------------------------
[INFO] Skipping apollo-jdbm2
[INFO] This project has been banned from the build due to previous failures.
[INFO] ------------------------------------------------------------------------
projectSkipped org.apache.activemq:apollo-stomp:1.0-SNAPSHOT
[INFO]                                                                         
[INFO] ------------------------------------------------------------------------
[INFO] Skipping apollo-stomp
[INFO] This project has been banned from the build due to previous failures.
[INFO] ------------------------------------------------------------------------
projectSkipped org.apache.activemq:apollo-cli:1.0-SNAPSHOT
[INFO]                                                                         
[INFO] ------------------------------------------------------------------------
[INFO] Skipping apollo-cli
[INFO] This project has been banned from the build due to previous failures.
[INFO] ------------------------------------------------------------------------
projectSkipped org.apache.activemq:apollo-website:1.0-SNAPSHOT
[INFO]                                                                         
[INFO] ------------------------------------------------------------------------
[INFO] Skipping apollo-website
[INFO] This project has been banned from the build due to previous failures.
[INFO] ------------------------------------------------------------------------
projectSkipped org.apache.activemq:apache-apollo:1.0-SNAPSHOT
[INFO]                                                                         
[INFO] ------------------------------------------------------------------------
[INFO] Skipping apache-apollo
[INFO] This project has been banned from the build due to previous failures.
[INFO] ------------------------------------------------------------------------
projectSkipped org.apache.activemq:apollo-karaf-feature:1.0-SNAPSHOT
[INFO]                                                                         
[INFO] ------------------------------------------------------------------------
[INFO] Skipping apollo-karaf-feature
[INFO] This project has been banned from the build due to previous failures.
[INFO] ------------------------------------------------------------------------
sessionEnded
[INFO] ------------------------------------------------------------------------
[INFO] Reactor Summary:
[INFO] 
[INFO] Apache ActiveMQ Apollo Project .................... FAILURE [7:21.187s]
[INFO] apollo-boot ....................................... SKIPPED
[INFO] apollo-scala ...................................... SKIPPED
[INFO] apollo-util ....................................... SKIPPED
[INFO] apollo-transport .................................. SKIPPED
[INFO] apollo-dto ........................................ SKIPPED
[INFO] apollo-selector ................................... SKIPPED
[INFO] apollo-broker ..................................... SKIPPED
[INFO] apollo-tcp ........................................ SKIPPED
[INFO] apollo-web ........................................ SKIPPED
[INFO] apollo-bdb ........................................ SKIPPED
[INFO] apollo-jdbm2 ...................................... SKIPPED
[INFO] apollo-stomp ...................................... SKIPPED
[INFO] apollo-cli ........................................ SKIPPED
[INFO] apollo-website .................................... SKIPPED
[INFO] apache-apollo ..................................... SKIPPED
[INFO] apollo-karaf-feature .............................. SKIPPED
[INFO] ------------------------------------------------------------------------
[INFO] BUILD FAILURE
[INFO] ------------------------------------------------------------------------
[INFO] Total time: 9:43.242s
[INFO] Finished at: Mon Jun 13 02:15:22 UTC 2011
[INFO] Final Memory: 26M/1245M
[INFO] ------------------------------------------------------------------------
maven builder waiting
mavenExecutionResult exceptions not empty
message : Failed to execute goal org.apache.maven.plugins:maven-gpg-plugin:1.1:sign (default) on project apollo-project: Exit code: 2
cause : Exit code: 2
Stack trace : 
org.apache.maven.lifecycle.LifecycleExecutionException: Failed to execute goal org.apache.maven.plugins:maven-gpg-plugin:1.1:sign (default) on project apollo-project: Exit code: 2
	at org.apache.maven.lifecycle.internal.MojoExecutor.execute(MojoExecutor.java:217)
	at org.apache.maven.lifecycle.internal.MojoExecutor.execute(MojoExecutor.java:153)
	at org.apache.maven.lifecycle.internal.MojoExecutor.execute(MojoExecutor.java:145)
	at org.apache.maven.lifecycle.internal.LifecycleModuleBuilder.buildProject(LifecycleModuleBuilder.java:84)
	at org.apache.maven.lifecycle.internal.LifecycleModuleBuilder.buildProject(LifecycleModuleBuilder.java:59)
	at org.apache.maven.lifecycle.internal.LifecycleStarter.singleThreadedBuild(LifecycleStarter.java:183)
	at org.apache.maven.lifecycle.internal.LifecycleStarter.execute(LifecycleStarter.java:161)
	at org.apache.maven.DefaultMaven.doExecute(DefaultMaven.java:319)
	at org.apache.maven.DefaultMaven.execute(DefaultMaven.java:156)
	at org.jvnet.hudson.maven3.launcher.Maven3Launcher.main(Maven3Launcher.java:79)
	at sun.reflect.NativeMethodAccessorImpl.invoke0(Native Method)
	at sun.reflect.NativeMethodAccessorImpl.invoke(NativeMethodAccessorImpl.java:39)
	at sun.reflect.DelegatingMethodAccessorImpl.invoke(DelegatingMethodAccessorImpl.java:25)
	at java.lang.reflect.Method.invoke(Method.java:597)
	at org.codehaus.plexus.classworlds.launcher.Launcher.launchStandard(Launcher.java:329)
	at org.codehaus.plexus.classworlds.launcher.Launcher.launch(Launcher.java:239)
	at org.jvnet.hudson.maven3.agent.Maven3Main.launch(Maven3Main.java:158)
	at hudson.maven.Maven3Builder.call(Maven3Builder.java:128)
	at hudson.maven.Maven3Builder.call(Maven3Builder.java:75)
	at hudson.remoting.UserRequest.perform(UserRequest.java:118)
	at hudson.remoting.UserRequest.perform(UserRequest.java:48)
	at hudson.remoting.Request$2.run(Request.java:270)
	at java.util.concurrent.Executors$RunnableAdapter.call(Executors.java:441)
	at java.util.concurrent.FutureTask$Sync.innerRun(FutureTask.java:303)
	at java.util.concurrent.FutureTask.run(FutureTask.java:138)
	at java.util.concurrent.ThreadPoolExecutor$Worker.runTask(ThreadPoolExecutor.java:886)
	at java.util.concurrent.ThreadPoolExecutor$Worker.run(ThreadPoolExecutor.java:908)
	at java.lang.Thread.run(Thread.java:619)
Caused by: org.apache.maven.plugin.MojoExecutionException: Exit code: 2
	at org.apache.maven.plugin.gpg.GpgSigner.generateSignatureForArtifact(GpgSigner.java:216)
	at org.apache.maven.plugin.gpg.GpgSignAttachedMojo.execute(GpgSignAttachedMojo.java:182)
	at org.apache.maven.plugin.DefaultBuildPluginManager.executeMojo(DefaultBuildPluginManager.java:101)
	at org.apache.maven.lifecycle.internal.MojoExecutor.execute(MojoExecutor.java:209)
	... 27 more
Sending e-mails to: dev@activemq.apache.org
channel stopped


Build failed in Jenkins: ActiveMQ-Apollo #337

Posted by Apache Jenkins Server <je...@builds.apache.org>.
See <https://builds.apache.org/job/ActiveMQ-Apollo/337/>

------------------------------------------
[...truncated 6489 lines...]
Downloading: http://download.java.net/maven/2/commons-lang/commons-lang/2.4/commons-lang-2.4.jar
Downloading: http://maven.glassfish.org/content/groups/glassfish/commons-lang/commons-lang/2.4/commons-lang-2.4.jar
Downloaded: http://maven.glassfish.org/content/groups/glassfish/commons-lang/commons-lang/2.4/commons-lang-2.4.jar (256 KB at 463.2 KB/sec)
[INFO] 
[INFO] --- maven-clean-plugin:2.4.1:clean (default-clean) @ apollo-website ---
[INFO] 
[INFO] --- maven-enforcer-plugin:1.0:enforce (default) @ apollo-website ---
[INFO] Downloading: http://repo.fusesource.com/nexus/content/groups/public/com/sun/xml/bind/jaxb-xjc/2.1.6/jaxb-xjc-2.1.6.pom

[INFO] --- maven-jaxb-schemagen-plugin:1.3-dev:generate (default) @ apollo-website ---
Downloading: http://scala-tools.org/repo-releases/com/sun/xml/bind/jaxb-xjc/2.1.6/jaxb-xjc-2.1.6.pom
Downloading: http://download.java.net/maven/2/com/sun/xml/bind/jaxb-xjc/2.1.6/jaxb-xjc-2.1.6.pom
Downloading: http://repo1.maven.org/maven2/com/sun/xml/bind/jaxb-xjc/2.1.6/jaxb-xjc-2.1.6.pom
Downloaded: http://repo1.maven.org/maven2/com/sun/xml/bind/jaxb-xjc/2.1.6/jaxb-xjc-2.1.6.pom (343 B at 1.0 KB/sec)
Downloading: http://repo.fusesource.com/nexus/content/groups/public/javax/xml/bind/jsr173_api/1.0/jsr173_api-1.0.pom
Downloaded: http://repo.fusesource.com/nexus/content/groups/public/javax/xml/bind/jsr173_api/1.0/jsr173_api-1.0.pom (157 B at 0.0 KB/sec)
Downloading: http://repo.fusesource.com/nexus/content/groups/public/com/sun/xml/bind/jaxb-xjc/2.1.6/jaxb-xjc-2.1.6.jar
Downloading: http://repo.fusesource.com/nexus/content/groups/public/org/codehaus/plexus/plexus-utils/1.1/plexus-utils-1.1.jar
Downloading: http://repo.fusesource.com/nexus/content/groups/public/javax/xml/bind/jsr173_api/1.0/jsr173_api-1.0.jar
Downloaded: http://repo.fusesource.com/nexus/content/groups/public/org/codehaus/plexus/plexus-utils/1.1/plexus-utils-1.1.jar (165 KB at 33.6 KB/sec)
Downloaded: http://repo.fusesource.com/nexus/content/groups/public/javax/xml/bind/jsr173_api/1.0/jsr173_api-1.0.jar (49 KB at 7.6 KB/sec)
Downloading: http://scala-tools.org/repo-releases/com/sun/xml/bind/jaxb-xjc/2.1.6/jaxb-xjc-2.1.6.jar
Downloading: http://download.java.net/maven/2/com/sun/xml/bind/jaxb-xjc/2.1.6/jaxb-xjc-2.1.6.jar
Downloading: http://repo1.maven.org/maven2/com/sun/xml/bind/jaxb-xjc/2.1.6/jaxb-xjc-2.1.6.jar
Downloaded: http://repo1.maven.org/maven2/com/sun/xml/bind/jaxb-xjc/2.1.6/jaxb-xjc-2.1.6.jar (3053 KB at 3407.1 KB/sec)
[INFO] jaxb-schemagen classpath addition: <https://builds.apache.org/job/ActiveMQ-Apollo/ws/.repository/javax/xml/bind/jaxb-api/2.1/jaxb-api-2.1.jar>
[INFO] jaxb-schemagen classpath addition: <https://builds.apache.org/job/ActiveMQ-Apollo/ws/.repository/org/fusesource/scalate/scalate-wikitext/1.5.0/scalate-wikitext-1.5.0.jar>
[INFO] jaxb-schemagen classpath addition: <https://builds.apache.org/job/ActiveMQ-Apollo/ws/.repository/org/fusesource/scalate/scalate-core/1.5.0/scalate-core-1.5.0.jar>
[INFO] jaxb-schemagen classpath addition: <https://builds.apache.org/job/ActiveMQ-Apollo/ws/.repository/org/fusesource/scalate/scalate-util/1.5.0/scalate-util-1.5.0.jar>
[INFO] jaxb-schemagen classpath addition: <https://builds.apache.org/job/ActiveMQ-Apollo/ws/.repository/org/fusesource/wikitext/confluence-core/1.2/confluence-core-1.2.jar>
[INFO] jaxb-schemagen classpath addition: <https://builds.apache.org/job/ActiveMQ-Apollo/ws/.repository/org/fusesource/wikitext/wikitext-core/1.2/wikitext-core-1.2.jar>
[INFO] jaxb-schemagen classpath addition: <https://builds.apache.org/job/ActiveMQ-Apollo/ws/.repository/org/fusesource/wikitext/textile-core/1.2/textile-core-1.2.jar>
[INFO] jaxb-schemagen classpath addition: <https://builds.apache.org/job/ActiveMQ-Apollo/ws/.repository/org/fusesource/scalate/scalate-page/1.5.0/scalate-page-1.5.0.jar>
[INFO] jaxb-schemagen classpath addition: <https://builds.apache.org/job/ActiveMQ-Apollo/ws/.repository/org/yaml/snakeyaml/1.7/snakeyaml-1.7.jar>
[INFO] jaxb-schemagen classpath addition: <https://builds.apache.org/job/ActiveMQ-Apollo/ws/.repository/org/fusesource/scalamd/scalamd/1.5/scalamd-1.5.jar>
[INFO] jaxb-schemagen classpath addition: <https://builds.apache.org/job/ActiveMQ-Apollo/ws/.repository/org/slf4j/slf4j-log4j12/1.6.1/slf4j-log4j12-1.6.1.jar>
[INFO] jaxb-schemagen classpath addition: <https://builds.apache.org/job/ActiveMQ-Apollo/ws/.repository/org/slf4j/slf4j-api/1.6.1/slf4j-api-1.6.1.jar>
[INFO] jaxb-schemagen classpath addition: <https://builds.apache.org/job/ActiveMQ-Apollo/ws/.repository/log4j/log4j/1.2.16/log4j-1.2.16.jar>
[INFO] jaxb-schemagen classpath addition: <https://builds.apache.org/job/ActiveMQ-Apollo/ws/.repository/org/codehaus/jackson/jackson-core-asl/1.6.1/jackson-core-asl-1.6.1.jar>
[INFO] jaxb-schemagen classpath addition: <https://builds.apache.org/job/ActiveMQ-Apollo/ws/.repository/org/codehaus/jackson/jackson-mapper-asl/1.6.1/jackson-mapper-asl-1.6.1.jar>
[INFO] jaxb-schemagen classpath addition: <https://builds.apache.org/job/ActiveMQ-Apollo/ws/.repository/org/scala-lang/scala-library/2.9.0-1/scala-library-2.9.0-1.jar>
[INFO] jaxb-schemagen classpath addition: <https://builds.apache.org/job/ActiveMQ-Apollo/ws/.repository/org/scala-lang/scala-compiler/2.9.0-1/scala-compiler-2.9.0-1.jar>
[INFO] apollo-bdb/src/main/scala/org/apache/activemq/apollo/broker/store/bdb/dto/BDBStoreDTO.java added as apollo-bdb/src/main/scala/org/apache/activemq/apollo/broker/store/bdb/dto/BDBStoreDTO.class doesn't exist.
[INFO] apollo-bdb/src/main/scala/org/apache/activemq/apollo/broker/store/bdb/dto/BDBStoreStatusDTO.java added as apollo-bdb/src/main/scala/org/apache/activemq/apollo/broker/store/bdb/dto/BDBStoreStatusDTO.class doesn't exist.
[INFO] apollo-bdb/src/main/scala/org/apache/activemq/apollo/broker/store/bdb/dto/package-info.java added as apollo-bdb/src/main/scala/org/apache/activemq/apollo/broker/store/bdb/dto/package-info.class doesn't exist.
[INFO] apollo-dto/src/main/java/org/apache/activemq/apollo/dto/AddUserHeaderDTO.java added as apollo-dto/src/main/java/org/apache/activemq/apollo/dto/AddUserHeaderDTO.class doesn't exist.
[INFO] apollo-dto/src/main/java/org/apache/activemq/apollo/dto/AggregateQueueMetricsDTO.java added as apollo-dto/src/main/java/org/apache/activemq/apollo/dto/AggregateQueueMetricsDTO.class doesn't exist.
[INFO] apollo-dto/src/main/java/org/apache/activemq/apollo/dto/AuthenticationDTO.java added as apollo-dto/src/main/java/org/apache/activemq/apollo/dto/AuthenticationDTO.class doesn't exist.
[INFO] apollo-dto/src/main/java/org/apache/activemq/apollo/dto/BrokerAclDTO.java added as apollo-dto/src/main/java/org/apache/activemq/apollo/dto/BrokerAclDTO.class doesn't exist.
[INFO] apollo-dto/src/main/java/org/apache/activemq/apollo/dto/BrokerDTO.java added as apollo-dto/src/main/java/org/apache/activemq/apollo/dto/BrokerDTO.class doesn't exist.
[INFO] apollo-dto/src/main/java/org/apache/activemq/apollo/dto/BrokerStatusDTO.java added as apollo-dto/src/main/java/org/apache/activemq/apollo/dto/BrokerStatusDTO.class doesn't exist.
[INFO] apollo-dto/src/main/java/org/apache/activemq/apollo/dto/ConnectionStatusDTO.java added as apollo-dto/src/main/java/org/apache/activemq/apollo/dto/ConnectionStatusDTO.class doesn't exist.
[INFO] apollo-dto/src/main/java/org/apache/activemq/apollo/dto/ConnectorAclDTO.java added as apollo-dto/src/main/java/org/apache/activemq/apollo/dto/ConnectorAclDTO.class doesn't exist.
[INFO] apollo-dto/src/main/java/org/apache/activemq/apollo/dto/ConnectorDTO.java added as apollo-dto/src/main/java/org/apache/activemq/apollo/dto/ConnectorDTO.class doesn't exist.
[INFO] apollo-dto/src/main/java/org/apache/activemq/apollo/dto/ConnectorStatusDTO.java added as apollo-dto/src/main/java/org/apache/activemq/apollo/dto/ConnectorStatusDTO.class doesn't exist.
[INFO] apollo-dto/src/main/java/org/apache/activemq/apollo/dto/DataPageDTO.java added as apollo-dto/src/main/java/org/apache/activemq/apollo/dto/DataPageDTO.class doesn't exist.
[INFO] apollo-dto/src/main/java/org/apache/activemq/apollo/dto/DestinationDTO.java added as apollo-dto/src/main/java/org/apache/activemq/apollo/dto/DestinationDTO.class doesn't exist.
[INFO] apollo-dto/src/main/java/org/apache/activemq/apollo/dto/DurableSubscriptionDTO.java added as apollo-dto/src/main/java/org/apache/activemq/apollo/dto/DurableSubscriptionDTO.class doesn't exist.
[INFO] apollo-dto/src/main/java/org/apache/activemq/apollo/dto/DurableSubscriptionDestinationDTO.java added as apollo-dto/src/main/java/org/apache/activemq/apollo/dto/DurableSubscriptionDestinationDTO.class doesn't exist.
[INFO] apollo-dto/src/main/java/org/apache/activemq/apollo/dto/EntryStatusDTO.java added as apollo-dto/src/main/java/org/apache/activemq/apollo/dto/EntryStatusDTO.class doesn't exist.
[INFO] apollo-dto/src/main/java/org/apache/activemq/apollo/dto/IntMetricDTO.java added as apollo-dto/src/main/java/org/apache/activemq/apollo/dto/IntMetricDTO.class doesn't exist.
[INFO] apollo-dto/src/main/java/org/apache/activemq/apollo/dto/JvmMetricsDTO.java added as apollo-dto/src/main/java/org/apache/activemq/apollo/dto/JvmMetricsDTO.class doesn't exist.
[INFO] apollo-dto/src/main/java/org/apache/activemq/apollo/dto/KeyStorageDTO.java added as apollo-dto/src/main/java/org/apache/activemq/apollo/dto/KeyStorageDTO.class doesn't exist.
[INFO] apollo-dto/src/main/java/org/apache/activemq/apollo/dto/LinkDTO.java added as apollo-dto/src/main/java/org/apache/activemq/apollo/dto/LinkDTO.class doesn't exist.
[INFO] apollo-dto/src/main/java/org/apache/activemq/apollo/dto/LogCategoryDTO.java added as apollo-dto/src/main/java/org/apache/activemq/apollo/dto/LogCategoryDTO.class doesn't exist.
[INFO] apollo-dto/src/main/java/org/apache/activemq/apollo/dto/LongIdDTO.java added as apollo-dto/src/main/java/org/apache/activemq/apollo/dto/LongIdDTO.class doesn't exist.
[INFO] apollo-dto/src/main/java/org/apache/activemq/apollo/dto/LongIdLabeledDTO.java added as apollo-dto/src/main/java/org/apache/activemq/apollo/dto/LongIdLabeledDTO.class doesn't exist.
[INFO] apollo-dto/src/main/java/org/apache/activemq/apollo/dto/LongIdListDTO.java added as apollo-dto/src/main/java/org/apache/activemq/apollo/dto/LongIdListDTO.class doesn't exist.
[INFO] apollo-dto/src/main/java/org/apache/activemq/apollo/dto/MemoryMetricsDTO.java added as apollo-dto/src/main/java/org/apache/activemq/apollo/dto/MemoryMetricsDTO.class doesn't exist.
[INFO] apollo-dto/src/main/java/org/apache/activemq/apollo/dto/NullStoreDTO.java added as apollo-dto/src/main/java/org/apache/activemq/apollo/dto/NullStoreDTO.class doesn't exist.
[INFO] apollo-dto/src/main/java/org/apache/activemq/apollo/dto/PrincipalDTO.java added as apollo-dto/src/main/java/org/apache/activemq/apollo/dto/PrincipalDTO.class doesn't exist.
[INFO] apollo-dto/src/main/java/org/apache/activemq/apollo/dto/ProtocolDTO.java added as apollo-dto/src/main/java/org/apache/activemq/apollo/dto/ProtocolDTO.class doesn't exist.
[INFO] apollo-dto/src/main/java/org/apache/activemq/apollo/dto/QueueAclDTO.java added as apollo-dto/src/main/java/org/apache/activemq/apollo/dto/QueueAclDTO.class doesn't exist.
[INFO] apollo-dto/src/main/java/org/apache/activemq/apollo/dto/QueueConsumerStatusDTO.java added as apollo-dto/src/main/java/org/apache/activemq/apollo/dto/QueueConsumerStatusDTO.class doesn't exist.
[INFO] apollo-dto/src/main/java/org/apache/activemq/apollo/dto/QueueDTO.java added as apollo-dto/src/main/java/org/apache/activemq/apollo/dto/QueueDTO.class doesn't exist.
[INFO] apollo-dto/src/main/java/org/apache/activemq/apollo/dto/QueueDestinationDTO.java added as apollo-dto/src/main/java/org/apache/activemq/apollo/dto/QueueDestinationDTO.class doesn't exist.
[INFO] apollo-dto/src/main/java/org/apache/activemq/apollo/dto/QueueMetricsDTO.java added as apollo-dto/src/main/java/org/apache/activemq/apollo/dto/QueueMetricsDTO.class doesn't exist.
[INFO] apollo-dto/src/main/java/org/apache/activemq/apollo/dto/QueueStatusDTO.java added as apollo-dto/src/main/java/org/apache/activemq/apollo/dto/QueueStatusDTO.class doesn't exist.
[INFO] apollo-dto/src/main/java/org/apache/activemq/apollo/dto/RouterDTO.java added as apollo-dto/src/main/java/org/apache/activemq/apollo/dto/RouterDTO.class doesn't exist.
[INFO] apollo-dto/src/main/java/org/apache/activemq/apollo/dto/ServiceDTO.java added as apollo-dto/src/main/java/org/apache/activemq/apollo/dto/ServiceDTO.class doesn't exist.
[INFO] apollo-dto/src/main/java/org/apache/activemq/apollo/dto/ServiceStatusDTO.java added as apollo-dto/src/main/java/org/apache/activemq/apollo/dto/ServiceStatusDTO.class doesn't exist.
[INFO] apollo-dto/src/main/java/org/apache/activemq/apollo/dto/SimpleStoreStatusDTO.java added as apollo-dto/src/main/java/org/apache/activemq/apollo/dto/SimpleStoreStatusDTO.class doesn't exist.
[INFO] apollo-dto/src/main/java/org/apache/activemq/apollo/dto/StoreDTO.java added as apollo-dto/src/main/java/org/apache/activemq/apollo/dto/StoreDTO.class doesn't exist.
[INFO] apollo-dto/src/main/java/org/apache/activemq/apollo/dto/StoreStatusDTO.java added as apollo-dto/src/main/java/org/apache/activemq/apollo/dto/StoreStatusDTO.class doesn't exist.
[INFO] apollo-dto/src/main/java/org/apache/activemq/apollo/dto/StringIdDTO.java added as apollo-dto/src/main/java/org/apache/activemq/apollo/dto/StringIdDTO.class doesn't exist.
[INFO] apollo-dto/src/main/java/org/apache/activemq/apollo/dto/StringIdLabeledDTO.java added as apollo-dto/src/main/java/org/apache/activemq/apollo/dto/StringIdLabeledDTO.class doesn't exist.
[INFO] apollo-dto/src/main/java/org/apache/activemq/apollo/dto/StringIdListDTO.java added as apollo-dto/src/main/java/org/apache/activemq/apollo/dto/StringIdListDTO.class doesn't exist.
[INFO] apollo-dto/src/main/java/org/apache/activemq/apollo/dto/StringListDTO.java added as apollo-dto/src/main/java/org/apache/activemq/apollo/dto/StringListDTO.class doesn't exist.
[INFO] apollo-dto/src/main/java/org/apache/activemq/apollo/dto/TimeMetricDTO.java added as apollo-dto/src/main/java/org/apache/activemq/apollo/dto/TimeMetricDTO.class doesn't exist.
[INFO] apollo-dto/src/main/java/org/apache/activemq/apollo/dto/TopicAclDTO.java added as apollo-dto/src/main/java/org/apache/activemq/apollo/dto/TopicAclDTO.class doesn't exist.
[INFO] apollo-dto/src/main/java/org/apache/activemq/apollo/dto/TopicDTO.java added as apollo-dto/src/main/java/org/apache/activemq/apollo/dto/TopicDTO.class doesn't exist.
[INFO] apollo-dto/src/main/java/org/apache/activemq/apollo/dto/TopicDestinationDTO.java added as apollo-dto/src/main/java/org/apache/activemq/apollo/dto/TopicDestinationDTO.class doesn't exist.
[INFO] apollo-dto/src/main/java/org/apache/activemq/apollo/dto/TopicStatusDTO.java added as apollo-dto/src/main/java/org/apache/activemq/apollo/dto/TopicStatusDTO.class doesn't exist.
[INFO] apollo-dto/src/main/java/org/apache/activemq/apollo/dto/ValueDTO.java added as apollo-dto/src/main/java/org/apache/activemq/apollo/dto/ValueDTO.class doesn't exist.
[INFO] apollo-dto/src/main/java/org/apache/activemq/apollo/dto/VirtualHostAclDTO.java added as apollo-dto/src/main/java/org/apache/activemq/apollo/dto/VirtualHostAclDTO.class doesn't exist.
[INFO] apollo-dto/src/main/java/org/apache/activemq/apollo/dto/VirtualHostDTO.java added as apollo-dto/src/main/java/org/apache/activemq/apollo/dto/VirtualHostDTO.class doesn't exist.
[INFO] apollo-dto/src/main/java/org/apache/activemq/apollo/dto/VirtualHostStatusDTO.java added as apollo-dto/src/main/java/org/apache/activemq/apollo/dto/VirtualHostStatusDTO.class doesn't exist.
[INFO] apollo-dto/src/main/java/org/apache/activemq/apollo/dto/WebAdminDTO.java added as apollo-dto/src/main/java/org/apache/activemq/apollo/dto/WebAdminDTO.class doesn't exist.
[INFO] apollo-dto/src/main/java/org/apache/activemq/apollo/dto/package-info.java added as apollo-dto/src/main/java/org/apache/activemq/apollo/dto/package-info.class doesn't exist.
[INFO] apollo-jdbm2/src/main/scala/org/apache/activemq/apollo/broker/store/jdbm2/dto/JDBM2StoreDTO.java added as apollo-jdbm2/src/main/scala/org/apache/activemq/apollo/broker/store/jdbm2/dto/JDBM2StoreDTO.class doesn't exist.
[INFO] apollo-jdbm2/src/main/scala/org/apache/activemq/apollo/broker/store/jdbm2/dto/JDBM2StoreStatusDTO.java added as apollo-jdbm2/src/main/scala/org/apache/activemq/apollo/broker/store/jdbm2/dto/JDBM2StoreStatusDTO.class doesn't exist.
[INFO] apollo-jdbm2/src/main/scala/org/apache/activemq/apollo/broker/store/jdbm2/dto/package-info.java added as apollo-jdbm2/src/main/scala/org/apache/activemq/apollo/broker/store/jdbm2/dto/package-info.class doesn't exist.
[INFO] apollo-stomp/src/main/scala/org/apache/activemq/apollo/stomp/dto/StompConnectionStatusDTO.java added as apollo-stomp/src/main/scala/org/apache/activemq/apollo/stomp/dto/StompConnectionStatusDTO.class doesn't exist.
[INFO] apollo-stomp/src/main/scala/org/apache/activemq/apollo/stomp/dto/StompDTO.java added as apollo-stomp/src/main/scala/org/apache/activemq/apollo/stomp/dto/StompDTO.class doesn't exist.
[INFO] apollo-stomp/src/main/scala/org/apache/activemq/apollo/stomp/dto/package-info.java added as apollo-stomp/src/main/scala/org/apache/activemq/apollo/stomp/dto/package-info.class doesn't exist.
[INFO] Generating schema from 63 source files
[INFO] Compilation arguments:
'-d'
'<https://builds.apache.org/job/ActiveMQ-Apollo/ws/trunk/apollo-website/target/sitegen/documentation/schema'>
'-classpath'
'<https://builds.apache.org/job/ActiveMQ-Apollo/ws/trunk/apollo-website/target/sitegen/documentation/schema>:<https://builds.apache.org/job/ActiveMQ-Apollo/ws/.repository/javax/xml/bind/jaxb-api/2.1/jaxb-api-2.1.jar>:<https://builds.apache.org/job/ActiveMQ-Apollo/ws/.repository/org/fusesource/scalate/scalate-wikitext/1.5.0/scalate-wikitext-1.5.0.jar>:<https://builds.apache.org/job/ActiveMQ-Apollo/ws/.repository/org/fusesource/scalate/scalate-core/1.5.0/scalate-core-1.5.0.jar>:<https://builds.apache.org/job/ActiveMQ-Apollo/ws/.repository/org/fusesource/scalate/scalate-util/1.5.0/scalate-util-1.5.0.jar>:<https://builds.apache.org/job/ActiveMQ-Apollo/ws/.repository/org/fusesource/wikitext/confluence-core/1.2/confluence-core-1.2.jar>:<https://builds.apache.org/job/ActiveMQ-Apollo/ws/.repository/org/fusesource/wikitext/wikitext-core/1.2/wikitext-core-1.2.jar>:<https://builds.apache.org/job/ActiveMQ-Apollo/ws/.repository/org/fusesource/wikitext/textile-core/1.2/textile-core-1.2.jar>:<https://builds.apache.org/job/ActiveMQ-Apollo/ws/.repository/org/fusesource/scalate/scalate-page/1.5.0/scalate-page-1.5.0.jar>:<https://builds.apache.org/job/ActiveMQ-Apollo/ws/.repository/org/yaml/snakeyaml/1.7/snakeyaml-1.7.jar>:<https://builds.apache.org/job/ActiveMQ-Apollo/ws/.repository/org/fusesource/scalamd/scalamd/1.5/scalamd-1.5.jar>:<https://builds.apache.org/job/ActiveMQ-Apollo/ws/.repository/org/slf4j/slf4j-log4j12/1.6.1/slf4j-log4j12-1.6.1.jar>:<https://builds.apache.org/job/ActiveMQ-Apollo/ws/.repository/org/slf4j/slf4j-api/1.6.1/slf4j-api-1.6.1.jar>:<https://builds.apache.org/job/ActiveMQ-Apollo/ws/.repository/log4j/log4j/1.2.16/log4j-1.2.16.jar>:<https://builds.apache.org/job/ActiveMQ-Apollo/ws/.repository/org/codehaus/jackson/jackson-core-asl/1.6.1/jackson-core-asl-1.6.1.jar>:<https://builds.apache.org/job/ActiveMQ-Apollo/ws/.repository/org/codehaus/jackson/jackson-mapper-asl/1.6.1/jackson-mapper-asl-1.6.1.jar>:<https://builds.apache.org/job/ActiveMQ-Apollo/ws/.repository/org/scala-lang/scala-library/2.9.0-1/scala-library-2.9.0-1.jar>:<https://builds.apache.org/job/ActiveMQ-Apollo/ws/.repository/org/scala-lang/scala-compiler/2.9.0-1/scala-compiler-2.9.0-1.jar>:/home/hudson/hudson-slave/maven3-agent.jar:/home/hudson/tools/maven/apache-maven-3.0.2/boot/plexus-classworlds-2.4.jar'
'-sourcepath'
'<https://builds.apache.org/job/ActiveMQ-Apollo/ws/trunk'>
'-g:none'
'-nocompile'

The ' characters around the executable and arguments are
not part of the command.

[INFO] Files to be compiled:
    <https://builds.apache.org/job/ActiveMQ-Apollo/ws/trunk/apollo-bdb/src/main/scala/org/apache/activemq/apollo/broker/store/bdb/dto/BDBStoreDTO.java>
    <https://builds.apache.org/job/ActiveMQ-Apollo/ws/trunk/apollo-bdb/src/main/scala/org/apache/activemq/apollo/broker/store/bdb/dto/BDBStoreStatusDTO.java>
    <https://builds.apache.org/job/ActiveMQ-Apollo/ws/trunk/apollo-bdb/src/main/scala/org/apache/activemq/apollo/broker/store/bdb/dto/package-info.java>
    <https://builds.apache.org/job/ActiveMQ-Apollo/ws/trunk/apollo-dto/src/main/java/org/apache/activemq/apollo/dto/AddUserHeaderDTO.java>
    <https://builds.apache.org/job/ActiveMQ-Apollo/ws/trunk/apollo-dto/src/main/java/org/apache/activemq/apollo/dto/AggregateQueueMetricsDTO.java>
    <https://builds.apache.org/job/ActiveMQ-Apollo/ws/trunk/apollo-dto/src/main/java/org/apache/activemq/apollo/dto/AuthenticationDTO.java>
    <https://builds.apache.org/job/ActiveMQ-Apollo/ws/trunk/apollo-dto/src/main/java/org/apache/activemq/apollo/dto/BrokerAclDTO.java>
    <https://builds.apache.org/job/ActiveMQ-Apollo/ws/trunk/apollo-dto/src/main/java/org/apache/activemq/apollo/dto/BrokerDTO.java>
    <https://builds.apache.org/job/ActiveMQ-Apollo/ws/trunk/apollo-dto/src/main/java/org/apache/activemq/apollo/dto/BrokerStatusDTO.java>
    <https://builds.apache.org/job/ActiveMQ-Apollo/ws/trunk/apollo-dto/src/main/java/org/apache/activemq/apollo/dto/ConnectionStatusDTO.java>
    <https://builds.apache.org/job/ActiveMQ-Apollo/ws/trunk/apollo-dto/src/main/java/org/apache/activemq/apollo/dto/ConnectorAclDTO.java>
    <https://builds.apache.org/job/ActiveMQ-Apollo/ws/trunk/apollo-dto/src/main/java/org/apache/activemq/apollo/dto/ConnectorDTO.java>
    <https://builds.apache.org/job/ActiveMQ-Apollo/ws/trunk/apollo-dto/src/main/java/org/apache/activemq/apollo/dto/ConnectorStatusDTO.java>
    <https://builds.apache.org/job/ActiveMQ-Apollo/ws/trunk/apollo-dto/src/main/java/org/apache/activemq/apollo/dto/DataPageDTO.java>
    <https://builds.apache.org/job/ActiveMQ-Apollo/ws/trunk/apollo-dto/src/main/java/org/apache/activemq/apollo/dto/DestinationDTO.java>
    <https://builds.apache.org/job/ActiveMQ-Apollo/ws/trunk/apollo-dto/src/main/java/org/apache/activemq/apollo/dto/DurableSubscriptionDTO.java>
    <https://builds.apache.org/job/ActiveMQ-Apollo/ws/trunk/apollo-dto/src/main/java/org/apache/activemq/apollo/dto/DurableSubscriptionDestinationDTO.java>
    <https://builds.apache.org/job/ActiveMQ-Apollo/ws/trunk/apollo-dto/src/main/java/org/apache/activemq/apollo/dto/EntryStatusDTO.java>
    <https://builds.apache.org/job/ActiveMQ-Apollo/ws/trunk/apollo-dto/src/main/java/org/apache/activemq/apollo/dto/IntMetricDTO.java>
    <https://builds.apache.org/job/ActiveMQ-Apollo/ws/trunk/apollo-dto/src/main/java/org/apache/activemq/apollo/dto/JvmMetricsDTO.java>
    <https://builds.apache.org/job/ActiveMQ-Apollo/ws/trunk/apollo-dto/src/main/java/org/apache/activemq/apollo/dto/KeyStorageDTO.java>
    <https://builds.apache.org/job/ActiveMQ-Apollo/ws/trunk/apollo-dto/src/main/java/org/apache/activemq/apollo/dto/LinkDTO.java>
    <https://builds.apache.org/job/ActiveMQ-Apollo/ws/trunk/apollo-dto/src/main/java/org/apache/activemq/apollo/dto/LogCategoryDTO.java>
    <https://builds.apache.org/job/ActiveMQ-Apollo/ws/trunk/apollo-dto/src/main/java/org/apache/activemq/apollo/dto/LongIdDTO.java>
    <https://builds.apache.org/job/ActiveMQ-Apollo/ws/trunk/apollo-dto/src/main/java/org/apache/activemq/apollo/dto/LongIdLabeledDTO.java>
    <https://builds.apache.org/job/ActiveMQ-Apollo/ws/trunk/apollo-dto/src/main/java/org/apache/activemq/apollo/dto/LongIdListDTO.java>
    <https://builds.apache.org/job/ActiveMQ-Apollo/ws/trunk/apollo-dto/src/main/java/org/apache/activemq/apollo/dto/MemoryMetricsDTO.java>
    <https://builds.apache.org/job/ActiveMQ-Apollo/ws/trunk/apollo-dto/src/main/java/org/apache/activemq/apollo/dto/NullStoreDTO.java>
    <https://builds.apache.org/job/ActiveMQ-Apollo/ws/trunk/apollo-dto/src/main/java/org/apache/activemq/apollo/dto/PrincipalDTO.java>
    <https://builds.apache.org/job/ActiveMQ-Apollo/ws/trunk/apollo-dto/src/main/java/org/apache/activemq/apollo/dto/ProtocolDTO.java>
    <https://builds.apache.org/job/ActiveMQ-Apollo/ws/trunk/apollo-dto/src/main/java/org/apache/activemq/apollo/dto/QueueAclDTO.java>
    <https://builds.apache.org/job/ActiveMQ-Apollo/ws/trunk/apollo-dto/src/main/java/org/apache/activemq/apollo/dto/QueueConsumerStatusDTO.java>
    <https://builds.apache.org/job/ActiveMQ-Apollo/ws/trunk/apollo-dto/src/main/java/org/apache/activemq/apollo/dto/QueueDTO.java>
    <https://builds.apache.org/job/ActiveMQ-Apollo/ws/trunk/apollo-dto/src/main/java/org/apache/activemq/apollo/dto/QueueDestinationDTO.java>
    <https://builds.apache.org/job/ActiveMQ-Apollo/ws/trunk/apollo-dto/src/main/java/org/apache/activemq/apollo/dto/QueueMetricsDTO.java>
    <https://builds.apache.org/job/ActiveMQ-Apollo/ws/trunk/apollo-dto/src/main/java/org/apache/activemq/apollo/dto/QueueStatusDTO.java>
    <https://builds.apache.org/job/ActiveMQ-Apollo/ws/trunk/apollo-dto/src/main/java/org/apache/activemq/apollo/dto/RouterDTO.java>
    <https://builds.apache.org/job/ActiveMQ-Apollo/ws/trunk/apollo-dto/src/main/java/org/apache/activemq/apollo/dto/ServiceDTO.java>
    <https://builds.apache.org/job/ActiveMQ-Apollo/ws/trunk/apollo-dto/src/main/java/org/apache/activemq/apollo/dto/ServiceStatusDTO.java>
    <https://builds.apache.org/job/ActiveMQ-Apollo/ws/trunk/apollo-dto/src/main/java/org/apache/activemq/apollo/dto/SimpleStoreStatusDTO.java>
    <https://builds.apache.org/job/ActiveMQ-Apollo/ws/trunk/apollo-dto/src/main/java/org/apache/activemq/apollo/dto/StoreDTO.java>
    <https://builds.apache.org/job/ActiveMQ-Apollo/ws/trunk/apollo-dto/src/main/java/org/apache/activemq/apollo/dto/StoreStatusDTO.java>
    <https://builds.apache.org/job/ActiveMQ-Apollo/ws/trunk/apollo-dto/src/main/java/org/apache/activemq/apollo/dto/StringIdDTO.java>
    <https://builds.apache.org/job/ActiveMQ-Apollo/ws/trunk/apollo-dto/src/main/java/org/apache/activemq/apollo/dto/StringIdLabeledDTO.java>
    <https://builds.apache.org/job/ActiveMQ-Apollo/ws/trunk/apollo-dto/src/main/java/org/apache/activemq/apollo/dto/StringIdListDTO.java>
    <https://builds.apache.org/job/ActiveMQ-Apollo/ws/trunk/apollo-dto/src/main/java/org/apache/activemq/apollo/dto/StringListDTO.java>
    <https://builds.apache.org/job/ActiveMQ-Apollo/ws/trunk/apollo-dto/src/main/java/org/apache/activemq/apollo/dto/TimeMetricDTO.java>
    <https://builds.apache.org/job/ActiveMQ-Apollo/ws/trunk/apollo-dto/src/main/java/org/apache/activemq/apollo/dto/TopicAclDTO.java>
    <https://builds.apache.org/job/ActiveMQ-Apollo/ws/trunk/apollo-dto/src/main/java/org/apache/activemq/apollo/dto/TopicDTO.java>
    <https://builds.apache.org/job/ActiveMQ-Apollo/ws/trunk/apollo-dto/src/main/java/org/apache/activemq/apollo/dto/TopicDestinationDTO.java>
    <https://builds.apache.org/job/ActiveMQ-Apollo/ws/trunk/apollo-dto/src/main/java/org/apache/activemq/apollo/dto/TopicStatusDTO.java>
    <https://builds.apache.org/job/ActiveMQ-Apollo/ws/trunk/apollo-dto/src/main/java/org/apache/activemq/apollo/dto/ValueDTO.java>
    <https://builds.apache.org/job/ActiveMQ-Apollo/ws/trunk/apollo-dto/src/main/java/org/apache/activemq/apollo/dto/VirtualHostAclDTO.java>
    <https://builds.apache.org/job/ActiveMQ-Apollo/ws/trunk/apollo-dto/src/main/java/org/apache/activemq/apollo/dto/VirtualHostDTO.java>
    <https://builds.apache.org/job/ActiveMQ-Apollo/ws/trunk/apollo-dto/src/main/java/org/apache/activemq/apollo/dto/VirtualHostStatusDTO.java>
    <https://builds.apache.org/job/ActiveMQ-Apollo/ws/trunk/apollo-dto/src/main/java/org/apache/activemq/apollo/dto/WebAdminDTO.java>
    <https://builds.apache.org/job/ActiveMQ-Apollo/ws/trunk/apollo-dto/src/main/java/org/apache/activemq/apollo/dto/package-info.java>
    <https://builds.apache.org/job/ActiveMQ-Apollo/ws/trunk/apollo-jdbm2/src/main/scala/org/apache/activemq/apollo/broker/store/jdbm2/dto/JDBM2StoreDTO.java>
    <https://builds.apache.org/job/ActiveMQ-Apollo/ws/trunk/apollo-jdbm2/src/main/scala/org/apache/activemq/apollo/broker/store/jdbm2/dto/JDBM2StoreStatusDTO.java>
    <https://builds.apache.org/job/ActiveMQ-Apollo/ws/trunk/apollo-jdbm2/src/main/scala/org/apache/activemq/apollo/broker/store/jdbm2/dto/package-info.java>
    <https://builds.apache.org/job/ActiveMQ-Apollo/ws/trunk/apollo-stomp/src/main/scala/org/apache/activemq/apollo/stomp/dto/StompConnectionStatusDTO.java>
    <https://builds.apache.org/job/ActiveMQ-Apollo/ws/trunk/apollo-stomp/src/main/scala/org/apache/activemq/apollo/stomp/dto/StompDTO.java>
    <https://builds.apache.org/job/ActiveMQ-Apollo/ws/trunk/apollo-stomp/src/main/scala/org/apache/activemq/apollo/stomp/dto/package-info.java>

Note: Writing <https://builds.apache.org/job/ActiveMQ-Apollo/ws/trunk/apollo-website/target/sitegen/documentation/schema/apollo.xsd>
[INFO] 
[INFO] --- maven-remote-resources-plugin:1.1:process (default) @ apollo-website ---
[INFO] [INFO] Checking for multiple versions of scala
[INFO] includes = [**/*.scala,**/*.java,]
[INFO] excludes = []
[INFO] <https://builds.apache.org/job/ActiveMQ-Apollo/ws/trunk/apollo-website/ext>:-1: info: compiling
[INFO] <https://builds.apache.org/job/ActiveMQ-Apollo/ws/trunk/apollo-website/target/sitegen/documentation/schema>:-1: info: compiling
[INFO] Compiling 3 source files to <https://builds.apache.org/job/ActiveMQ-Apollo/ws/trunk/apollo-website/target/classes> at 1307981790563
[INFO] compiler plugin: BasicArtifact(org.scala-lang.plugins,continuations,2.9.0-1)
[INFO] compiler plugin: BasicArtifact(org.fusesource.jvmassert,jvmassert,1.1)

[INFO] --- maven-scala-plugin:2.15.2:compile (default) @ apollo-website ---
[INFO] prepare-compile in 0 s
[INFO] compile in 6 s
[INFO] Checking for multiple versions of scala
[INFO] [INFO] includes = [**/*.scala,**/*.java,]
[INFO] excludes = []
[WARNING] No source files found.

[INFO] --- maven-scala-plugin:2.15.2:testCompile (default) @ apollo-website ---
mojo forkStarted org.apache.maven.plugins:maven-source-plugin:2.1.2(attach-sources)
forkedProjectStarted org.apache.activemq:apollo-website1.0-SNAPSHOT
[INFO] 
[INFO] --- maven-enforcer-plugin:1.0:enforce (default) @ apollo-website ---
forkedProjectSucceeded org.apache.activemq:apollo-website1.0-SNAPSHOT
[JENKINS] Archiving <https://builds.apache.org/job/ActiveMQ-Apollo/ws/trunk/apollo-website/pom.xml> to /home/hudson/hudson/jobs/ActiveMQ-Apollo/modules/org.apache.activemq$apollo-website/builds/2011-06-13_15-18-01/archive/org.apache.activemq/apollo-website/1.0-SNAPSHOT/apollo-website-1.0-SNAPSHOT.pom
mavenExecutionResult exceptions not empty
message : PermGen space
Stack trace : 
java.lang.OutOfMemoryError: PermGen space
	at java.lang.Class.getDeclaredFields0(Native Method)
	at java.lang.Class.privateGetDeclaredFields(Class.java:2291)
	at java.lang.Class.getDeclaredField(Class.java:1880)
	at java.io.ObjectStreamClass.getDeclaredSUID(ObjectStreamClass.java:1610)
	at java.io.ObjectStreamClass.access$700(ObjectStreamClass.java:52)
	at java.io.ObjectStreamClass$2.run(ObjectStreamClass.java:425)
	at java.security.AccessController.doPrivileged(Native Method)
	at java.io.ObjectStreamClass.<init>(ObjectStreamClass.java:413)
	at java.io.ObjectStreamClass.lookup(ObjectStreamClass.java:310)
	at java.io.ObjectStreamClass.<init>(ObjectStreamClass.java:409)
	at java.io.ObjectStreamClass.lookup(ObjectStreamClass.java:310)
	at java.io.ObjectOutputStream.writeObject0(ObjectOutputStream.java:1106)
	at java.io.ObjectOutputStream.defaultWriteFields(ObjectOutputStream.java:1509)
	at java.io.ObjectOutputStream.writeSerialData(ObjectOutputStream.java:1474)
	at java.io.ObjectOutputStream.writeOrdinaryObject(ObjectOutputStream.java:1392)
	at java.io.ObjectOutputStream.writeObject0(ObjectOutputStream.java:1150)
	at java.io.ObjectOutputStream.defaultWriteFields(ObjectOutputStream.java:1509)
	at java.io.ObjectOutputStream.writeSerialData(ObjectOutputStream.java:1474)
	at java.io.ObjectOutputStream.writeOrdinaryObject(ObjectOutputStream.java:1392)
	at java.io.ObjectOutputStream.writeObject0(ObjectOutputStream.java:1150)
	at java.io.ObjectOutputStream.defaultWriteFields(ObjectOutputStream.java:1509)
	at java.io.ObjectOutputStream.writeSerialData(ObjectOutputStream.java:1474)
	at java.io.ObjectOutputStream.writeOrdinaryObject(ObjectOutputStream.java:1392)
	at java.io.ObjectOutputStream.writeObject0(ObjectOutputStream.java:1150)
	at java.io.ObjectOutputStream.writeObject(ObjectOutputStream.java:326)
	at hudson.remoting.UserRequest._serialize(UserRequest.java:155)
	at hudson.remoting.UserRequest.serialize(UserRequest.java:164)
	at hudson.remoting.UserRequest.<init>(UserRequest.java:62)
	at hudson.remoting.Channel.callAsync(Channel.java:688)
	at hudson.maven.Maven3Builder$FilterImpl.executeAsync(Maven3Builder.java:238)
	at hudson.maven.reporters.MavenArtifactArchiver.postBuild(MavenArtifactArchiver.java:129)
	at hudson.maven.Maven3Builder$MavenExecutionListener.reccordProjectSucceeded(Maven3Builder.java:448)
Sending e-mails to: commits@activemq.apache.org
channel stopped


Build failed in Jenkins: ActiveMQ-Apollo #336

Posted by Apache Jenkins Server <je...@builds.apache.org>.
See <https://builds.apache.org/job/ActiveMQ-Apollo/336/>

------------------------------------------
Started by user chirino
Building remotely on ubuntu2
hudson.util.IOException2: remote file operation failed: <https://builds.apache.org/job/ActiveMQ-Apollo/ws/> at hudson.remoting.Channel@111eb4d2:ubuntu2
	at hudson.FilePath.act(FilePath.java:754)
	at hudson.FilePath.act(FilePath.java:740)
	at hudson.scm.SubversionSCM.checkout(SubversionSCM.java:684)
	at hudson.scm.SubversionSCM.checkout(SubversionSCM.java:633)
	at hudson.model.AbstractProject.checkout(AbstractProject.java:1181)
	at hudson.model.AbstractBuild$AbstractRunner.checkout(AbstractBuild.java:536)
	at hudson.model.AbstractBuild$AbstractRunner.run(AbstractBuild.java:424)
	at hudson.model.Run.run(Run.java:1374)
	at hudson.maven.MavenModuleSetBuild.run(MavenModuleSetBuild.java:467)
	at hudson.model.ResourceController.execute(ResourceController.java:88)
	at hudson.model.Executor.run(Executor.java:145)
Caused by: java.io.IOException: Remote call on ubuntu2 failed
	at hudson.remoting.Channel.call(Channel.java:670)
	at hudson.FilePath.act(FilePath.java:747)
	... 10 more
Caused by: java.lang.NoClassDefFoundError: Could not initialize class hudson.model.Hudson
	at hudson.scm.SubversionWorkspaceSelector.syncWorkspaceFormatFromMaster(SubversionWorkspaceSelector.java:85)
	at hudson.scm.SubversionSCM.createSvnClientManager(SubversionSCM.java:761)
	at hudson.scm.SubversionSCM$CheckOutTask.invoke(SubversionSCM.java:704)
	at hudson.scm.SubversionSCM$CheckOutTask.invoke(SubversionSCM.java:691)
	at hudson.FilePath$FileCallableWrapper.call(FilePath.java:1979)
	at hudson.remoting.UserRequest.perform(UserRequest.java:118)
	at hudson.remoting.UserRequest.perform(UserRequest.java:48)
	at hudson.remoting.Request$2.run(Request.java:270)
	at java.util.concurrent.Executors$RunnableAdapter.call(Executors.java:471)
	at java.util.concurrent.FutureTask$Sync.innerRun(FutureTask.java:334)
	at java.util.concurrent.FutureTask.run(FutureTask.java:166)
	at java.util.concurrent.ThreadPoolExecutor.runWorker(ThreadPoolExecutor.java:1110)
	at java.util.concurrent.ThreadPoolExecutor$Worker.run(ThreadPoolExecutor.java:603)
	at java.lang.Thread.run(Thread.java:636)


Build failed in Jenkins: ActiveMQ-Apollo #335

Posted by Apache Jenkins Server <je...@builds.apache.org>.
See <https://builds.apache.org/job/ActiveMQ-Apollo/335/>

------------------------------------------
Started by user chirino
Building remotely on ubuntu2
hudson.util.IOException2: remote file operation failed: <https://builds.apache.org/job/ActiveMQ-Apollo/ws/> at hudson.remoting.Channel@111eb4d2:ubuntu2
	at hudson.FilePath.act(FilePath.java:754)
	at hudson.FilePath.act(FilePath.java:740)
	at hudson.scm.SubversionSCM.checkout(SubversionSCM.java:684)
	at hudson.scm.SubversionSCM.checkout(SubversionSCM.java:633)
	at hudson.model.AbstractProject.checkout(AbstractProject.java:1181)
	at hudson.model.AbstractBuild$AbstractRunner.checkout(AbstractBuild.java:536)
	at hudson.model.AbstractBuild$AbstractRunner.run(AbstractBuild.java:424)
	at hudson.model.Run.run(Run.java:1374)
	at hudson.maven.MavenModuleSetBuild.run(MavenModuleSetBuild.java:467)
	at hudson.model.ResourceController.execute(ResourceController.java:88)
	at hudson.model.Executor.run(Executor.java:145)
Caused by: java.io.IOException: Remote call on ubuntu2 failed
	at hudson.remoting.Channel.call(Channel.java:670)
	at hudson.FilePath.act(FilePath.java:747)
	... 10 more
Caused by: java.lang.NoClassDefFoundError: Could not initialize class hudson.model.Hudson
	at hudson.scm.SubversionWorkspaceSelector.syncWorkspaceFormatFromMaster(SubversionWorkspaceSelector.java:85)
	at hudson.scm.SubversionSCM.createSvnClientManager(SubversionSCM.java:761)
	at hudson.scm.SubversionSCM$CheckOutTask.invoke(SubversionSCM.java:704)
	at hudson.scm.SubversionSCM$CheckOutTask.invoke(SubversionSCM.java:691)
	at hudson.FilePath$FileCallableWrapper.call(FilePath.java:1979)
	at hudson.remoting.UserRequest.perform(UserRequest.java:118)
	at hudson.remoting.UserRequest.perform(UserRequest.java:48)
	at hudson.remoting.Request$2.run(Request.java:270)
	at java.util.concurrent.Executors$RunnableAdapter.call(Executors.java:471)
	at java.util.concurrent.FutureTask$Sync.innerRun(FutureTask.java:334)
	at java.util.concurrent.FutureTask.run(FutureTask.java:166)
	at java.util.concurrent.ThreadPoolExecutor.runWorker(ThreadPoolExecutor.java:1110)
	at java.util.concurrent.ThreadPoolExecutor$Worker.run(ThreadPoolExecutor.java:603)
	at java.lang.Thread.run(Thread.java:636)


Build failed in Jenkins: ActiveMQ-Apollo #334

Posted by Apache Jenkins Server <je...@builds.apache.org>.
See <https://builds.apache.org/job/ActiveMQ-Apollo/334/>

------------------------------------------
Started by user chirino
Building remotely on ubuntu2
hudson.util.IOException2: remote file operation failed: <https://builds.apache.org/job/ActiveMQ-Apollo/ws/> at hudson.remoting.Channel@111eb4d2:ubuntu2
	at hudson.FilePath.act(FilePath.java:754)
	at hudson.FilePath.act(FilePath.java:740)
	at hudson.scm.SubversionSCM.checkout(SubversionSCM.java:684)
	at hudson.scm.SubversionSCM.checkout(SubversionSCM.java:633)
	at hudson.model.AbstractProject.checkout(AbstractProject.java:1181)
	at hudson.model.AbstractBuild$AbstractRunner.checkout(AbstractBuild.java:536)
	at hudson.model.AbstractBuild$AbstractRunner.run(AbstractBuild.java:424)
	at hudson.model.Run.run(Run.java:1374)
	at hudson.maven.MavenModuleSetBuild.run(MavenModuleSetBuild.java:467)
	at hudson.model.ResourceController.execute(ResourceController.java:88)
	at hudson.model.Executor.run(Executor.java:145)
Caused by: java.io.IOException: Remote call on ubuntu2 failed
	at hudson.remoting.Channel.call(Channel.java:670)
	at hudson.FilePath.act(FilePath.java:747)
	... 10 more
Caused by: java.lang.NoClassDefFoundError: Could not initialize class hudson.model.Hudson
	at hudson.scm.SubversionWorkspaceSelector.syncWorkspaceFormatFromMaster(SubversionWorkspaceSelector.java:85)
	at hudson.scm.SubversionSCM.createSvnClientManager(SubversionSCM.java:761)
	at hudson.scm.SubversionSCM$CheckOutTask.invoke(SubversionSCM.java:704)
	at hudson.scm.SubversionSCM$CheckOutTask.invoke(SubversionSCM.java:691)
	at hudson.FilePath$FileCallableWrapper.call(FilePath.java:1979)
	at hudson.remoting.UserRequest.perform(UserRequest.java:118)
	at hudson.remoting.UserRequest.perform(UserRequest.java:48)
	at hudson.remoting.Request$2.run(Request.java:270)
	at java.util.concurrent.Executors$RunnableAdapter.call(Executors.java:471)
	at java.util.concurrent.FutureTask$Sync.innerRun(FutureTask.java:334)
	at java.util.concurrent.FutureTask.run(FutureTask.java:166)
	at java.util.concurrent.ThreadPoolExecutor.runWorker(ThreadPoolExecutor.java:1110)
	at java.util.concurrent.ThreadPoolExecutor$Worker.run(ThreadPoolExecutor.java:603)
	at java.lang.Thread.run(Thread.java:636)


Build failed in Jenkins: ActiveMQ-Apollo #333

Posted by Apache Jenkins Server <je...@builds.apache.org>.
See <https://builds.apache.org/job/ActiveMQ-Apollo/333/>

------------------------------------------
Started by user chirino
Building remotely on ubuntu2
hudson.util.IOException2: remote file operation failed: <https://builds.apache.org/job/ActiveMQ-Apollo/ws/> at hudson.remoting.Channel@111eb4d2:ubuntu2
	at hudson.FilePath.act(FilePath.java:754)
	at hudson.FilePath.act(FilePath.java:740)
	at hudson.scm.SubversionSCM.checkout(SubversionSCM.java:684)
	at hudson.scm.SubversionSCM.checkout(SubversionSCM.java:633)
	at hudson.model.AbstractProject.checkout(AbstractProject.java:1181)
	at hudson.model.AbstractBuild$AbstractRunner.checkout(AbstractBuild.java:536)
	at hudson.model.AbstractBuild$AbstractRunner.run(AbstractBuild.java:424)
	at hudson.model.Run.run(Run.java:1374)
	at hudson.maven.MavenModuleSetBuild.run(MavenModuleSetBuild.java:467)
	at hudson.model.ResourceController.execute(ResourceController.java:88)
	at hudson.model.Executor.run(Executor.java:145)
Caused by: java.io.IOException: Remote call on ubuntu2 failed
	at hudson.remoting.Channel.call(Channel.java:670)
	at hudson.FilePath.act(FilePath.java:747)
	... 10 more
Caused by: java.lang.NoClassDefFoundError: Could not initialize class hudson.model.Hudson
	at hudson.scm.SubversionWorkspaceSelector.syncWorkspaceFormatFromMaster(SubversionWorkspaceSelector.java:85)
	at hudson.scm.SubversionSCM.createSvnClientManager(SubversionSCM.java:761)
	at hudson.scm.SubversionSCM$CheckOutTask.invoke(SubversionSCM.java:704)
	at hudson.scm.SubversionSCM$CheckOutTask.invoke(SubversionSCM.java:691)
	at hudson.FilePath$FileCallableWrapper.call(FilePath.java:1979)
	at hudson.remoting.UserRequest.perform(UserRequest.java:118)
	at hudson.remoting.UserRequest.perform(UserRequest.java:48)
	at hudson.remoting.Request$2.run(Request.java:270)
	at java.util.concurrent.Executors$RunnableAdapter.call(Executors.java:471)
	at java.util.concurrent.FutureTask$Sync.innerRun(FutureTask.java:334)
	at java.util.concurrent.FutureTask.run(FutureTask.java:166)
	at java.util.concurrent.ThreadPoolExecutor.runWorker(ThreadPoolExecutor.java:1110)
	at java.util.concurrent.ThreadPoolExecutor$Worker.run(ThreadPoolExecutor.java:603)
	at java.lang.Thread.run(Thread.java:636)