You are viewing a plain text version of this content. The canonical link for it is here.
Posted to commits@karaf.apache.org by Apache Hudson Server <hu...@hudson.apache.org> on 2011/01/03 20:07:04 UTC

Build failed in Hudson: Karaf #291

See <https://hudson.apache.org/hudson/job/Karaf/291/changes>

Changes:

[jbonofre] [KARAF-353] features:install and features:uninstall command now support multivalued argument.

------------------------------------------
[...truncated 24267 lines...]
[INFO ] Retrieving previous metadata from apache.snapshots.https
[INFO ] Uploading repository metadata for: 'artifact org.apache.karaf.demos:org.apache.karaf.demos.branding.shell'
Deploying the main artifact web-2.1.99-SNAPSHOT.war
[INFO ] Retrieving previous build number from apache.snapshots.https
[INFO ] Retrieving previous metadata from apache.snapshots.https
[INFO ] Uploading repository metadata for: 'artifact org.apache.karaf.demos:web'
[INFO ] Retrieving previous metadata from apache.snapshots.https
[INFO ] Uploading repository metadata for: 'snapshot org.apache.karaf.demos:web:2.1.99-SNAPSHOT'
[INFO ] Uploading project information for web 2.1.99-SNAPSHOT
Deploying the main artifact deployer-2.1.99-SNAPSHOT.pom
[INFO ] Retrieving previous build number from apache.snapshots.https
[INFO ] Retrieving previous metadata from apache.snapshots.https
[INFO ] Uploading repository metadata for: 'artifact org.apache.karaf.deployer:deployer'
[INFO ] Retrieving previous metadata from apache.snapshots.https
[INFO ] Uploading repository metadata for: 'snapshot org.apache.karaf.deployer:deployer:2.1.99-SNAPSHOT'
Deploying the main artifact org.apache.karaf.deployer.blueprint-2.1.99-SNAPSHOT.jar
[INFO ] Retrieving previous build number from apache.snapshots.https
[INFO ] Uploading project information for org.apache.karaf.deployer.blueprint 2.1.99-SNAPSHOT
[INFO ] Retrieving previous metadata from apache.snapshots.https
[INFO ] Uploading repository metadata for: 'snapshot org.apache.karaf.deployer:org.apache.karaf.deployer.blueprint:2.1.99-SNAPSHOT'
[INFO ] Retrieving previous metadata from apache.snapshots.https
[INFO ] Uploading repository metadata for: 'artifact org.apache.karaf.deployer:org.apache.karaf.deployer.blueprint'
Deploying the main artifact org.apache.karaf.deployer.features-2.1.99-SNAPSHOT.jar
[INFO ] Retrieving previous build number from apache.snapshots.https
[INFO ] Retrieving previous metadata from apache.snapshots.https
[INFO ] Uploading repository metadata for: 'artifact org.apache.karaf.deployer:org.apache.karaf.deployer.features'
[INFO ] Retrieving previous metadata from apache.snapshots.https
[INFO ] Uploading repository metadata for: 'snapshot org.apache.karaf.deployer:org.apache.karaf.deployer.features:2.1.99-SNAPSHOT'
[INFO ] Uploading project information for org.apache.karaf.deployer.features 2.1.99-SNAPSHOT
Deploying the main artifact org.apache.karaf.deployer.kar-2.1.99-SNAPSHOT.jar
[INFO ] Retrieving previous build number from apache.snapshots.https
[INFO ] Retrieving previous metadata from apache.snapshots.https
[INFO ] Uploading repository metadata for: 'artifact org.apache.karaf.deployer:org.apache.karaf.deployer.kar'
[INFO ] Retrieving previous metadata from apache.snapshots.https
[INFO ] Uploading repository metadata for: 'snapshot org.apache.karaf.deployer:org.apache.karaf.deployer.kar:2.1.99-SNAPSHOT'
[INFO ] Uploading project information for org.apache.karaf.deployer.kar 2.1.99-SNAPSHOT
Deploying the main artifact org.apache.karaf.deployer.spring-2.1.99-SNAPSHOT.jar
[INFO ] Retrieving previous build number from apache.snapshots.https
[INFO ] Uploading project information for org.apache.karaf.deployer.spring 2.1.99-SNAPSHOT
[INFO ] Retrieving previous metadata from apache.snapshots.https
[INFO ] Uploading repository metadata for: 'artifact org.apache.karaf.deployer:org.apache.karaf.deployer.spring'
[INFO ] Retrieving previous metadata from apache.snapshots.https
[INFO ] Uploading repository metadata for: 'snapshot org.apache.karaf.deployer:org.apache.karaf.deployer.spring:2.1.99-SNAPSHOT'
Deploying the main artifact org.apache.karaf.deployer.war-2.1.99-SNAPSHOT.jar
[INFO ] Retrieving previous build number from apache.snapshots.https
[INFO ] Uploading project information for org.apache.karaf.deployer.war 2.1.99-SNAPSHOT
[INFO ] Retrieving previous metadata from apache.snapshots.https
[INFO ] Uploading repository metadata for: 'snapshot org.apache.karaf.deployer:org.apache.karaf.deployer.war:2.1.99-SNAPSHOT'
[INFO ] Retrieving previous metadata from apache.snapshots.https
[INFO ] Uploading repository metadata for: 'artifact org.apache.karaf.deployer:org.apache.karaf.deployer.war'
Deploying the main artifact diagnostic-2.1.99-SNAPSHOT.pom
[INFO ] Retrieving previous build number from apache.snapshots.https
[INFO ] Retrieving previous metadata from apache.snapshots.https
[INFO ] Uploading repository metadata for: 'artifact org.apache.karaf.diagnostic:diagnostic'
[INFO ] Retrieving previous metadata from apache.snapshots.https
[INFO ] Uploading repository metadata for: 'snapshot org.apache.karaf.diagnostic:diagnostic:2.1.99-SNAPSHOT'
Deploying the main artifact org.apache.karaf.diagnostic.command-2.1.99-SNAPSHOT.jar
[INFO ] Retrieving previous build number from apache.snapshots.https
[INFO ] Retrieving previous metadata from apache.snapshots.https
[INFO ] Uploading repository metadata for: 'snapshot org.apache.karaf.diagnostic:org.apache.karaf.diagnostic.command:2.1.99-SNAPSHOT'
[INFO ] Uploading project information for org.apache.karaf.diagnostic.command 2.1.99-SNAPSHOT
[INFO ] Retrieving previous metadata from apache.snapshots.https
[INFO ] Uploading repository metadata for: 'artifact org.apache.karaf.diagnostic:org.apache.karaf.diagnostic.command'
Deploying the main artifact org.apache.karaf.diagnostic.common-2.1.99-SNAPSHOT.jar
[INFO ] Retrieving previous build number from apache.snapshots.https
[INFO ] Retrieving previous metadata from apache.snapshots.https
[INFO ] Uploading repository metadata for: 'snapshot org.apache.karaf.diagnostic:org.apache.karaf.diagnostic.common:2.1.99-SNAPSHOT'
[INFO ] Retrieving previous metadata from apache.snapshots.https
[INFO ] Uploading repository metadata for: 'artifact org.apache.karaf.diagnostic:org.apache.karaf.diagnostic.common'
[INFO ] Uploading project information for org.apache.karaf.diagnostic.common 2.1.99-SNAPSHOT
Deploying the main artifact org.apache.karaf.diagnostic.core-2.1.99-SNAPSHOT.jar
[INFO ] Retrieving previous build number from apache.snapshots.https
[INFO ] Retrieving previous metadata from apache.snapshots.https
[INFO ] Uploading repository metadata for: 'artifact org.apache.karaf.diagnostic:org.apache.karaf.diagnostic.core'
[INFO ] Uploading project information for org.apache.karaf.diagnostic.core 2.1.99-SNAPSHOT
[INFO ] Retrieving previous metadata from apache.snapshots.https
[INFO ] Uploading repository metadata for: 'snapshot org.apache.karaf.diagnostic:org.apache.karaf.diagnostic.core:2.1.99-SNAPSHOT'
Deploying the main artifact org.apache.karaf.diagnostic.management-2.1.99-SNAPSHOT.jar
[INFO ] Retrieving previous build number from apache.snapshots.https
[INFO ] Retrieving previous metadata from apache.snapshots.https
[INFO ] Uploading repository metadata for: 'snapshot org.apache.karaf.diagnostic:org.apache.karaf.diagnostic.management:2.1.99-SNAPSHOT'
[INFO ] Uploading project information for org.apache.karaf.diagnostic.management 2.1.99-SNAPSHOT
[INFO ] Retrieving previous metadata from apache.snapshots.https
[INFO ] Uploading repository metadata for: 'artifact org.apache.karaf.diagnostic:org.apache.karaf.diagnostic.management'
Deploying the main artifact enterprise-2.1.99-SNAPSHOT.jar
[INFO ] Retrieving previous build number from apache.snapshots.https
[INFO ] Uploading project information for enterprise 2.1.99-SNAPSHOT
[INFO ] Retrieving previous metadata from apache.snapshots.https
[INFO ] Uploading repository metadata for: 'artifact org.apache.karaf.features:enterprise'
[INFO ] Retrieving previous metadata from apache.snapshots.https
[INFO ] Uploading repository metadata for: 'snapshot org.apache.karaf.features:enterprise:2.1.99-SNAPSHOT'
Deploying the attached artifact features.xml
[INFO ] Retrieving previous build number from apache.snapshots.https
[INFO ] Retrieving previous metadata from apache.snapshots.https
[INFO ] Uploading repository metadata for: 'artifact org.apache.karaf.features:enterprise'
[INFO ] Retrieving previous metadata from apache.snapshots.https
[INFO ] Uploading repository metadata for: 'snapshot org.apache.karaf.features:enterprise:2.1.99-SNAPSHOT'
Deploying the main artifact features-2.1.99-SNAPSHOT.pom
[INFO ] Retrieving previous build number from apache.snapshots.https
[INFO ] Retrieving previous metadata from apache.snapshots.https
[INFO ] Uploading repository metadata for: 'artifact org.apache.karaf.features:features'
[INFO ] Retrieving previous metadata from apache.snapshots.https
[INFO ] Uploading repository metadata for: 'snapshot org.apache.karaf.features:features:2.1.99-SNAPSHOT'
Deploying the main artifact org.apache.karaf.features.command-2.1.99-SNAPSHOT.jar
[INFO ] Retrieving previous build number from apache.snapshots.https
[INFO ] Retrieving previous metadata from apache.snapshots.https
[INFO ] Uploading repository metadata for: 'artifact org.apache.karaf.features:org.apache.karaf.features.command'
[INFO ] Retrieving previous metadata from apache.snapshots.https
[INFO ] Uploading repository metadata for: 'snapshot org.apache.karaf.features:org.apache.karaf.features.command:2.1.99-SNAPSHOT'
[INFO ] Uploading project information for org.apache.karaf.features.command 2.1.99-SNAPSHOT
Deploying the main artifact org.apache.karaf.features.core-2.1.99-SNAPSHOT.jar
[INFO ] Retrieving previous build number from apache.snapshots.https
[INFO ] Retrieving previous metadata from apache.snapshots.https
[INFO ] Uploading repository metadata for: 'artifact org.apache.karaf.features:org.apache.karaf.features.core'
[INFO ] Uploading project information for org.apache.karaf.features.core 2.1.99-SNAPSHOT
[INFO ] Retrieving previous metadata from apache.snapshots.https
[INFO ] Uploading repository metadata for: 'snapshot org.apache.karaf.features:org.apache.karaf.features.core:2.1.99-SNAPSHOT'
Deploying the main artifact org.apache.karaf.features.management-2.1.99-SNAPSHOT.jar
[INFO ] Retrieving previous build number from apache.snapshots.https
[INFO ] Retrieving previous metadata from apache.snapshots.https
[INFO ] Uploading repository metadata for: 'snapshot org.apache.karaf.features:org.apache.karaf.features.management:2.1.99-SNAPSHOT'
[INFO ] Uploading project information for org.apache.karaf.features.management 2.1.99-SNAPSHOT
[INFO ] Retrieving previous metadata from apache.snapshots.https
[INFO ] Uploading repository metadata for: 'artifact org.apache.karaf.features:org.apache.karaf.features.management'
Deploying the main artifact org.apache.karaf.features.obr-2.1.99-SNAPSHOT.jar
[INFO ] Retrieving previous build number from apache.snapshots.https
[INFO ] Uploading project information for org.apache.karaf.features.obr 2.1.99-SNAPSHOT
[INFO ] Retrieving previous metadata from apache.snapshots.https
[INFO ] Uploading repository metadata for: 'snapshot org.apache.karaf.features:org.apache.karaf.features.obr:2.1.99-SNAPSHOT'
[INFO ] Retrieving previous metadata from apache.snapshots.https
[INFO ] Uploading repository metadata for: 'artifact org.apache.karaf.features:org.apache.karaf.features.obr'
Deploying the main artifact dependencies-2.1.99-SNAPSHOT.pom
[INFO ] Retrieving previous build number from apache.snapshots.https
[INFO ] Retrieving previous metadata from apache.snapshots.https
[INFO ] Uploading repository metadata for: 'snapshot org.apache.karaf.itests:dependencies:2.1.99-SNAPSHOT'
[INFO ] Retrieving previous metadata from apache.snapshots.https
[INFO ] Uploading repository metadata for: 'artifact org.apache.karaf.itests:dependencies'
Deploying the main artifact itests-2.1.99-SNAPSHOT.pom
[INFO ] Retrieving previous build number from apache.snapshots.https
[INFO ] Retrieving previous metadata from apache.snapshots.https
[INFO ] Uploading repository metadata for: 'snapshot org.apache.karaf.itests:itests:2.1.99-SNAPSHOT'
[INFO ] Retrieving previous metadata from apache.snapshots.https
[INFO ] Uploading repository metadata for: 'artifact org.apache.karaf.itests:itests'
Deploying the main artifact kittests-2.1.99-SNAPSHOT.jar
[INFO ] Retrieving previous build number from apache.snapshots.https
[INFO ] Uploading project information for kittests 2.1.99-SNAPSHOT
[INFO ] Retrieving previous metadata from apache.snapshots.https
[INFO ] Uploading repository metadata for: 'artifact org.apache.karaf.itests:kittests'
[INFO ] Retrieving previous metadata from apache.snapshots.https
[INFO ] Uploading repository metadata for: 'snapshot org.apache.karaf.itests:kittests:2.1.99-SNAPSHOT'
Deploying the main artifact tests-2.1.99-SNAPSHOT.jar
[INFO ] Retrieving previous build number from apache.snapshots.https
[INFO ] Uploading project information for tests 2.1.99-SNAPSHOT
[INFO ] Retrieving previous metadata from apache.snapshots.https
[INFO ] Uploading repository metadata for: 'snapshot org.apache.karaf.itests:tests:2.1.99-SNAPSHOT'
[INFO ] Retrieving previous metadata from apache.snapshots.https
[INFO ] Uploading repository metadata for: 'artifact org.apache.karaf.itests:tests'
Deploying the main artifact jaas-2.1.99-SNAPSHOT.pom
[INFO ] Retrieving previous build number from apache.snapshots.https
[INFO ] Retrieving previous metadata from apache.snapshots.https
[INFO ] Uploading repository metadata for: 'artifact org.apache.karaf.jaas:jaas'
[INFO ] Retrieving previous metadata from apache.snapshots.https
[INFO ] Uploading repository metadata for: 'snapshot org.apache.karaf.jaas:jaas:2.1.99-SNAPSHOT'
Deploying the main artifact org.apache.karaf.jaas.boot-2.1.99-SNAPSHOT.jar
[INFO ] Retrieving previous build number from apache.snapshots.https
[INFO ] Retrieving previous metadata from apache.snapshots.https
[INFO ] Uploading repository metadata for: 'snapshot org.apache.karaf.jaas:org.apache.karaf.jaas.boot:2.1.99-SNAPSHOT'
[INFO ] Retrieving previous metadata from apache.snapshots.https
[INFO ] Uploading repository metadata for: 'artifact org.apache.karaf.jaas:org.apache.karaf.jaas.boot'
[INFO ] Uploading project information for org.apache.karaf.jaas.boot 2.1.99-SNAPSHOT
Deploying the main artifact org.apache.karaf.jaas.command-2.1.99-SNAPSHOT.jar
[INFO ] Retrieving previous build number from apache.snapshots.https
[INFO ] Retrieving previous metadata from apache.snapshots.https
[INFO ] Uploading repository metadata for: 'snapshot org.apache.karaf.jaas:org.apache.karaf.jaas.command:2.1.99-SNAPSHOT'
[INFO ] Uploading project information for org.apache.karaf.jaas.command 2.1.99-SNAPSHOT
[INFO ] Retrieving previous metadata from apache.snapshots.https
[INFO ] Uploading repository metadata for: 'artifact org.apache.karaf.jaas:org.apache.karaf.jaas.command'
Deploying the main artifact org.apache.karaf.jaas.config-2.1.99-SNAPSHOT.jar
[INFO ] Retrieving previous build number from apache.snapshots.https
[INFO ] Retrieving previous metadata from apache.snapshots.https
[INFO ] Uploading repository metadata for: 'artifact org.apache.karaf.jaas:org.apache.karaf.jaas.config'
[INFO ] Retrieving previous metadata from apache.snapshots.https
[INFO ] Uploading repository metadata for: 'snapshot org.apache.karaf.jaas:org.apache.karaf.jaas.config:2.1.99-SNAPSHOT'
[INFO ] Uploading project information for org.apache.karaf.jaas.config 2.1.99-SNAPSHOT
Deploying the main artifact org.apache.karaf.jaas.jasypt-2.1.99-SNAPSHOT.jar
[INFO ] Retrieving previous build number from apache.snapshots.https
[INFO ] Uploading project information for org.apache.karaf.jaas.jasypt 2.1.99-SNAPSHOT
[INFO ] Retrieving previous metadata from apache.snapshots.https
[INFO ] Uploading repository metadata for: 'artifact org.apache.karaf.jaas:org.apache.karaf.jaas.jasypt'
[INFO ] Retrieving previous metadata from apache.snapshots.https
[INFO ] Uploading repository metadata for: 'snapshot org.apache.karaf.jaas:org.apache.karaf.jaas.jasypt:2.1.99-SNAPSHOT'
Deploying the main artifact org.apache.karaf.jaas.modules-2.1.99-SNAPSHOT.jar
[INFO ] Retrieving previous build number from apache.snapshots.https
[INFO ] Uploading project information for org.apache.karaf.jaas.modules 2.1.99-SNAPSHOT
[INFO ] Retrieving previous metadata from apache.snapshots.https
[INFO ] Uploading repository metadata for: 'artifact org.apache.karaf.jaas:org.apache.karaf.jaas.modules'
[INFO ] Retrieving previous metadata from apache.snapshots.https
[INFO ] Uploading repository metadata for: 'snapshot org.apache.karaf.jaas:org.apache.karaf.jaas.modules:2.1.99-SNAPSHOT'
Deploying the main artifact org.apache.karaf.shell.commands-2.1.99-SNAPSHOT.jar
[INFO ] Retrieving previous build number from apache.snapshots.https
[INFO ] Retrieving previous metadata from apache.snapshots.https
[INFO ] Uploading repository metadata for: 'snapshot org.apache.karaf.shell:org.apache.karaf.shell.commands:2.1.99-SNAPSHOT'
[INFO ] Uploading project information for org.apache.karaf.shell.commands 2.1.99-SNAPSHOT
[INFO ] Retrieving previous metadata from apache.snapshots.https
[INFO ] Uploading repository metadata for: 'artifact org.apache.karaf.shell:org.apache.karaf.shell.commands'
Deploying the main artifact org.apache.karaf.shell.config-2.1.99-SNAPSHOT.jar
[INFO ] Retrieving previous build number from apache.snapshots.https
[INFO ] Retrieving previous metadata from apache.snapshots.https
[INFO ] Uploading repository metadata for: 'artifact org.apache.karaf.shell:org.apache.karaf.shell.config'
[INFO ] Retrieving previous metadata from apache.snapshots.https
[INFO ] Uploading repository metadata for: 'snapshot org.apache.karaf.shell:org.apache.karaf.shell.config:2.1.99-SNAPSHOT'
[INFO ] Uploading project information for org.apache.karaf.shell.config 2.1.99-SNAPSHOT
Deploying the main artifact org.apache.karaf.shell.console-2.1.99-SNAPSHOT.jar
[INFO ] Retrieving previous build number from apache.snapshots.https
[INFO ] Uploading project information for org.apache.karaf.shell.console 2.1.99-SNAPSHOT
[INFO ] Retrieving previous metadata from apache.snapshots.https
[INFO ] Uploading repository metadata for: 'snapshot org.apache.karaf.shell:org.apache.karaf.shell.console:2.1.99-SNAPSHOT'
[INFO ] Retrieving previous metadata from apache.snapshots.https
[INFO ] Uploading repository metadata for: 'artifact org.apache.karaf.shell:org.apache.karaf.shell.console'
Deploying the main artifact org.apache.karaf.shell.dev-2.1.99-SNAPSHOT.jar
[INFO ] Retrieving previous build number from apache.snapshots.https
[INFO ] Retrieving previous metadata from apache.snapshots.https
[INFO ] Uploading repository metadata for: 'snapshot org.apache.karaf.shell:org.apache.karaf.shell.dev:2.1.99-SNAPSHOT'
[INFO ] Retrieving previous metadata from apache.snapshots.https
[INFO ] Uploading repository metadata for: 'artifact org.apache.karaf.shell:org.apache.karaf.shell.dev'
[INFO ] Uploading project information for org.apache.karaf.shell.dev 2.1.99-SNAPSHOT
Deploying the main artifact org.apache.karaf.shell.log-2.1.99-SNAPSHOT.jar
[INFO ] Retrieving previous build number from apache.snapshots.https
ERROR: Error deploying artifact: Failed to transfer file: https://repository.apache.org/content/repositories/snapshots/org/apache/karaf/shell/org.apache.karaf.shell.log/2.1.99-SNAPSHOT/org.apache.karaf.shell.log-2.1.99-SNAPSHOT.jar.md5. Return code is: 502
org.apache.maven.artifact.deployer.ArtifactDeploymentException: Error deploying artifact: Failed to transfer file: https://repository.apache.org/content/repositories/snapshots/org/apache/karaf/shell/org.apache.karaf.shell.log/2.1.99-SNAPSHOT/org.apache.karaf.shell.log-2.1.99-SNAPSHOT.jar.md5. Return code is: 502
	at org.apache.maven.artifact.deployer.DefaultArtifactDeployer.deploy(DefaultArtifactDeployer.java:94)
	at hudson.maven.reporters.MavenArtifactRecord.deploy(MavenArtifactRecord.java:119)
	at hudson.maven.reporters.MavenAggregatedArtifactRecord.deploy(MavenAggregatedArtifactRecord.java:79)
	at hudson.maven.RedeployPublisher.perform(RedeployPublisher.java:118)
	at hudson.tasks.BuildStepMonitor$1.perform(BuildStepMonitor.java:19)
	at hudson.model.AbstractBuild$AbstractRunner.perform(AbstractBuild.java:601)
	at hudson.model.AbstractBuild$AbstractRunner.performAllBuildSteps(AbstractBuild.java:580)
	at hudson.maven.MavenModuleSetBuild$RunnerImpl.post2(MavenModuleSetBuild.java:651)
	at hudson.model.AbstractBuild$AbstractRunner.post(AbstractBuild.java:528)
	at hudson.model.Run.run(Run.java:1348)
	at hudson.maven.MavenModuleSetBuild.run(MavenModuleSetBuild.java:349)
	at hudson.model.ResourceController.execute(ResourceController.java:88)
	at hudson.model.Executor.run(Executor.java:139)
Caused by: org.apache.maven.wagon.TransferFailedException: Failed to transfer file: https://repository.apache.org/content/repositories/snapshots/org/apache/karaf/shell/org.apache.karaf.shell.log/2.1.99-SNAPSHOT/org.apache.karaf.shell.log-2.1.99-SNAPSHOT.jar.md5. Return code is: 502
	at org.apache.maven.wagon.providers.http.LightweightHttpWagon.put(LightweightHttpWagon.java:172)
	at org.apache.maven.artifact.manager.DefaultWagonManager.putRemoteFile(DefaultWagonManager.java:266)
	at org.apache.maven.artifact.manager.DefaultWagonManager.putArtifact(DefaultWagonManager.java:160)
	at org.apache.maven.artifact.deployer.DefaultArtifactDeployer.deploy(DefaultArtifactDeployer.java:80)
	... 12 more


Hudson build is back to normal : Karaf #293

Posted by Apache Hudson Server <hu...@hudson.apache.org>.
See <https://hudson.apache.org/hudson/job/Karaf/293/changes>



Build failed in Hudson: Karaf #292

Posted by Apache Hudson Server <hu...@hudson.apache.org>.
See <https://hudson.apache.org/hudson/job/Karaf/292/changes>

Changes:

[iocanel] [KARAF-317] Added dev:watch command.

------------------------------------------
[...truncated 23807 lines...]
436446/?
436959/?
437409/?
438002/?
438674/?
439271/?
439945/?
440525/?
441037/?
441549/?
442126/?
442637/?
443149/?
443730/?
444320/?
444908/?
445228/?
445252/?
445763/?
446275/?
446787/?
447299/?
447812/?
448476/?
448987/?
449500/?
450012/?
450523/?
451035/?
451546/?
452060/?
452688/?
453200/?
453712/?
454223/?
454734/?
455181/?
455755/?
456342/?
456854/?
457365/?
457877/?
458388/?
458910/?
459422/?
459990/?
460620/?
461201/?
461712/?
462223/?
462734/?
463246/?
463757/?
464346/?
464937/?
465569/?
466080/?
466668/?
467180/?
467760/?
468272/?
468783/?
469297/?
469808/?
470380/?
470928/?
470952/?
471654/?
472164/?
473687/?
475870/?
478500/?
481522/?
483973/?
486867/?
489531/?
492691/?
495588/?
498325/?
501013/?
503454/?
505850/?
506489/?
[ maven embedder INFO] [surefire:test]
Downloading: http://repo1.maven.org/maven2/org/apache/maven/surefire/surefire-junit/2.4.2/surefire-junit-2.4.2.pom
934/?
1514/?
Downloading: http://repo1.maven.org/maven2/org/apache/maven/surefire/surefire-providers/2.4.2/surefire-providers-2.4.2.pom
913/?
1712/?
Downloading: http://repo1.maven.org/maven2/org/apache/maven/surefire/surefire-junit/2.4.2/surefire-junit-2.4.2.jar
698/?
1209/?
1721/?
2234/?
2745/?
3257/?
3769/?
4255/?
4787/?
5340/?
5852/?
6416/?
6984/?
7496/?
8008/?
8519/?
8681/?
9193/?
9754/?
10179/?
10771/?
11283/?
11704/?
12213/?
12954/?
13698/?
15089/?
[ maven embedder INFO] Surefire report directory: <https://hudson.apache.org/hudson/job/Karaf/ws/karaf/archetypes/itests/target/archetypes/archetypes-command/de9c980c-5ba5-480e-9043-fe30efdc43ce/target/surefire-reports>

-------------------------------------------------------
 T E S T S
-------------------------------------------------------
Running sample.testcommandTest
Tests run: 1, Failures: 0, Errors: 0, Skipped: 0, Time elapsed: 0.023 sec

Results :

Tests run: 1, Failures: 0, Errors: 0, Skipped: 0

[ maven embedder INFO] [bundle:bundle]
[ maven embedder WARNING] Warning building bundle org.apache.karaf.archetypes:archetypes-command:bundle:2.1.99-SNAPSHOT : Did not find matching referal for !archetypes-command*
Tests run: 1, Failures: 0, Errors: 0, Skipped: 0, Time elapsed: 26.235 sec

Results :

Tests run: 1, Failures: 0, Errors: 0, Skipped: 0

[HUDSON] Recording test results
[INFO] [jar:jar {execution: default-jar}]
[INFO] Building jar: <https://hudson.apache.org/hudson/job/Karaf/ws/karaf/archetypes/itests/target/archetypes-itests-2.1.99-SNAPSHOT.jar>
[INFO] [install:install {execution: default-install}]
[INFO] Installing <https://hudson.apache.org/hudson/job/Karaf/ws/karaf/archetypes/itests/target/archetypes-itests-2.1.99-SNAPSHOT.jar> to <https://hudson.apache.org/hudson/job/Karaf/ws/.repository/org/apache/karaf/archetypes/archetypes-itests/2.1.99-SNAPSHOT/archetypes-itests-2.1.99-SNAPSHOT.jar>
[HUDSON] Archiving <https://hudson.apache.org/hudson/job/Karaf/ws/karaf/archetypes/itests/pom.xml> to /home/hudson/hudson/jobs/Karaf/modules/org.apache.karaf.archetypes$archetypes-itests/builds/2011-01-04_11-06-42/archive/org.apache.karaf.archetypes/archetypes-itests/2.1.99-SNAPSHOT/pom.xml
[HUDSON] Archiving <https://hudson.apache.org/hudson/job/Karaf/ws/karaf/archetypes/itests/target/archetypes-itests-2.1.99-SNAPSHOT.jar> to /home/hudson/hudson/jobs/Karaf/modules/org.apache.karaf.archetypes$archetypes-itests/builds/2011-01-04_11-06-42/archive/org.apache.karaf.archetypes/archetypes-itests/2.1.99-SNAPSHOT/archetypes-itests-2.1.99-SNAPSHOT.jar
[INFO] 
[INFO] 
[INFO] ------------------------------------------------------------------------
[INFO] Reactor Summary:
[INFO] ------------------------------------------------------------------------
[INFO] Apache Karaf .......................................... SUCCESS [3:10.475s]
[INFO] Apache Karaf :: Util .................................. SUCCESS [1:11.806s]
[INFO] Apache Karaf :: Main .................................. SUCCESS [8.930s]
[INFO] Apache Karaf :: Shell ................................. SUCCESS [0.301s]
[INFO] Apache Karaf :: Shell :: Console ...................... SUCCESS [1:30.048s]
[INFO] Apache Karaf :: Shell :: OBR Commands ................. SUCCESS [18.768s]
[INFO] Apache Karaf :: Features .............................. SUCCESS [0.154s]
[INFO] Apache Karaf :: Features :: Core ...................... SUCCESS [23.770s]
[INFO] Apache Karaf :: Features :: Command ................... SUCCESS [12.048s]
[INFO] Apache Karaf :: Management ............................ SUCCESS [4.745s]
[INFO] Apache Karaf :: Features :: Management ................ SUCCESS [15.637s]
[INFO] Apache Karaf :: Features :: OBR Resolver .............. SUCCESS [2.108s]
[INFO] Apache Karaf :: Features :: Enterprise ................ SUCCESS [1:55.465s]
[INFO] Apache Karaf :: Admin ................................. SUCCESS [0.154s]
[INFO] Apache Karaf :: Admin :: Core ......................... SUCCESS [4.410s]
[INFO] Apache Karaf :: Admin :: Command ...................... SUCCESS [6.843s]
[INFO] Apache Karaf :: Admin :: Management ................... SUCCESS [2.038s]
[INFO] Apache Karaf :: Deployer .............................. SUCCESS [0.153s]
[INFO] Apache Karaf :: Deployer :: Spring .................... SUCCESS [3.137s]
[INFO] Apache Karaf :: Deployer :: Blueprint ................. SUCCESS [1.741s]
[INFO] Apache Karaf :: Deployer :: Features .................. SUCCESS [1.509s]
[INFO] Apache Karaf :: Deployer :: WAR ....................... SUCCESS [0.837s]
[INFO] Apache Karaf :: Deployer :: Karaf Archive (.kar) ...... SUCCESS [11.484s]
[INFO] Apache Karaf :: Shell :: Various Commands ............. SUCCESS [2.151s]
[INFO] Apache Karaf :: Shell :: ConfigAdmin Commands ......... SUCCESS [1.916s]
[INFO] Apache Karaf :: Shell :: Log Commands ................. SUCCESS [29.951s]
[INFO] Apache Karaf :: Shell :: OSGi Commands ................ SUCCESS [17.214s]
[INFO] Apache Karaf :: Shell :: PackageAdmin Commands ........ SUCCESS [1.236s]
[INFO] Apache Karaf :: Shell :: SSH .......................... SUCCESS [8.400s]
[INFO] Apache Karaf :: Shell :: Service Wrapper .............. SUCCESS [10.322s]
[INFO] Apache Karaf :: Shell :: Development Commands ......... SUCCESS [28.235s]
[INFO] Apache Karaf :: JAAS .................................. SUCCESS [0.148s]
[INFO] Apache Karaf :: JAAS :: Boot .......................... SUCCESS [0.705s]
[INFO] Apache Karaf :: JAAS :: Config ........................ SUCCESS [19.906s]
[INFO] Apache Karaf :: JAAS :: Modules ....................... SUCCESS [9.218s]
[INFO] Apache Karaf :: JAAS :: Jasypt Encryption ............. SUCCESS [14.072s]
[INFO] Apache Karaf :: Jaas :: Command ....................... SUCCESS [1.355s]
[INFO] Apache Karaf :: Client ................................ SUCCESS [14.857s]
[INFO] Apache Karaf :: Web Console ........................... SUCCESS [0.151s]
[INFO] Apache Karaf :: Web Console :: Console ................ SUCCESS [14.859s]
[INFO] Apache Karaf :: Web Console :: Branding ............... SUCCESS [23.556s]
[INFO] Apache Karaf :: Web Console :: Features Plugin ........ SUCCESS [2.832s]
[INFO] Apache Karaf :: Web Console :: Gogo Plugin ............ SUCCESS [1.537s]
[INFO] Apache Karaf :: Web Console :: Admin Plugin ........... SUCCESS [4.311s]
[INFO] Apache Karaf :: Exception ............................. SUCCESS [1.069s]
[INFO] Apache Karaf :: Diagnostic ............................ SUCCESS [0.150s]
[INFO] Apache Karaf :: Diagnostic :: Core .................... SUCCESS [0.759s]
[INFO] Apache Karaf :: Diagnostic :: Common .................. SUCCESS [18.654s]
[INFO] Apache Karaf :: Diagnostic :: Command ................. SUCCESS [1.231s]
[INFO] Apache Karaf :: Diagnostic :: Management .............. SUCCESS [0.843s]
[INFO] Apache Karaf :: Tooling ............................... SUCCESS [0.147s]
[INFO] Apache Karaf :: Tooling :: Maven2 Features plugin ..... SUCCESS [1:34.634s]
[INFO] Apache Karaf :: Assembly .............................. SUCCESS [9:08.039s]
[INFO] Apache Karaf :: Demos ................................. SUCCESS [0.149s]
[INFO] Apache Karaf :: Demos :: Web .......................... SUCCESS [55.971s]
[INFO] Apache Karaf :: Demos :: Branding ..................... SUCCESS [0.121s]
[INFO] Apache Karaf :: Demos :: Branding :: Shell ............ SUCCESS [0.499s]
[INFO] Apache Karaf :: Integration Tests ..................... SUCCESS [0.150s]
[INFO] Apache Karaf :: Integration Tests :: Dependencies ..... SUCCESS [12.883s]
[INFO] Apache Karaf :: Tooling :: Testing environment ........ SUCCESS [19.033s]
[INFO] Apache Karaf :: Integration Tests :: ITests ........... SUCCESS [1:41.005s]
[INFO] Apache Karaf :: Integration Tests :: Kit Tests ........ SUCCESS [14.116s]
[INFO] Apache Karaf :: Tooling :: Maven2 Command Help plugin . SUCCESS [8.994s]
[INFO] Apache Karaf :: Archetypes ............................ SUCCESS [0.150s]
[INFO] Apache Karaf :: Command Archetype ..................... SUCCESS [0.937s]
[INFO] Apache Karaf :: Archetypes :: ITests .................. SUCCESS [59.430s]
[INFO] ------------------------------------------------------------------------
[INFO] ------------------------------------------------------------------------
[INFO] BUILD SUCCESSFUL
[INFO] ------------------------------------------------------------------------
[INFO] Total time: 34 minutes 36 seconds
[INFO] Finished at: Tue Jan 04 11:41:28 UTC 2011
[INFO] Final Memory: 93M/321M
[INFO] ------------------------------------------------------------------------
channel stopped
Deploying artifacts to https://repository.apache.org/content/repositories/snapshots
Deploying the main artifact apache-karaf-2.1.99-SNAPSHOT.pom
[INFO ] Retrieving previous build number from apache.snapshots.https
ERROR: Error deploying artifact: Failed to transfer file: https://repository.apache.org/content/repositories/snapshots/org/apache/karaf/apache-karaf/2.1.99-SNAPSHOT/apache-karaf-2.1.99-SNAPSHOT.pom.md5. Return code is: 502
org.apache.maven.artifact.deployer.ArtifactDeploymentException: Error deploying artifact: Failed to transfer file: https://repository.apache.org/content/repositories/snapshots/org/apache/karaf/apache-karaf/2.1.99-SNAPSHOT/apache-karaf-2.1.99-SNAPSHOT.pom.md5. Return code is: 502
	at org.apache.maven.artifact.deployer.DefaultArtifactDeployer.deploy(DefaultArtifactDeployer.java:94)
	at hudson.maven.reporters.MavenArtifactRecord.deploy(MavenArtifactRecord.java:119)
	at hudson.maven.reporters.MavenAggregatedArtifactRecord.deploy(MavenAggregatedArtifactRecord.java:79)
	at hudson.maven.RedeployPublisher.perform(RedeployPublisher.java:118)
	at hudson.tasks.BuildStepMonitor$1.perform(BuildStepMonitor.java:19)
	at hudson.model.AbstractBuild$AbstractRunner.perform(AbstractBuild.java:601)
	at hudson.model.AbstractBuild$AbstractRunner.performAllBuildSteps(AbstractBuild.java:580)
	at hudson.maven.MavenModuleSetBuild$RunnerImpl.post2(MavenModuleSetBuild.java:651)
	at hudson.model.AbstractBuild$AbstractRunner.post(AbstractBuild.java:528)
	at hudson.model.Run.run(Run.java:1348)
	at hudson.maven.MavenModuleSetBuild.run(MavenModuleSetBuild.java:349)
	at hudson.model.ResourceController.execute(ResourceController.java:88)
	at hudson.model.Executor.run(Executor.java:139)
Caused by: org.apache.maven.wagon.TransferFailedException: Failed to transfer file: https://repository.apache.org/content/repositories/snapshots/org/apache/karaf/apache-karaf/2.1.99-SNAPSHOT/apache-karaf-2.1.99-SNAPSHOT.pom.md5. Return code is: 502
	at org.apache.maven.wagon.providers.http.LightweightHttpWagon.put(LightweightHttpWagon.java:172)
	at org.apache.maven.artifact.manager.DefaultWagonManager.putRemoteFile(DefaultWagonManager.java:266)
	at org.apache.maven.artifact.manager.DefaultWagonManager.putArtifact(DefaultWagonManager.java:160)
	at org.apache.maven.artifact.deployer.DefaultArtifactDeployer.deploy(DefaultArtifactDeployer.java:80)
	... 12 more