You are viewing a plain text version of this content. The canonical link for it is here.
Posted to builds@beam.apache.org by Apache Jenkins Server <je...@builds.apache.org> on 2023/04/13 11:29:44 UTC
Build failed in Jenkins: beam_PreCommit_Java_GCP_IO_Direct_Cron #1143
See <https://ci-beam.apache.org/job/beam_PreCommit_Java_GCP_IO_Direct_Cron/1143/display/redirect>
Changes:
------------------------------------------
[...truncated 15.77 KB...]
> Task :sdks:java:extensions:protobuf:extractProto
> Task :sdks:java:io:google-cloud-platform:processResources NO-SOURCE
> Task :sdks:java:extensions:protobuf:processResources NO-SOURCE
> Task :runners:direct-java:createCheckerFrameworkManifest
> Task :runners:local-java:createCheckerFrameworkManifest
> Task :runners:local-java:processResources NO-SOURCE
> Task :runners:direct-java:processResources NO-SOURCE
> Task :sdks:java:io:common:createCheckerFrameworkManifest
> Task :sdks:java:extensions:protobuf:extractTestProto
> Task :sdks:java:io:common:compileJava NO-SOURCE
> Task :runners:direct-java:processTestResources NO-SOURCE
> Task :sdks:java:io:common:processResources NO-SOURCE
> Task :sdks:java:io:common:classes UP-TO-DATE
> Task :sdks:java:testing:test-utils:createCheckerFrameworkManifest
> Task :sdks:java:testing:test-utils:processResources NO-SOURCE
> Task :sdks:java:testing:test-utils:processTestResources NO-SOURCE
> Task :sdks:java:io:jdbc:createCheckerFrameworkManifest
> Task :sdks:java:extensions:schemaio-expansion-service:createCheckerFrameworkManifest
> Task :sdks:java:io:common:jar
> Task :sdks:java:io:jdbc:processResources NO-SOURCE
> Task :sdks:java:extensions:schemaio-expansion-service:processResources NO-SOURCE
> Task :sdks:java:extensions:protobuf:processTestResources
> Task :sdks:java:io:common:processTestResources NO-SOURCE
> Task :sdks:java:io:google-cloud-platform:expansion-service:createCheckerFrameworkManifest
> Task :sdks:java:io:google-cloud-platform:expansion-service:processResources NO-SOURCE
> Task :sdks:java:io:google-cloud-platform:expansion-service:processTestResources NO-SOURCE
> Task :sdks:java:core:processResources
> Task :sdks:java:core:generateTestAvroProtocol NO-SOURCE
> Task :sdks:java:io:google-cloud-platform:processTestResources
> Task :sdks:java:core:generateTestAvroJava
> Task :sdks:java:core:generateTestGrammarSource NO-SOURCE
> Task :sdks:java:extensions:avro:generateTestAvroJava
> Task :sdks:java:extensions:avro:processTestResources NO-SOURCE
> Task :sdks:java:core:processTestResources
> Task :model:pipeline:extractIncludeProto
> Task :model:pipeline:extractProto
> Task :model:pipeline:generateProto FROM-CACHE
> Task :model:pipeline:compileJava FROM-CACHE
> Task :model:pipeline:processResources
> Task :model:pipeline:classes
> Task :model:pipeline:jar
> Task :model:pipeline:shadowJar FROM-CACHE
> Task :model:fn-execution:extractIncludeProto
> Task :model:job-management:extractIncludeProto
> Task :model:job-management:generateProto FROM-CACHE
> Task :model:fn-execution:generateProto FROM-CACHE
> Task :model:job-management:compileJava FROM-CACHE
> Task :model:job-management:classes
> Task :model:fn-execution:compileJava FROM-CACHE
> Task :model:fn-execution:classes
> Task :model:job-management:shadowJar FROM-CACHE
> Task :model:fn-execution:shadowJar FROM-CACHE
> Task :sdks:java:core:compileJava FROM-CACHE
> Task :sdks:java:core:classes
> Task :sdks:java:core:shadowJar FROM-CACHE
> Task :runners:local-java:compileJava FROM-CACHE
> Task :runners:local-java:classes UP-TO-DATE
> Task :runners:local-java:jar
> Task :sdks:java:extensions:arrow:compileJava FROM-CACHE
> Task :sdks:java:extensions:arrow:classes UP-TO-DATE
> Task :sdks:java:extensions:arrow:jar
> Task :sdks:java:extensions:avro:compileJava FROM-CACHE
> Task :sdks:java:extensions:avro:classes UP-TO-DATE
> Task :sdks:java:testing:test-utils:compileJava FROM-CACHE
> Task :sdks:java:testing:test-utils:classes UP-TO-DATE
> Task :sdks:java:io:common:compileTestJava FROM-CACHE
> Task :sdks:java:io:common:testClasses UP-TO-DATE
> Task :sdks:java:testing:test-utils:jar
> Task :sdks:java:io:common:testJar
> Task :sdks:java:extensions:avro:jar
> Task :sdks:java:testing:test-utils:compileTestJava FROM-CACHE
> Task :sdks:java:testing:test-utils:testClasses UP-TO-DATE
> Task :sdks:java:fn-execution:compileJava FROM-CACHE
> Task :sdks:java:fn-execution:classes UP-TO-DATE
> Task :sdks:java:testing:test-utils:testJar
> Task :sdks:java:fn-execution:jar
> Task :sdks:java:extensions:protobuf:extractIncludeProto
> Task :sdks:java:extensions:protobuf:generateProto NO-SOURCE
> Task :runners:core-construction-java:compileJava FROM-CACHE
> Task :runners:core-construction-java:classes UP-TO-DATE
> Task :sdks:java:extensions:protobuf:compileJava FROM-CACHE
> Task :sdks:java:extensions:protobuf:classes UP-TO-DATE
> Task :runners:core-construction-java:jar
> Task :sdks:java:extensions:protobuf:jar
> Task :runners:core-java:compileJava FROM-CACHE
> Task :runners:core-java:classes UP-TO-DATE
> Task :runners:core-java:jar
> Task :sdks:java:core:compileTestJava FROM-CACHE
> Task :sdks:java:core:testClasses
> Task :sdks:java:extensions:google-cloud-platform-core:compileJava FROM-CACHE
> Task :sdks:java:extensions:google-cloud-platform-core:classes UP-TO-DATE
> Task :sdks:java:harness:compileJava FROM-CACHE
> Task :sdks:java:harness:classes UP-TO-DATE
> Task :sdks:java:extensions:google-cloud-platform-core:jar
> Task :sdks:java:core:shadowTestJar FROM-CACHE
> Task :sdks:java:harness:jar
> Task :runners:java-fn-execution:compileJava FROM-CACHE
> Task :runners:java-fn-execution:classes UP-TO-DATE
> Task :runners:java-fn-execution:jar
> Task :sdks:java:expansion-service:compileJava FROM-CACHE
> Task :sdks:java:expansion-service:classes UP-TO-DATE
> Task :sdks:java:expansion-service:jar
> Task :runners:direct-java:compileJava FROM-CACHE
> Task :runners:direct-java:classes UP-TO-DATE
> Task :sdks:java:extensions:avro:compileTestJava FROM-CACHE
> Task :sdks:java:extensions:avro:testClasses UP-TO-DATE
> Task :sdks:java:extensions:google-cloud-platform-core:compileTestJava FROM-CACHE
> Task :sdks:java:extensions:google-cloud-platform-core:testClasses UP-TO-DATE
> Task :sdks:java:extensions:avro:testJar
> Task :runners:core-java:compileTestJava FROM-CACHE
> Task :runners:core-java:testClasses UP-TO-DATE
> Task :sdks:java:extensions:google-cloud-platform-core:testJar
> Task :runners:core-java:testJar
> Task :runners:direct-java:shadowJar FROM-CACHE
> Task :runners:direct-java:compileTestJava FROM-CACHE
> Task :runners:direct-java:testClasses UP-TO-DATE
> Task :sdks:java:io:google-cloud-platform:compileJava FROM-CACHE
> Task :sdks:java:io:google-cloud-platform:classes UP-TO-DATE
> Task :runners:direct-java:shadowTestJar FROM-CACHE
> Task :sdks:java:io:google-cloud-platform:jar
> Task :sdks:java:io:google-cloud-platform:assemble
> Task :sdks:java:extensions:protobuf:extractIncludeTestProto
> Task :sdks:java:extensions:protobuf:generateTestProto FROM-CACHE
> Task :sdks:java:extensions:protobuf:compileTestJava FROM-CACHE
> Task :sdks:java:extensions:protobuf:testClasses
> Task :sdks:java:extensions:protobuf:testJar
> Task :sdks:java:io:google-cloud-platform:analyzeClassesDependencies
> Task :sdks:java:io:google-cloud-platform:compileTestJava FROM-CACHE
> Task :sdks:java:io:google-cloud-platform:testClasses
> Task :sdks:java:io:google-cloud-platform:analyzeTestClassesDependencies SKIPPED
> Task :sdks:java:io:google-cloud-platform:analyzeDependencies
> Task :sdks:java:io:google-cloud-platform:checkstyleMain SKIPPED
> Task :sdks:java:io:google-cloud-platform:checkstyleTest SKIPPED
> Task :sdks:java:io:google-cloud-platform:javadoc
<https://ci-beam.apache.org/job/beam_PreCommit_Java_GCP_IO_Direct_Cron/ws/src/sdks/java/io/google-cloud-platform/src/main/java/org/apache/beam/sdk/io/gcp/bigquery/RetryManager.java>:88: error: cannot find symbol
static class Operation<ResultT, ContextT extends Context<ResultT>> {
^
symbol: class Context
location: class RetryManager<ResultT,ContextT>
where ResultT,ContextT are type-variables:
ResultT declared in class RetryManager
ContextT declared in class RetryManager
<https://ci-beam.apache.org/job/beam_PreCommit_Java_GCP_IO_Direct_Cron/ws/src/sdks/java/io/google-cloud-platform/src/main/java/org/apache/beam/sdk/io/gcp/spanner/changestreams/action/DetectNewPartitionsAction.java>:48: warning - Tag @link: can't find run(RestrictionTracker, OutputReceiver, ManualWatermarkEstimator) in org.apache.beam.sdk.io.gcp.spanner.changestreams.action.DetectNewPartitionsAction
<https://ci-beam.apache.org/job/beam_PreCommit_Java_GCP_IO_Direct_Cron/ws/src/sdks/java/io/google-cloud-platform/src/main/java/org/apache/beam/sdk/io/gcp/pubsub/PubsubUnboundedSource.java>:120: warning - Tag @link: can't find read in org.apache.beam.sdk.io.gcp.pubsub.PubsubIO
<https://ci-beam.apache.org/job/beam_PreCommit_Java_GCP_IO_Direct_Cron/ws/src/sdks/java/io/google-cloud-platform/src/main/java/org/apache/beam/sdk/io/gcp/spanner/SpannerIO.java>:1130: warning - Tag @link: can't find withFailureMode(FailureMode) in org.apache.beam.sdk.io.gcp.spanner.SpannerIO.Write
<https://ci-beam.apache.org/job/beam_PreCommit_Java_GCP_IO_Direct_Cron/ws/src/sdks/java/io/google-cloud-platform/src/main/java/org/apache/beam/sdk/io/gcp/spanner/changestreams/model/ChildPartition.java>:68: warning - Tag @link: missing '#': "ChildPartition(String, HashSet)"
<https://ci-beam.apache.org/job/beam_PreCommit_Java_GCP_IO_Direct_Cron/ws/src/sdks/java/io/google-cloud-platform/src/main/java/org/apache/beam/sdk/io/gcp/bigquery/BigQueryIO.java>:486: warning - Tag @link: can't find withQueryPriority(TypedRead.QueryPriority) in org.apache.beam.sdk.io.gcp.bigquery.BigQueryIO.TypedRead
<https://ci-beam.apache.org/job/beam_PreCommit_Java_GCP_IO_Direct_Cron/ws/src/sdks/java/io/google-cloud-platform/src/main/java/org/apache/beam/sdk/io/gcp/bigquery/BigQueryIO.java>:801: warning - Tag @link: can't find withoutResultFlattening in org.apache.beam.sdk.io.Read
<https://ci-beam.apache.org/job/beam_PreCommit_Java_GCP_IO_Direct_Cron/ws/src/sdks/java/io/google-cloud-platform/src/main/java/org/apache/beam/sdk/io/gcp/bigquery/BigQueryIO.java>:801: warning - Tag @link: can't find usingStandardSql in org.apache.beam.sdk.io.Read
<https://ci-beam.apache.org/job/beam_PreCommit_Java_GCP_IO_Direct_Cron/ws/src/sdks/java/io/google-cloud-platform/src/main/java/org/apache/beam/sdk/io/gcp/bigquery/BigQueryIO.java>:1846: warning - Tag @link: can't find from(String) in org.apache.beam.sdk.io.Read
<https://ci-beam.apache.org/job/beam_PreCommit_Java_GCP_IO_Direct_Cron/ws/src/sdks/java/io/google-cloud-platform/src/main/java/org/apache/beam/sdk/io/gcp/bigquery/BigQueryIO.java>:1873: warning - Tag @link: can't find from(TableReference) in org.apache.beam.sdk.io.Read
<https://ci-beam.apache.org/job/beam_PreCommit_Java_GCP_IO_Direct_Cron/ws/src/sdks/java/io/google-cloud-platform/src/main/java/org/apache/beam/sdk/io/gcp/bigquery/BigQueryIO.java>:1851: warning - Tag @link: can't find from(ValueProvider) in org.apache.beam.sdk.io.Read
<https://ci-beam.apache.org/job/beam_PreCommit_Java_GCP_IO_Direct_Cron/ws/src/sdks/java/io/google-cloud-platform/src/main/java/org/apache/beam/sdk/io/gcp/bigquery/BigQueryIO.java>:1862: warning - Tag @link: can't find fromQuery(String) in org.apache.beam.sdk.io.Read
<https://ci-beam.apache.org/job/beam_PreCommit_Java_GCP_IO_Direct_Cron/ws/src/sdks/java/io/google-cloud-platform/src/main/java/org/apache/beam/sdk/io/gcp/bigquery/BigQueryIO.java>:1867: warning - Tag @link: can't find fromQuery(ValueProvider) in org.apache.beam.sdk.io.Read
<https://ci-beam.apache.org/job/beam_PreCommit_Java_GCP_IO_Direct_Cron/ws/src/sdks/java/io/google-cloud-platform/src/main/java/org/apache/beam/sdk/io/gcp/bigquery/BigQueryIO.java>:1810: warning - Tag @link: can't find getTable() in org.apache.beam.sdk.io.Read
<https://ci-beam.apache.org/job/beam_PreCommit_Java_GCP_IO_Direct_Cron/ws/src/sdks/java/io/google-cloud-platform/src/main/java/org/apache/beam/sdk/io/gcp/bigquery/BigQueryIO.java>:1803: warning - Tag @link: can't find getTableProvider() in org.apache.beam.sdk.io.Read
<https://ci-beam.apache.org/job/beam_PreCommit_Java_GCP_IO_Direct_Cron/ws/src/sdks/java/io/google-cloud-platform/src/main/java/org/apache/beam/sdk/io/gcp/bigquery/BigQueryIO.java>:1888: warning - Tag @link: can't find usingStandardSql() in org.apache.beam.sdk.io.Read
<https://ci-beam.apache.org/job/beam_PreCommit_Java_GCP_IO_Direct_Cron/ws/src/sdks/java/io/google-cloud-platform/src/main/java/org/apache/beam/sdk/io/gcp/bigquery/BigQueryIO.java>:1883: warning - Tag @link: can't find withoutResultFlattening() in org.apache.beam.sdk.io.Read
<https://ci-beam.apache.org/job/beam_PreCommit_Java_GCP_IO_Direct_Cron/ws/src/sdks/java/io/google-cloud-platform/src/main/java/org/apache/beam/sdk/io/gcp/bigquery/BigQueryIO.java>:1878: warning - Tag @link: can't find withoutValidation() in org.apache.beam.sdk.io.Read
<https://ci-beam.apache.org/job/beam_PreCommit_Java_GCP_IO_Direct_Cron/ws/src/sdks/java/io/google-cloud-platform/src/main/java/org/apache/beam/sdk/io/gcp/bigquery/BigQueryIO.java>:2437: warning - Tag @link: can't find STREAMING_INSERTS in org.apache.beam.sdk.io.gcp.bigquery.BigQueryIO.TypedRead.Method
<https://ci-beam.apache.org/job/beam_PreCommit_Java_GCP_IO_Direct_Cron/ws/src/sdks/java/io/google-cloud-platform/src/main/java/org/apache/beam/sdk/io/gcp/bigquery/CivilTimeEncoder.java>:139: warning - Tag @see: can't find encodePacked32TimeSecondsAsJavaTime(int) in org.apache.beam.sdk.io.gcp.bigquery.CivilTimeEncoder
20 warnings
> Task :sdks:java:io:jdbc:compileJava
Note: <https://ci-beam.apache.org/job/beam_PreCommit_Java_GCP_IO_Direct_Cron/ws/src/sdks/java/io/jdbc/src/main/java/org/apache/beam/sdk/io/jdbc/JdbcIO.java> uses or overrides a deprecated API.
Note: Recompile with -Xlint:deprecation for details.
Note: Some input files use unchecked or unsafe operations.
Note: Recompile with -Xlint:unchecked for details.
> Task :sdks:java:io:jdbc:classes
> Task :sdks:java:io:jdbc:jar
> Task :sdks:java:extensions:schemaio-expansion-service:compileJava
Note: <https://ci-beam.apache.org/job/beam_PreCommit_Java_GCP_IO_Direct_Cron/ws/src/sdks/java/extensions/schemaio-expansion-service/src/main/java/org/apache/beam/sdk/extensions/schemaio/expansion/ExternalSchemaIOTransformRegistrar.java> uses unchecked or unsafe operations.
Note: Recompile with -Xlint:unchecked for details.
> Task :sdks:java:extensions:schemaio-expansion-service:classes
> Task :sdks:java:extensions:schemaio-expansion-service:jar
> Task :sdks:java:io:google-cloud-platform:expansion-service:compileJava NO-SOURCE
> Task :sdks:java:io:google-cloud-platform:expansion-service:classes UP-TO-DATE
> Task :sdks:java:io:google-cloud-platform:expansion-service:jar
> Task :sdks:java:io:google-cloud-platform:expansion-service:compileTestJava NO-SOURCE
> Task :sdks:java:io:google-cloud-platform:expansion-service:testClasses UP-TO-DATE
> Task :sdks:java:io:google-cloud-platform:expansion-service:packageTests
> Task :sdks:java:io:google-cloud-platform:expansion-service:analyzeTestClassesDependencies SKIPPED
> Task :sdks:java:io:google-cloud-platform:expansion-service:checkstyleMain SKIPPED
> Task :sdks:java:io:google-cloud-platform:expansion-service:checkstyleTest SKIPPED
> Task :sdks:java:io:google-cloud-platform:expansion-service:javadoc NO-SOURCE
> Task :sdks:java:io:google-cloud-platform:expansion-service:spotbugsMain NO-SOURCE
> Task :sdks:java:io:google-cloud-platform:expansion-service:spotbugsTest SKIPPED
> Task :sdks:java:extensions:schemaio-expansion-service:shadowJar
> Task :sdks:java:io:google-cloud-platform:expansion-service:startScripts
> Task :sdks:java:io:google-cloud-platform:expansion-service:distTar
> Task :sdks:java:io:google-cloud-platform:test
> Task :sdks:java:io:google-cloud-platform:expansion-service:distZip
> Task :sdks:java:io:google-cloud-platform:expansion-service:shadowJar
> Task :sdks:java:io:google-cloud-platform:expansion-service:startShadowScripts
> Task :sdks:java:io:google-cloud-platform:expansion-service:shadowDistTar
> Task :sdks:java:io:google-cloud-platform:expansion-service:shadowDistZip
> Task :sdks:java:io:google-cloud-platform:expansion-service:assemble
> Task :sdks:java:io:google-cloud-platform:expansion-service:analyzeClassesDependencies
> Task :sdks:java:io:google-cloud-platform:expansion-service:analyzeDependencies
> Task :sdks:java:io:google-cloud-platform:expansion-service:test NO-SOURCE
> Task :sdks:java:io:google-cloud-platform:expansion-service:check
> Task :sdks:java:io:google-cloud-platform:expansion-service:build
> Task :sdks:java:io:google-cloud-platform:spannerCodeCoverageReport
> Task :sdks:java:io:google-cloud-platform:spannerCodeCoverageVerification
> Task :sdks:java:io:google-cloud-platform:check
> Task :sdks:java:io:google-cloud-platform:build
> Task :sdks:java:io:google-cloud-platform:integrationTest
org.apache.beam.sdk.io.gcp.spanner.SpannerReadIT > testReadWithDataBoost FAILED
org.apache.beam.sdk.Pipeline$PipelineExecutionException at SpannerReadIT.java:214
Caused by: com.google.cloud.spanner.SpannerException at SpannerExceptionFactory.java:291
Caused by: com.google.cloud.spanner.SpannerException at SpannerExceptionFactory.java:291
Caused by: io.grpc.StatusRuntimeException at Status.java:539
94 tests completed, 1 failed, 1 skipped
> Task :sdks:java:io:google-cloud-platform:integrationTest FAILED
> Task :sdks:java:io:google-cloud-platform:integrationTestKms
FAILURE: Build failed with an exception.
* What went wrong:
Execution failed for task ':sdks:java:io:google-cloud-platform:integrationTest'.
> There were failing tests. See the report at: file://<https://ci-beam.apache.org/job/beam_PreCommit_Java_GCP_IO_Direct_Cron/ws/src/sdks/java/io/google-cloud-platform/build/reports/tests/integrationTest/index.html>
* Try:
> Run with --stacktrace option to get the stack trace.
> Run with --info or --debug option to get more log output.
* Get more help at https://help.gradle.org
Deprecated Gradle features were used in this build, making it incompatible with Gradle 8.0.
You can use '--warning-mode all' to show the individual deprecation warnings and determine if they come from your own scripts or plugins.
See https://docs.gradle.org/7.5.1/userguide/command_line_interface.html#sec:command_line_warnings
BUILD FAILED in 41m 14s
129 actionable tasks: 88 executed, 41 from cache
Publishing build scan...
https://gradle.com/s/2kcdthi52r2p4
Build step 'Invoke Gradle script' changed build result to FAILURE
Build step 'Invoke Gradle script' marked build as failure
---------------------------------------------------------------------
To unsubscribe, e-mail: builds-unsubscribe@beam.apache.org
For additional commands, e-mail: builds-help@beam.apache.org
Jenkins build is back to normal : beam_PreCommit_Java_GCP_IO_Direct_Cron #1145
Posted by Apache Jenkins Server <je...@builds.apache.org>.
See <https://ci-beam.apache.org/job/beam_PreCommit_Java_GCP_IO_Direct_Cron/1145/display/redirect>
---------------------------------------------------------------------
To unsubscribe, e-mail: builds-unsubscribe@beam.apache.org
For additional commands, e-mail: builds-help@beam.apache.org
Build failed in Jenkins: beam_PreCommit_Java_GCP_IO_Direct_Cron #1144
Posted by Apache Jenkins Server <je...@builds.apache.org>.
See <https://ci-beam.apache.org/job/beam_PreCommit_Java_GCP_IO_Direct_Cron/1144/display/redirect>
Changes:
------------------------------------------
Started by timer
Running as SYSTEM
[EnvInject] - Loading node environment variables.
Building remotely on apache-beam-jenkins-4 (beam) in workspace <https://ci-beam.apache.org/job/beam_PreCommit_Java_GCP_IO_Direct_Cron/ws/>
The recommended git tool is: NONE
No credentials specified
Wiping out workspace first.
Cloning the remote Git repository
Using shallow clone with depth 1
Avoid fetching tags
Cloning repository https://github.com/apache/beam.git
> git init <https://ci-beam.apache.org/job/beam_PreCommit_Java_GCP_IO_Direct_Cron/ws/src> # timeout=10
Fetching upstream changes from https://github.com/apache/beam.git
> git --version # timeout=10
> git --version # 'git version 2.25.1'
> git fetch --no-tags --force --progress --depth=1 -- https://github.com/apache/beam.git +refs/heads/*:refs/remotes/origin/* # timeout=10
> git config remote.origin.url https://github.com/apache/beam.git # timeout=10
> git config --add remote.origin.fetch +refs/heads/*:refs/remotes/origin/* # timeout=10
> git config remote.origin.url https://github.com/apache/beam.git # timeout=10
Using shallow fetch with depth 1
Fetching upstream changes from https://github.com/apache/beam.git
> git fetch --no-tags --force --progress --depth=1 -- https://github.com/apache/beam.git +refs/heads/*:refs/remotes/origin/* +refs/pull/${ghprbPullId}/*:refs/remotes/origin/pr/${ghprbPullId}/* # timeout=10
> git rev-parse origin/master^{commit} # timeout=10
Checking out Revision 837733e862007cbeba0a57f682109d9debec9340 (origin/master)
> git config core.sparsecheckout # timeout=10
> git checkout -f 837733e862007cbeba0a57f682109d9debec9340 # timeout=10
Commit message: "Add Gradle sub-projects to enable parallel running of Kafka tests (#26153)"
> git rev-list --no-walk cd0f44b3751c9d4b583b2a3e2e1d10aeb75695b9 # timeout=10
First time build. Skipping changelog.
No emails were triggered.
[EnvInject] - Executing scripts and injecting environment variables after the SCM step.
[EnvInject] - Injecting as environment variables the properties content
SETUPTOOLS_USE_DISTUTILS=stdlib
SPARK_LOCAL_IP=127.0.0.1
[EnvInject] - Variables injected successfully.
[Gradle] - Launching build.
[src] $ <https://ci-beam.apache.org/job/beam_PreCommit_Java_GCP_IO_Direct_Cron/ws/src/gradlew> -PdisableSpotlessCheck=true -PdisableCheckStyle=true -PenableJacocoReport --continue --max-workers=8 -Dorg.gradle.jvmargs=-Xms2g -Dorg.gradle.jvmargs=-Xmx6g -Dorg.gradle.vfs.watch=false -Pdocker-pull-licenses :sdks:java:io:google-cloud-platform:build :sdks:java:io:google-cloud-platform:expansion-service:build :sdks:java:io:google-cloud-platform:postCommit
To honour the JVM settings for this build a single-use Daemon process will be forked. See https://docs.gradle.org/7.5.1/userguide/gradle_daemon.html#sec:disabling_the_daemon.
Daemon will be stopped at the end of the build
Configuration on demand is an incubating feature.
> Task :buildSrc:compileJava NO-SOURCE
> Task :buildSrc:compileGroovy FROM-CACHE
> Task :buildSrc:pluginDescriptors
> Task :buildSrc:processResources
> Task :buildSrc:classes
> Task :buildSrc:jar
> Task :buildSrc:assemble
> Task :buildSrc:pluginUnderTestMetadata
> Task :buildSrc:compileTestJava NO-SOURCE
> Task :buildSrc:compileTestGroovy NO-SOURCE
> Task :buildSrc:processTestResources NO-SOURCE
> Task :buildSrc:testClasses UP-TO-DATE
> Task :buildSrc:test NO-SOURCE
> Task :buildSrc:validatePlugins FROM-CACHE
> Task :buildSrc:check UP-TO-DATE
> Task :buildSrc:build
FAILURE: Build failed with an exception.
* Where:
Build file '<https://ci-beam.apache.org/job/beam_PreCommit_Java_GCP_IO_Direct_Cron/ws/src/runners/direct-java/build.gradle'> line: 222
* What went wrong:
A problem occurred evaluating project ':runners:direct-java'.
> A problem occurred configuring project ':release'.
> Failed to store cache entry 30717213e65af1c56d9d10b41703e3ef for Kotlin DSL accessors for project ':release': Timeout waiting to lock Build cache (/home/jenkins/.gradle/caches/build-cache-1). It is currently in use by another Gradle instance.
Owner PID: 636279
Our PID: 663977
Owner Operation:
Our operation:
Lock file: /home/jenkins/.gradle/caches/build-cache-1/build-cache-1.lock
* Try:
> Run with --stacktrace option to get the stack trace.
> Run with --info or --debug option to get more log output.
* Get more help at https://help.gradle.org
Deprecated Gradle features were used in this build, making it incompatible with Gradle 8.0.
You can use '--warning-mode all' to show the individual deprecation warnings and determine if they come from your own scripts or plugins.
See https://docs.gradle.org/7.5.1/userguide/command_line_interface.html#sec:command_line_warnings
BUILD FAILED in 2m 46s
6 actionable tasks: 4 executed, 2 from cache
Publishing build scan...
https://gradle.com/s/n3wbz2a6e3ohi
Build step 'Invoke Gradle script' changed build result to FAILURE
Build step 'Invoke Gradle script' marked build as failure
---------------------------------------------------------------------
To unsubscribe, e-mail: builds-unsubscribe@beam.apache.org
For additional commands, e-mail: builds-help@beam.apache.org