You are viewing a plain text version of this content. The canonical link for it is here.
Posted to dev@zookeeper.apache.org by Apache Jenkins Server <je...@builds.apache.org> on 2014/01/15 10:51:18 UTC
Failed: ZOOKEEPER-1837 PreCommit Build #1885
Jira: https://issues.apache.org/jira/browse/ZOOKEEPER-1837
Build: https://builds.apache.org/job/PreCommit-ZOOKEEPER-Build/1885/
###################################################################################
########################## LAST 60 LINES OF THE CONSOLE ###########################
Started by remote host 127.0.0.1
Building remotely on hadoop9 in workspace /home/jenkins/jenkins-slave/workspace/PreCommit-ZOOKEEPER-Build
Reverting /home/jenkins/jenkins-slave/workspace/PreCommit-ZOOKEEPER-Build/trunk to depth infinity with ignoreExternals: false
Updating http://svn.apache.org/repos/asf/zookeeper/trunk at revision '2014-01-15T09:50:51.944 +0000'
At revision 1558326
no change for http://svn.apache.org/repos/asf/zookeeper/trunk since the previous build
No emails were triggered.
[PreCommit-ZOOKEEPER-Build] $ /bin/bash /tmp/hudson8690960817330539275.sh
/home/jenkins/tools/java/latest/bin/java
Buildfile: build.xml
check-for-findbugs:
findbugs.check:
forrest.check:
hudson-test-patch:
[exec]
[exec]
[exec] ======================================================================
[exec] ======================================================================
[exec] Testing patch for ZOOKEEPER-1837.
[exec] ======================================================================
[exec] ======================================================================
[exec]
[exec]
[exec] At revision 1558327.
[exec] ZOOKEEPER-1837 is not "Patch Available". Exiting.
[exec]
[exec]
[exec] ======================================================================
[exec] ======================================================================
[exec] Finished build.
[exec] ======================================================================
[exec] ======================================================================
[exec]
[exec]
BUILD SUCCESSFUL
Total time: 19 seconds
Archiving artifacts
ERROR: No artifacts found that match the file pattern "trunk/build/test/findbugs/newPatchFindbugsWarnings.html,trunk/patchprocess/*.txt,trunk/patchprocess/*Warnings.xml,trunk/build/test/test-cppunit/*.txt,trunk/build/tmp/zk.log". Configuration error?
ERROR: ?trunk/build/test/findbugs/newPatchFindbugsWarnings.html? doesn?t match anything: ?trunk? exists but not ?trunk/build/test/findbugs/newPatchFindbugsWarnings.html?
Build step 'Archive the artifacts' changed build result to FAILURE
Recording test results
Description set: ZOOKEEPER-1837
Email was triggered for: Failure
Sending email for trigger: Failure
###################################################################################
############################## FAILED TESTS (if any) ##############################
No tests ran.
Success: ZOOKEEPER-1837 PreCommit Build #1887
Posted by Apache Jenkins Server <je...@builds.apache.org>.
Jira: https://issues.apache.org/jira/browse/ZOOKEEPER-1837
Build: https://builds.apache.org/job/PreCommit-ZOOKEEPER-Build/1887/
###################################################################################
########################## LAST 60 LINES OF THE CONSOLE ###########################
[...truncated 291535 lines...]
[exec] BUILD SUCCESSFUL
[exec] Total time: 0 seconds
[exec]
[exec]
[exec]
[exec]
[exec] +1 overall. Here are the results of testing the latest attachment
[exec] http://issues.apache.org/jira/secure/attachment/12623133/ZOOKEEPER-1837.patch
[exec] against trunk revision 1557875.
[exec]
[exec] +1 @author. The patch does not contain any @author tags.
[exec]
[exec] +1 tests included. The patch appears to include 9 new or modified tests.
[exec]
[exec] +1 javadoc. The javadoc tool did not generate any warning messages.
[exec]
[exec] +1 javac. The applied patch does not increase the total number of javac compiler warnings.
[exec]
[exec] +1 findbugs. The patch does not introduce any new Findbugs (version 1.3.9) warnings.
[exec]
[exec] +1 release audit. The applied patch does not increase the total number of release audit warnings.
[exec]
[exec] +1 core tests. The patch passed core unit tests.
[exec]
[exec] +1 contrib tests. The patch passed contrib unit tests.
[exec]
[exec] Test results: https://builds.apache.org/job/PreCommit-ZOOKEEPER-Build/1887//testReport/
[exec] Findbugs warnings: https://builds.apache.org/job/PreCommit-ZOOKEEPER-Build/1887//artifact/trunk/build/test/findbugs/newPatchFindbugsWarnings.html
[exec] Console output: https://builds.apache.org/job/PreCommit-ZOOKEEPER-Build/1887//console
[exec]
[exec] This message is automatically generated.
[exec]
[exec]
[exec] ======================================================================
[exec] ======================================================================
[exec] Adding comment to Jira.
[exec] ======================================================================
[exec] ======================================================================
[exec]
[exec]
[exec] Comment added.
[exec] 03f34447a70ab0d7293d950ec61a324b08b1b154 logged out
[exec]
[exec]
[exec] ======================================================================
[exec] ======================================================================
[exec] Finished build.
[exec] ======================================================================
[exec] ======================================================================
[exec]
[exec]
BUILD SUCCESSFUL
Total time: 33 minutes 45 seconds
Archiving artifacts
Recording test results
Description set: ZOOKEEPER-1837
Email was triggered for: Success
Sending email for trigger: Success
###################################################################################
############################## FAILED TESTS (if any) ##############################
All tests passed
Failed: ZOOKEEPER-442 PreCommit Build #1886
Posted by Apache Jenkins Server <je...@builds.apache.org>.
Jira: https://issues.apache.org/jira/browse/ZOOKEEPER-442
Build: https://builds.apache.org/job/PreCommit-ZOOKEEPER-Build/1886/
###################################################################################
########################## LAST 60 LINES OF THE CONSOLE ###########################
[...truncated 291627 lines...]
[exec]
[exec]
[exec]
[exec] -1 overall. Here are the results of testing the latest attachment
[exec] http://issues.apache.org/jira/secure/attachment/12623108/ZOOKEEPER-442.patch
[exec] against trunk revision 1557875.
[exec]
[exec] +1 @author. The patch does not contain any @author tags.
[exec]
[exec] +1 tests included. The patch appears to include 3 new or modified tests.
[exec]
[exec] +1 javadoc. The javadoc tool did not generate any warning messages.
[exec]
[exec] +1 javac. The applied patch does not increase the total number of javac compiler warnings.
[exec]
[exec] +1 findbugs. The patch does not introduce any new Findbugs (version 1.3.9) warnings.
[exec]
[exec] +1 release audit. The applied patch does not increase the total number of release audit warnings.
[exec]
[exec] -1 core tests. The patch failed core unit tests.
[exec]
[exec] +1 contrib tests. The patch passed contrib unit tests.
[exec]
[exec] Test results: https://builds.apache.org/job/PreCommit-ZOOKEEPER-Build/1886//testReport/
[exec] Findbugs warnings: https://builds.apache.org/job/PreCommit-ZOOKEEPER-Build/1886//artifact/trunk/build/test/findbugs/newPatchFindbugsWarnings.html
[exec] Console output: https://builds.apache.org/job/PreCommit-ZOOKEEPER-Build/1886//console
[exec]
[exec] This message is automatically generated.
[exec]
[exec]
[exec] ======================================================================
[exec] ======================================================================
[exec] Adding comment to Jira.
[exec] ======================================================================
[exec] ======================================================================
[exec]
[exec]
[exec] Comment added.
[exec] 2d3fe142ac508f3875e24ef986edf995182ceb56 logged out
[exec]
[exec]
[exec] ======================================================================
[exec] ======================================================================
[exec] Finished build.
[exec] ======================================================================
[exec] ======================================================================
[exec]
[exec]
BUILD FAILED
/home/jenkins/jenkins-slave/workspace/PreCommit-ZOOKEEPER-Build/trunk/build.xml:1674: exec returned: 1
Total time: 39 minutes 46 seconds
Build step 'Execute shell' marked build as failure
Archiving artifacts
Recording test results
Description set: ZOOKEEPER-442
Email was triggered for: Failure
Sending email for trigger: Failure
###################################################################################
############################## FAILED TESTS (if any) ##############################
All tests passed