You are viewing a plain text version of this content. The canonical link for it is here.
Posted to dev@lucene.apache.org by Policeman Jenkins Server <je...@thetaphi.de> on 2016/10/06 06:09:43 UTC
[JENKINS] Lucene-Solr-6.x-Solaris (64bit/jdk1.8.0) - Build # 434 -
Unstable!
Build: https://jenkins.thetaphi.de/job/Lucene-Solr-6.x-Solaris/434/
Java: 64bit/jdk1.8.0 -XX:+UseCompressedOops -XX:+UseParallelGC
1 tests failed.
FAILED: org.apache.solr.cloud.TestSolrCloudWithDelegationTokens.testDelegationTokenCancelFail
Error Message:
expected:<200> but was:<404>
Stack Trace:
java.lang.AssertionError: expected:<200> but was:<404>
at __randomizedtesting.SeedInfo.seed([AECFB86B780AEA4F:C6708D41A890F8A3]:0)
at org.junit.Assert.fail(Assert.java:93)
at org.junit.Assert.failNotEquals(Assert.java:647)
at org.junit.Assert.assertEquals(Assert.java:128)
at org.junit.Assert.assertEquals(Assert.java:472)
at org.junit.Assert.assertEquals(Assert.java:456)
at org.apache.solr.cloud.TestSolrCloudWithDelegationTokens.cancelDelegationToken(TestSolrCloudWithDelegationTokens.java:144)
at org.apache.solr.cloud.TestSolrCloudWithDelegationTokens.testDelegationTokenCancelFail(TestSolrCloudWithDelegationTokens.java:298)
at sun.reflect.NativeMethodAccessorImpl.invoke0(Native Method)
at sun.reflect.NativeMethodAccessorImpl.invoke(NativeMethodAccessorImpl.java:62)
at sun.reflect.DelegatingMethodAccessorImpl.invoke(DelegatingMethodAccessorImpl.java:43)
at java.lang.reflect.Method.invoke(Method.java:498)
at com.carrotsearch.randomizedtesting.RandomizedRunner.invoke(RandomizedRunner.java:1764)
at com.carrotsearch.randomizedtesting.RandomizedRunner$8.evaluate(RandomizedRunner.java:871)
at com.carrotsearch.randomizedtesting.RandomizedRunner$9.evaluate(RandomizedRunner.java:907)
at com.carrotsearch.randomizedtesting.RandomizedRunner$10.evaluate(RandomizedRunner.java:921)
at com.carrotsearch.randomizedtesting.rules.SystemPropertiesRestoreRule$1.evaluate(SystemPropertiesRestoreRule.java:57)
at org.apache.lucene.util.TestRuleSetupTeardownChained$1.evaluate(TestRuleSetupTeardownChained.java:49)
at org.apache.lucene.util.AbstractBeforeAfterRule$1.evaluate(AbstractBeforeAfterRule.java:45)
at org.apache.lucene.util.TestRuleThreadAndTestName$1.evaluate(TestRuleThreadAndTestName.java:48)
at org.apache.lucene.util.TestRuleIgnoreAfterMaxFailures$1.evaluate(TestRuleIgnoreAfterMaxFailures.java:64)
at org.apache.lucene.util.TestRuleMarkFailure$1.evaluate(TestRuleMarkFailure.java:47)
at com.carrotsearch.randomizedtesting.rules.StatementAdapter.evaluate(StatementAdapter.java:36)
at com.carrotsearch.randomizedtesting.ThreadLeakControl$StatementRunner.run(ThreadLeakControl.java:367)
at com.carrotsearch.randomizedtesting.ThreadLeakControl.forkTimeoutingTask(ThreadLeakControl.java:809)
at com.carrotsearch.randomizedtesting.ThreadLeakControl$3.evaluate(ThreadLeakControl.java:460)
at com.carrotsearch.randomizedtesting.RandomizedRunner.runSingleTest(RandomizedRunner.java:880)
at com.carrotsearch.randomizedtesting.RandomizedRunner$5.evaluate(RandomizedRunner.java:781)
at com.carrotsearch.randomizedtesting.RandomizedRunner$6.evaluate(RandomizedRunner.java:816)
at com.carrotsearch.randomizedtesting.RandomizedRunner$7.evaluate(RandomizedRunner.java:827)
at com.carrotsearch.randomizedtesting.rules.StatementAdapter.evaluate(StatementAdapter.java:36)
at com.carrotsearch.randomizedtesting.rules.SystemPropertiesRestoreRule$1.evaluate(SystemPropertiesRestoreRule.java:57)
at org.apache.lucene.util.AbstractBeforeAfterRule$1.evaluate(AbstractBeforeAfterRule.java:45)
at com.carrotsearch.randomizedtesting.rules.StatementAdapter.evaluate(StatementAdapter.java:36)
at org.apache.lucene.util.TestRuleStoreClassName$1.evaluate(TestRuleStoreClassName.java:41)
at com.carrotsearch.randomizedtesting.rules.NoShadowingOrOverridesOnMethodsRule$1.evaluate(NoShadowingOrOverridesOnMethodsRule.java:40)
at com.carrotsearch.randomizedtesting.rules.NoShadowingOrOverridesOnMethodsRule$1.evaluate(NoShadowingOrOverridesOnMethodsRule.java:40)
at com.carrotsearch.randomizedtesting.rules.StatementAdapter.evaluate(StatementAdapter.java:36)
at com.carrotsearch.randomizedtesting.rules.StatementAdapter.evaluate(StatementAdapter.java:36)
at com.carrotsearch.randomizedtesting.rules.StatementAdapter.evaluate(StatementAdapter.java:36)
at org.apache.lucene.util.TestRuleAssertionsRequired$1.evaluate(TestRuleAssertionsRequired.java:53)
at org.apache.lucene.util.TestRuleMarkFailure$1.evaluate(TestRuleMarkFailure.java:47)
at org.apache.lucene.util.TestRuleIgnoreAfterMaxFailures$1.evaluate(TestRuleIgnoreAfterMaxFailures.java:64)
at org.apache.lucene.util.TestRuleIgnoreTestSuites$1.evaluate(TestRuleIgnoreTestSuites.java:54)
at com.carrotsearch.randomizedtesting.rules.StatementAdapter.evaluate(StatementAdapter.java:36)
at com.carrotsearch.randomizedtesting.ThreadLeakControl$StatementRunner.run(ThreadLeakControl.java:367)
at java.lang.Thread.run(Thread.java:745)
Build Log:
[...truncated 10627 lines...]
[junit4] Suite: org.apache.solr.cloud.TestSolrCloudWithDelegationTokens
[junit4] 2> Creating dataDir: /export/home/jenkins/workspace/Lucene-Solr-6.x-Solaris/solr/build/solr-core/test/J0/temp/solr.cloud.TestSolrCloudWithDelegationTokens_AECFB86B780AEA4F-001/init-core-data-001
[junit4] 2> 88879 INFO (SUITE-TestSolrCloudWithDelegationTokens-seed#[AECFB86B780AEA4F]-worker) [ ] o.a.s.SolrTestCaseJ4 Randomized ssl (false) and clientAuth (false) via: @org.apache.solr.SolrTestCaseJ4$SuppressSSL(bugUrl=None)
[junit4] 2> 88883 INFO (SUITE-TestSolrCloudWithDelegationTokens-seed#[AECFB86B780AEA4F]-worker) [ ] o.a.s.c.MiniSolrCloudCluster Starting cluster of 2 servers in /export/home/jenkins/workspace/Lucene-Solr-6.x-Solaris/solr/build/solr-core/test/J0/temp/solr.cloud.TestSolrCloudWithDelegationTokens_AECFB86B780AEA4F-001/tempDir-001
[junit4] 2> 88883 INFO (SUITE-TestSolrCloudWithDelegationTokens-seed#[AECFB86B780AEA4F]-worker) [ ] o.a.s.c.ZkTestServer STARTING ZK TEST SERVER
[junit4] 2> 88883 INFO (Thread-153) [ ] o.a.s.c.ZkTestServer client port:0.0.0.0/0.0.0.0:0
[junit4] 2> 88883 INFO (Thread-153) [ ] o.a.s.c.ZkTestServer Starting server
[junit4] 2> 88983 INFO (SUITE-TestSolrCloudWithDelegationTokens-seed#[AECFB86B780AEA4F]-worker) [ ] o.a.s.c.ZkTestServer start zk server on port:44973
[junit4] 2> 89010 INFO (jetty-launcher-101-thread-1) [ ] o.e.j.s.Server jetty-9.3.8.v20160314
[junit4] 2> 89011 INFO (jetty-launcher-101-thread-2) [ ] o.e.j.s.Server jetty-9.3.8.v20160314
[junit4] 2> 89016 INFO (jetty-launcher-101-thread-2) [ ] o.e.j.s.h.ContextHandler Started o.e.j.s.ServletContextHandler@ba4ec62{/solr,null,AVAILABLE}
[junit4] 2> 89017 INFO (jetty-launcher-101-thread-1) [ ] o.e.j.s.h.ContextHandler Started o.e.j.s.ServletContextHandler@58de60ae{/solr,null,AVAILABLE}
[junit4] 2> 89020 INFO (jetty-launcher-101-thread-2) [ ] o.e.j.s.ServerConnector Started ServerConnector@704fc8e9{HTTP/1.1,[http/1.1]}{127.0.0.1:37567}
[junit4] 2> 89020 INFO (jetty-launcher-101-thread-1) [ ] o.e.j.s.ServerConnector Started ServerConnector@4d30eb6{HTTP/1.1,[http/1.1]}{127.0.0.1:58053}
[junit4] 2> 89020 INFO (jetty-launcher-101-thread-2) [ ] o.e.j.s.Server Started @91652ms
[junit4] 2> 89020 INFO (jetty-launcher-101-thread-1) [ ] o.e.j.s.Server Started @91652ms
[junit4] 2> 89021 INFO (jetty-launcher-101-thread-2) [ ] o.a.s.c.s.e.JettySolrRunner Jetty properties: {hostContext=/solr, hostPort=37567}
[junit4] 2> 89021 INFO (jetty-launcher-101-thread-1) [ ] o.a.s.c.s.e.JettySolrRunner Jetty properties: {hostContext=/solr, hostPort=58053}
[junit4] 2> 89021 INFO (jetty-launcher-101-thread-1) [ ] o.a.s.s.SolrDispatchFilter ___ _ Welcome to Apache Solr? version 6.3.0
[junit4] 2> 89021 INFO (jetty-launcher-101-thread-2) [ ] o.a.s.s.SolrDispatchFilter ___ _ Welcome to Apache Solr? version 6.3.0
[junit4] 2> 89021 INFO (jetty-launcher-101-thread-2) [ ] o.a.s.s.SolrDispatchFilter / __| ___| |_ _ Starting in cloud mode on port null
[junit4] 2> 89021 INFO (jetty-launcher-101-thread-2) [ ] o.a.s.s.SolrDispatchFilter \__ \/ _ \ | '_| Install dir: null
[junit4] 2> 89021 INFO (jetty-launcher-101-thread-1) [ ] o.a.s.s.SolrDispatchFilter / __| ___| |_ _ Starting in cloud mode on port null
[junit4] 2> 89021 INFO (jetty-launcher-101-thread-2) [ ] o.a.s.s.SolrDispatchFilter |___/\___/_|_| Start time: 2016-10-06T04:57:55.197Z
[junit4] 2> 89021 INFO (jetty-launcher-101-thread-1) [ ] o.a.s.s.SolrDispatchFilter \__ \/ _ \ | '_| Install dir: null
[junit4] 2> 89021 INFO (jetty-launcher-101-thread-1) [ ] o.a.s.s.SolrDispatchFilter |___/\___/_|_| Start time: 2016-10-06T04:57:55.197Z
[junit4] 2> 89028 INFO (jetty-launcher-101-thread-1) [ ] o.a.s.s.SolrDispatchFilter solr.xml found in ZooKeeper. Loading...
[junit4] 2> 89029 INFO (jetty-launcher-101-thread-2) [ ] o.a.s.s.SolrDispatchFilter solr.xml found in ZooKeeper. Loading...
[junit4] 2> 89038 INFO (jetty-launcher-101-thread-2) [ ] o.a.s.u.UpdateShardHandler Creating UpdateShardHandler HTTP client with params: socketTimeout=340000&connTimeout=45000&retry=true
[junit4] 2> 89039 INFO (jetty-launcher-101-thread-2) [ ] o.a.s.c.ZkContainer Zookeeper client=127.0.0.1:44973/solr
[junit4] 2> 89040 INFO (jetty-launcher-101-thread-1) [ ] o.a.s.u.UpdateShardHandler Creating UpdateShardHandler HTTP client with params: socketTimeout=340000&connTimeout=45000&retry=true
[junit4] 2> 89042 INFO (jetty-launcher-101-thread-1) [ ] o.a.s.c.ZkContainer Zookeeper client=127.0.0.1:44973/solr
[junit4] 2> 89119 INFO (jetty-launcher-101-thread-2) [n:127.0.0.1:37567_solr ] o.a.s.c.OverseerElectionContext I am going to be the leader 127.0.0.1:37567_solr
[junit4] 2> 89122 INFO (jetty-launcher-101-thread-1) [n:127.0.0.1:58053_solr ] o.a.s.c.ZkController Register node as live in ZooKeeper:/live_nodes/127.0.0.1:58053_solr
[junit4] 2> 89124 INFO (jetty-launcher-101-thread-2) [n:127.0.0.1:37567_solr ] o.a.s.c.Overseer Overseer (id=96713433091997701-127.0.0.1:37567_solr-n_0000000000) starting
[junit4] 2> 89134 INFO (zkCallback-112-thread-1-processing-n:127.0.0.1:37567_solr) [n:127.0.0.1:37567_solr ] o.a.s.c.c.ZkStateReader Updated live nodes from ZooKeeper... (0) -> (1)
[junit4] 2> 89134 INFO (zkCallback-111-thread-1-processing-n:127.0.0.1:58053_solr) [n:127.0.0.1:58053_solr ] o.a.s.c.c.ZkStateReader Updated live nodes from ZooKeeper... (0) -> (1)
[junit4] 2> 89144 INFO (jetty-launcher-101-thread-1) [n:127.0.0.1:58053_solr ] o.a.s.c.CoreContainer Authentication plugin class obtained from system property 'authenticationPlugin': org.apache.solr.security.KerberosPlugin
[junit4] 2> 89154 INFO (jetty-launcher-101-thread-2) [n:127.0.0.1:37567_solr ] o.a.s.c.ZkController Register node as live in ZooKeeper:/live_nodes/127.0.0.1:37567_solr
[junit4] 2> 89157 INFO (zkCallback-111-thread-1-processing-n:127.0.0.1:58053_solr) [n:127.0.0.1:58053_solr ] o.a.s.c.c.ZkStateReader Updated live nodes from ZooKeeper... (1) -> (2)
[junit4] 2> 89158 INFO (zkCallback-112-thread-1-processing-n:127.0.0.1:37567_solr) [n:127.0.0.1:37567_solr ] o.a.s.c.c.ZkStateReader Updated live nodes from ZooKeeper... (1) -> (2)
[junit4] 2> 89185 INFO (jetty-launcher-101-thread-1) [n:127.0.0.1:58053_solr ] o.a.s.s.KerberosPlugin Params: {token.valid=30, delegation-token.token-kind=solr-dt, cookie.domain=127.0.0.1, cookie.path=/, zk-dt-secret-manager.znodeWorkingPath=solr/security/zkdtsm, token.validity=36000, signer.secret.provider.zookeeper.path=/token, type=org.apache.solr.security.HttpParamDelegationTokenAuthenticationHandler, zk-dt-secret-manager.enable=true, kerberos.name.rules=DEFAULT, signer.secret.provider=zookeeper}
[junit4] 2> 89188 INFO (jetty-launcher-101-thread-2) [n:127.0.0.1:37567_solr ] o.a.s.c.CoreContainer Authentication plugin class obtained from system property 'authenticationPlugin': org.apache.solr.security.KerberosPlugin
[junit4] 2> 89188 INFO (jetty-launcher-101-thread-2) [n:127.0.0.1:37567_solr ] o.a.s.s.KerberosPlugin Params: {token.valid=30, delegation-token.token-kind=solr-dt, cookie.domain=127.0.0.1, cookie.path=/, zk-dt-secret-manager.znodeWorkingPath=solr/security/zkdtsm, token.validity=36000, signer.secret.provider.zookeeper.path=/token, type=org.apache.solr.security.HttpParamDelegationTokenAuthenticationHandler, zk-dt-secret-manager.enable=true, kerberos.name.rules=DEFAULT, signer.secret.provider=zookeeper}
[junit4] 2> 89324 INFO (jetty-launcher-101-thread-2) [n:127.0.0.1:37567_solr ] o.a.c.f.i.CuratorFrameworkImpl Starting
[junit4] 2> 89324 INFO (jetty-launcher-101-thread-1) [n:127.0.0.1:58053_solr ] o.a.c.f.i.CuratorFrameworkImpl Starting
[junit4] 2> 89351 INFO (jetty-launcher-101-thread-1-EventThread) [n:127.0.0.1:58053_solr ] o.a.c.f.s.ConnectionStateManager State change: CONNECTED
[junit4] 2> 89351 INFO (jetty-launcher-101-thread-2-EventThread) [n:127.0.0.1:37567_solr ] o.a.c.f.s.ConnectionStateManager State change: CONNECTED
[junit4] 2> 89906 INFO (jetty-launcher-101-thread-2) [n:127.0.0.1:37567_solr ] o.a.s.h.c.HttpShardHandlerFactory Reconfiguring the default client with: org.apache.solr.client.solrj.impl.Krb5HttpClientConfigurer@2cdd61c
[junit4] 2> 89907 INFO (jetty-launcher-101-thread-2) [n:127.0.0.1:37567_solr ] o.a.s.u.UpdateShardHandler Reconfiguring the default client with: org.apache.solr.client.solrj.impl.Krb5HttpClientConfigurer@2cdd61c
[junit4] 2> 89908 INFO (jetty-launcher-101-thread-2) [n:127.0.0.1:37567_solr ] o.a.s.c.CorePropertiesLocator Found 0 core definitions underneath /export/home/jenkins/workspace/Lucene-Solr-6.x-Solaris/solr/build/solr-core/test/J0/temp/solr.cloud.TestSolrCloudWithDelegationTokens_AECFB86B780AEA4F-001/tempDir-001/node2/.
[junit4] 2> 89911 INFO (jetty-launcher-101-thread-1) [n:127.0.0.1:58053_solr ] o.a.s.h.c.HttpShardHandlerFactory Reconfiguring the default client with: org.apache.solr.client.solrj.impl.Krb5HttpClientConfigurer@77758f2b
[junit4] 2> 89912 INFO (jetty-launcher-101-thread-1) [n:127.0.0.1:58053_solr ] o.a.s.u.UpdateShardHandler Reconfiguring the default client with: org.apache.solr.client.solrj.impl.Krb5HttpClientConfigurer@77758f2b
[junit4] 2> 89915 INFO (jetty-launcher-101-thread-1) [n:127.0.0.1:58053_solr ] o.a.s.c.CorePropertiesLocator Found 0 core definitions underneath /export/home/jenkins/workspace/Lucene-Solr-6.x-Solaris/solr/build/solr-core/test/J0/temp/solr.cloud.TestSolrCloudWithDelegationTokens_AECFB86B780AEA4F-001/tempDir-001/node1/.
[junit4] 2> 89957 INFO (TEST-TestSolrCloudWithDelegationTokens.testDelegationOtherOp-seed#[AECFB86B780AEA4F]) [ ] o.a.s.SolrTestCaseJ4 ###Starting testDelegationOtherOp
[junit4] 2> 90168 INFO (qtp1403705369-645) [n:127.0.0.1:37567_solr ] o.a.s.h.a.CollectionsHandler Invoked Collection Action :list with params op=someSolrOperation&action=LIST&user=bar&wt=javabin&version=2 and sendToOCPQueue=true
[junit4] 2> 90169 INFO (qtp1403705369-645) [n:127.0.0.1:37567_solr ] o.a.s.s.HttpSolrCall [admin] webapp=null path=/admin/collections params={op=someSolrOperation&action=LIST&user=bar&wt=javabin&version=2} status=0 QTime=0
[junit4] 2> 90179 WARN (TEST-TestSolrCloudWithDelegationTokens.testDelegationOtherOp-seed#[AECFB86B780AEA4F]) [ ] o.a.h.c.p.ResponseProcessCookies Invalid cookie header: "Set-Cookie: hadoop.auth="u=bar&p=bar&t=test&e=1475765876158&s=k5o0l/qLl2dVBxj0gpcrjyhrWr0="; Path=/; Domain=127.0.0.1; Expires=Enj, 06-Tet-2016 14:57:56 GMT; HttpOnly". Invalid 'expires' attribute: Enj, 06-Tet-2016 14:57:56 GMT
[junit4] 2> 90180 INFO (TEST-TestSolrCloudWithDelegationTokens.testDelegationOtherOp-seed#[AECFB86B780AEA4F]) [ ] o.a.s.SolrTestCaseJ4 ###Ending testDelegationOtherOp
[junit4] 2> 90199 INFO (TEST-TestSolrCloudWithDelegationTokens.testZNodePaths-seed#[AECFB86B780AEA4F]) [ ] o.a.s.SolrTestCaseJ4 ###Starting testZNodePaths
[junit4] 2> 90950 INFO (TEST-TestSolrCloudWithDelegationTokens.testZNodePaths-seed#[AECFB86B780AEA4F]) [ ] o.a.s.SolrTestCaseJ4 ###Ending testZNodePaths
[junit4] 2> 90972 INFO (TEST-TestSolrCloudWithDelegationTokens.testDelegationTokenSolrClient-seed#[AECFB86B780AEA4F]) [ ] o.a.s.SolrTestCaseJ4 ###Starting testDelegationTokenSolrClient
[junit4] 2> 90990 WARN (TEST-TestSolrCloudWithDelegationTokens.testDelegationTokenSolrClient-seed#[AECFB86B780AEA4F]) [ ] o.a.h.c.p.ResponseProcessCookies Invalid cookie header: "Set-Cookie: hadoop.auth=; Path=/; Domain=127.0.0.1; Expires=Enj, 01-Jan-1970 00:00:00 GMT; HttpOnly". Invalid 'expires' attribute: Enj, 01-Jan-1970 00:00:00 GMT
[junit4] 2> 91001 INFO (qtp1403705369-648) [n:127.0.0.1:37567_solr ] o.a.s.h.a.CollectionsHandler Invoked Collection Action :list with params action=LIST&delegation=GgADYmFyA2JhcgCKAVeYWuieigFXvGdsngIEFG4fL8KX1JuzIj2jTckyZcM6D-7QB3NvbHItZHQA&wt=javabin&version=2 and sendToOCPQueue=true
[junit4] 2> 91001 INFO (qtp1403705369-648) [n:127.0.0.1:37567_solr ] o.a.s.s.HttpSolrCall [admin] webapp=null path=/admin/collections params={action=LIST&delegation=GgADYmFyA2JhcgCKAVeYWuieigFXvGdsngIEFG4fL8KX1JuzIj2jTckyZcM6D-7QB3NvbHItZHQA&wt=javabin&version=2} status=0 QTime=0
[junit4] 2> 91001 INFO (TEST-TestSolrCloudWithDelegationTokens.testDelegationTokenSolrClient-seed#[AECFB86B780AEA4F]) [ ] o.a.s.SolrTestCaseJ4 ###Ending testDelegationTokenSolrClient
[junit4] 2> 91025 INFO (TEST-TestSolrCloudWithDelegationTokens.testDelegationTokenCancelFail-seed#[AECFB86B780AEA4F]) [ ] o.a.s.SolrTestCaseJ4 ###Starting testDelegationTokenCancelFail
[junit4] 2> 91055 INFO (TEST-TestSolrCloudWithDelegationTokens.testDelegationTokenCancelFail-seed#[AECFB86B780AEA4F]) [ ] o.a.s.SolrTestCaseJ4 ###Ending testDelegationTokenCancelFail
[junit4] 2> NOTE: reproduce with: ant test -Dtestcase=TestSolrCloudWithDelegationTokens -Dtests.method=testDelegationTokenCancelFail -Dtests.seed=AECFB86B780AEA4F -Dtests.slow=true -Dtests.locale=sq-AL -Dtests.timezone=America/Knox_IN -Dtests.asserts=true -Dtests.file.encoding=ISO-8859-1
[junit4] FAILURE 0.06s J0 | TestSolrCloudWithDelegationTokens.testDelegationTokenCancelFail <<<
[junit4] > Throwable #1: java.lang.AssertionError: expected:<200> but was:<404>
[junit4] > at __randomizedtesting.SeedInfo.seed([AECFB86B780AEA4F:C6708D41A890F8A3]:0)
[junit4] > at org.apache.solr.cloud.TestSolrCloudWithDelegationTokens.cancelDelegationToken(TestSolrCloudWithDelegationTokens.java:144)
[junit4] > at org.apache.solr.cloud.TestSolrCloudWithDelegationTokens.testDelegationTokenCancelFail(TestSolrCloudWithDelegationTokens.java:298)
[junit4] > at java.lang.Thread.run(Thread.java:745)
[junit4] 2> 91093 INFO (TEST-TestSolrCloudWithDelegationTokens.testDelegationTokenCancel-seed#[AECFB86B780AEA4F]) [ ] o.a.s.SolrTestCaseJ4 ###Starting testDelegationTokenCancel
[junit4] 2> 91112 ERROR (qtp1403705369-652) [ ] o.a.h.s.t.d.ZKDelegationTokenSecretManager No node in path [/ZKDTSMTokensRoot/DT_4]
[junit4] 2> 91131 WARN (TEST-TestSolrCloudWithDelegationTokens.testDelegationTokenCancel-seed#[AECFB86B780AEA4F]) [ ] o.a.h.c.p.ResponseProcessCookies Invalid cookie header: "Set-Cookie: hadoop.auth=; Path=/; Domain=127.0.0.1; Expires=Enj, 01-Jan-1970 00:00:00 GMT; HttpOnly". Invalid 'expires' attribute: Enj, 01-Jan-1970 00:00:00 GMT
[junit4] 2> 91137 INFO (TEST-TestSolrCloudWithDelegationTokens.testDelegationTokenCancel-seed#[AECFB86B780AEA4F]) [ ] o.a.s.c.c.ZkStateReader Updated live nodes from ZooKeeper... (0) -> (2)
[junit4] 2> 91141 WARN (TEST-TestSolrCloudWithDelegationTokens.testDelegationTokenCancel-seed#[AECFB86B780AEA4F]) [ ] o.a.h.c.p.ResponseProcessCookies Invalid cookie header: "Set-Cookie: hadoop.auth=; Path=/; Domain=127.0.0.1; Expires=Enj, 01-Jan-1970 00:00:00 GMT; HttpOnly". Invalid 'expires' attribute: Enj, 01-Jan-1970 00:00:00 GMT
[junit4] 2> 91164 INFO (TEST-TestSolrCloudWithDelegationTokens.testDelegationTokenCancel-seed#[AECFB86B780AEA4F]) [ ] o.a.s.c.c.ZkStateReader Updated live nodes from ZooKeeper... (0) -> (2)
[junit4] 2> 91169 ERROR (qtp1518924145-655) [ ] o.a.h.s.t.d.ZKDelegationTokenSecretManager No node in path [/ZKDTSMTokensRoot/DT_5]
[junit4] 2> 91180 INFO (TEST-TestSolrCloudWithDelegationTokens.testDelegationTokenCancel-seed#[AECFB86B780AEA4F]) [ ] o.a.s.c.c.ZkStateReader Updated live nodes from ZooKeeper... (0) -> (2)
[junit4] 2> 91184 WARN (TEST-TestSolrCloudWithDelegationTokens.testDelegationTokenCancel-seed#[AECFB86B780AEA4F]) [ ] o.a.h.c.p.ResponseProcessCookies Invalid cookie header: "Set-Cookie: hadoop.auth=; Path=/; Domain=127.0.0.1; Expires=Enj, 01-Jan-1970 00:00:00 GMT; HttpOnly". Invalid 'expires' attribute: Enj, 01-Jan-1970 00:00:00 GMT
[junit4] 2> 91187 WARN (TEST-TestSolrCloudWithDelegationTokens.testDelegationTokenCancel-seed#[AECFB86B780AEA4F]) [ ] o.a.h.c.p.ResponseProcessCookies Invalid cookie header: "Set-Cookie: hadoop.auth=; Path=/; Domain=127.0.0.1; Expires=Enj, 01-Jan-1970 00:00:00 GMT; HttpOnly". Invalid 'expires' attribute: Enj, 01-Jan-1970 00:00:00 GMT
[junit4] 2> 91188 INFO (TEST-TestSolrCloudWithDelegationTokens.testDelegationTokenCancel-seed#[AECFB86B780AEA4F]) [ ] o.a.s.SolrTestCaseJ4 ###Ending testDelegationTokenCancel
[junit4] 2> 91210 INFO (TEST-TestSolrCloudWithDelegationTokens.testDelegationTokenVerify-seed#[AECFB86B780AEA4F]) [ ] o.a.s.SolrTestCaseJ4 ###Starting testDelegationTokenVerify
[junit4] 2> 91222 INFO (TEST-TestSolrCloudWithDelegationTokens.testDelegationTokenVerify-seed#[AECFB86B780AEA4F]) [ ] o.a.s.c.c.ZkStateReader Updated live nodes from ZooKeeper... (0) -> (2)
[junit4] 2> 91226 INFO (qtp1518924145-655) [n:127.0.0.1:58053_solr ] o.a.s.h.a.CollectionsHandler Invoked Collection Action :list with params action=LIST&delegation=GgADYmFyA2JhcgCKAVeYWumMigFXvGdtjAYEFKKqRB3GXoYaw9oc6v7SALzWxgCLB3NvbHItZHQA&wt=javabin&version=2 and sendToOCPQueue=true
[junit4] 2> 91226 INFO (qtp1518924145-655) [n:127.0.0.1:58053_solr ] o.a.s.s.HttpSolrCall [admin] webapp=null path=/admin/collections params={action=LIST&delegation=GgADYmFyA2JhcgCKAVeYWumMigFXvGdtjAYEFKKqRB3GXoYaw9oc6v7SALzWxgCLB3NvbHItZHQA&wt=javabin&version=2} status=0 QTime=0
[junit4] 2> 91246 INFO (TEST-TestSolrCloudWithDelegationTokens.testDelegationTokenVerify-seed#[AECFB86B780AEA4F]) [ ] o.a.s.c.c.ZkStateReader Updated live nodes from ZooKeeper... (0) -> (2)
[junit4] 2> 91250 WARN (TEST-TestSolrCloudWithDelegationTokens.testDelegationTokenVerify-seed#[AECFB86B780AEA4F]) [ ] o.a.h.c.p.ResponseProcessCookies Invalid cookie header: "Set-Cookie: hadoop.auth=; Path=/; Domain=127.0.0.1; Expires=Enj, 01-Jan-1970 00:00:00 GMT; HttpOnly". Invalid 'expires' attribute: Enj, 01-Jan-1970 00:00:00 GMT
[junit4] 2> 91260 INFO (TEST-TestSolrCloudWithDelegationTokens.testDelegationTokenVerify-seed#[AECFB86B780AEA4F]) [ ] o.a.s.c.c.ZkStateReader Updated live nodes from ZooKeeper... (0) -> (2)
[junit4] 2> 91265 INFO (qtp1518924145-639) [n:127.0.0.1:58053_solr ] o.a.s.h.a.CollectionsHandler Invoked Collection Action :list with params action=LIST&delegation=GgADYmFyA2JhcgCKAVeYWumMigFXvGdtjAYEFKKqRB3GXoYaw9oc6v7SALzWxgCLB3NvbHItZHQA&wt=javabin&version=2 and sendToOCPQueue=true
[junit4] 2> 91265 INFO (qtp1518924145-639) [n:127.0.0.1:58053_solr ] o.a.s.s.HttpSolrCall [admin] webapp=null path=/admin/collections params={action=LIST&delegation=GgADYmFyA2JhcgCKAVeYWumMigFXvGdtjAYEFKKqRB3GXoYaw9oc6v7SALzWxgCLB3NvbHItZHQA&wt=javabin&version=2} status=0 QTime=0
[junit4] 2> 91278 WARN (TEST-TestSolrCloudWithDelegationTokens.testDelegationTokenVerify-seed#[AECFB86B780AEA4F]) [ ] o.a.h.c.p.ResponseProcessCookies Invalid cookie header: "Set-Cookie: hadoop.auth=; Path=/; Domain=127.0.0.1; Expires=Enj, 01-Jan-1970 00:00:00 GMT; HttpOnly". Invalid 'expires' attribute: Enj, 01-Jan-1970 00:00:00 GMT
[junit4] 2> 91278 INFO (TEST-TestSolrCloudWithDelegationTokens.testDelegationTokenVerify-seed#[AECFB86B780AEA4F]) [ ] o.a.s.SolrTestCaseJ4 ###Ending testDelegationTokenVerify
[junit4] 2> 91276 WARN (NIOServerCxn.Factory:0.0.0.0/0.0.0.0:0) [ ] o.a.z.s.NIOServerCnxn caught end of stream exception
[junit4] 2> EndOfStreamException: Unable to read additional data from client sessionid 0x157985ae0750010, likely client has closed socket
[junit4] 2> at org.apache.zookeeper.server.NIOServerCnxn.doIO(NIOServerCnxn.java:228)
[junit4] 2> at org.apache.zookeeper.server.NIOServerCnxnFactory.run(NIOServerCnxnFactory.java:208)
[junit4] 2> at java.lang.Thread.run(Thread.java:745)
[junit4] 2> 91313 INFO (TEST-TestSolrCloudWithDelegationTokens.testDelegationTokenRenew-seed#[AECFB86B780AEA4F]) [ ] o.a.s.SolrTestCaseJ4 ###Starting testDelegationTokenRenew
[junit4] 2> 91344 INFO (qtp1403705369-650) [n:127.0.0.1:37567_solr ] o.a.s.h.a.CollectionsHandler Invoked Collection Action :list with params action=LIST&delegation=GgADYmFyA2JhcgCKAVeYWunzigFXvGdt8wcEFBiWLPUuZa6UFZ_PvpDY1w2dP93PB3NvbHItZHQA&wt=javabin&version=2 and sendToOCPQueue=true
[junit4] 2> 91344 INFO (qtp1403705369-650) [n:127.0.0.1:37567_solr ] o.a.s.s.HttpSolrCall [admin] webapp=null path=/admin/collections params={action=LIST&delegation=GgADYmFyA2JhcgCKAVeYWunzigFXvGdt8wcEFBiWLPUuZa6UFZ_PvpDY1w2dP93PB3NvbHItZHQA&wt=javabin&version=2} status=0 QTime=0
[junit4] 2> 91358 INFO (TEST-TestSolrCloudWithDelegationTokens.testDelegationTokenRenew-seed#[AECFB86B780AEA4F]) [ ] o.a.s.c.c.ZkStateReader Updated live nodes from ZooKeeper... (0) -> (2)
[junit4] 2> 91366 WARN (TEST-TestSolrCloudWithDelegationTokens.testDelegationTokenRenew-seed#[AECFB86B780AEA4F]) [ ] o.a.h.c.p.ResponseProcessCookies Invalid cookie header: "Set-Cookie: hadoop.auth=; Path=/; Domain=127.0.0.1; Expires=Enj, 01-Jan-1970 00:00:00 GMT; HttpOnly". Invalid 'expires' attribute: Enj, 01-Jan-1970 00:00:00 GMT
[junit4] 2> 91390 INFO (TEST-TestSolrCloudWithDelegationTokens.testDelegationTokenRenew-seed#[AECFB86B780AEA4F]) [ ] o.a.s.c.c.ZkStateReader Updated live nodes from ZooKeeper... (0) -> (2)
[junit4] 2> 91404 INFO (qtp1518924145-638) [n:127.0.0.1:58053_solr ] o.a.s.h.a.CollectionsHandler Invoked Collection Action :list with params action=LIST&delegation=GgADYmFyA2JhcgCKAVeYWunzigFXvGdt8wcEFBiWLPUuZa6UFZ_PvpDY1w2dP93PB3NvbHItZHQA&wt=javabin&version=2 and sendToOCPQueue=true
[junit4] 2> 91404 INFO (qtp1518924145-638) [n:127.0.0.1:58053_solr ] o.a.s.s.HttpSolrCall [admin] webapp=null path=/admin/collections params={action=LIST&delegation=GgADYmFyA2JhcgCKAVeYWunzigFXvGdt8wcEFBiWLPUuZa6UFZ_PvpDY1w2dP93PB3NvbHItZHQA&wt=javabin&version=2} status=0 QTime=0
[junit4] 2> 91416 WARN (TEST-TestSolrCloudWithDelegationTokens.testDelegationTokenRenew-seed#[AECFB86B780AEA4F]) [ ] o.a.h.c.p.ResponseProcessCookies Invalid cookie header: "Set-Cookie: hadoop.auth=; Path=/; Domain=127.0.0.1; Expires=Enj, 01-Jan-1970 00:00:00 GMT; HttpOnly". Invalid 'expires' attribute: Enj, 01-Jan-1970 00:00:00 GMT
[junit4] 2> 91451 INFO (qtp1403705369-644) [n:127.0.0.1:37567_solr ] o.a.s.h.a.CollectionsHandler Invoked Collection Action :list with params action=LIST&delegation=GgADYmFyA2JhcgCKAVeYWupaigFXvGduWggEFIS3kPsPUqBWt4MdekhXgpUO4v5rB3NvbHItZHQA&wt=javabin&version=2 and sendToOCPQueue=true
[junit4] 2> 91451 INFO (qtp1403705369-644) [n:127.0.0.1:37567_solr ] o.a.s.s.HttpSolrCall [admin] webapp=null path=/admin/collections params={action=LIST&delegation=GgADYmFyA2JhcgCKAVeYWupaigFXvGduWggEFIS3kPsPUqBWt4MdekhXgpUO4v5rB3NvbHItZHQA&wt=javabin&version=2} status=0 QTime=0
[junit4] 2> 91468 INFO (TEST-TestSolrCloudWithDelegationTokens.testDelegationTokenRenew-seed#[AECFB86B780AEA4F]) [ ] o.a.s.c.c.ZkStateReader Updated live nodes from ZooKeeper... (0) -> (2)
[junit4] 2> 91479 WARN (TEST-TestSolrCloudWithDelegationTokens.testDelegationTokenRenew-seed#[AECFB86B780AEA4F]) [ ] o.a.h.c.p.ResponseProcessCookies Invalid cookie header: "Set-Cookie: hadoop.auth=; Path=/; Domain=127.0.0.1; Expires=Enj, 01-Jan-1970 00:00:00 GMT; HttpOnly". Invalid 'expires' attribute: Enj, 01-Jan-1970 00:00:00 GMT
[junit4] 2> 91506 INFO (TEST-TestSolrCloudWithDelegationTokens.testDelegationTokenRenew-seed#[AECFB86B780AEA4F]) [ ] o.a.s.c.c.ZkStateReader Updated live nodes from ZooKeeper... (0) -> (2)
[junit4] 2> 91512 INFO (qtp1518924145-639) [n:127.0.0.1:58053_solr ] o.a.s.h.a.CollectionsHandler Invoked Collection Action :list with params action=LIST&delegation=GgADYmFyA2JhcgCKAVeYWupaigFXvGduWggEFIS3kPsPUqBWt4MdekhXgpUO4v5rB3NvbHItZHQA&wt=javabin&version=2 and sendToOCPQueue=true
[junit4] 2> 91512 INFO (qtp1518924145-639) [n:127.0.0.1:58053_solr ] o.a.s.s.HttpSolrCall [admin] webapp=null path=/admin/collections params={action=LIST&delegation=GgADYmFyA2JhcgCKAVeYWupaigFXvGduWggEFIS3kPsPUqBWt4MdekhXgpUO4v5rB3NvbHItZHQA&wt=javabin&version=2} status=0 QTime=0
[junit4] 2> 91520 WARN (TEST-TestSolrCloudWithDelegationTokens.testDelegationTokenRenew-seed#[AECFB86B780AEA4F]) [ ] o.a.h.c.p.ResponseProcessCookies Invalid cookie header: "Set-Cookie: hadoop.auth=; Path=/; Domain=127.0.0.1; Expires=Enj, 01-Jan-1970 00:00:00 GMT; HttpOnly". Invalid 'expires' attribute: Enj, 01-Jan-1970 00:00:00 GMT
[junit4] 2> 91561 INFO (TEST-TestSolrCloudWithDelegationTokens.testDelegationTokenRenew-seed#[AECFB86B780AEA4F]) [ ] o.a.s.c.c.ZkStateReader Updated live nodes from ZooKeeper... (0) -> (2)
[junit4] 2> 91570 INFO (qtp1518924145-639) [n:127.0.0.1:58053_solr ] o.a.s.h.a.CollectionsHandler Invoked Collection Action :list with params action=LIST&delegation=GgADYmFyA2JhcgCKAVeYWurEigFXvGduxAkEFJ0wxJUoCVn_uvk8-QdlU8OvaVtrB3NvbHItZHQA&wt=javabin&version=2 and sendToOCPQueue=true
[junit4] 2> 91570 INFO (qtp1518924145-639) [n:127.0.0.1:58053_solr ] o.a.s.s.HttpSolrCall [admin] webapp=null path=/admin/collections params={action=LIST&delegation=GgADYmFyA2JhcgCKAVeYWurEigFXvGduxAkEFJ0wxJUoCVn_uvk8-QdlU8OvaVtrB3NvbHItZHQA&wt=javabin&version=2} status=0 QTime=0
[junit4] 2> 91589 INFO (TEST-TestSolrCloudWithDelegationTokens.testDelegationTokenRenew-seed#[AECFB86B780AEA4F]) [ ] o.a.s.c.c.ZkStateReader Updated live nodes from ZooKeeper... (0) -> (2)
[junit4] 2> 91596 WARN (TEST-TestSolrCloudWithDelegationTokens.testDelegationTokenRenew-seed#[AECFB86B780AEA4F]) [ ] o.a.h.c.p.ResponseProcessCookies Invalid cookie header: "Set-Cookie: hadoop.auth=; Path=/; Domain=127.0.0.1; Expires=Enj, 01-Jan-1970 00:00:00 GMT; HttpOnly". Invalid 'expires' attribute: Enj, 01-Jan-1970 00:00:00 GMT
[junit4] 2> 91616 INFO (TEST-TestSolrCloudWithDelegationTokens.testDelegationTokenRenew-seed#[AECFB86B780AEA4F]) [ ] o.a.s.c.c.ZkStateReader Updated live nodes from ZooKeeper... (0) -> (2)
[junit4] 2> 91623 INFO (qtp1518924145-641) [n:127.0.0.1:58053_solr ] o.a.s.h.a.CollectionsHandler Invoked Collection Action :list with params action=LIST&delegation=GgADYmFyA2JhcgCKAVeYWurEigFXvGduxAkEFJ0wxJUoCVn_uvk8-QdlU8OvaVtrB3NvbHItZHQA&wt=javabin&version=2 and sendToOCPQueue=true
[junit4] 2> 91623 INFO (qtp1518924145-641) [n:127.0.0.1:58053_solr ] o.a.s.s.HttpSolrCall [admin] webapp=null path=/admin/collections params={action=LIST&delegation=GgADYmFyA2JhcgCKAVeYWurEigFXvGduxAkEFJ0wxJUoCVn_uvk8-QdlU8OvaVtrB3NvbHItZHQA&wt=javabin&version=2} status=0 QTime=0
[junit4] 2> 91632 WARN (TEST-TestSolrCloudWithDelegationTokens.testDelegationTokenRenew-seed#[AECFB86B780AEA4F]) [ ] o.a.h.c.p.ResponseProcessCookies Invalid cookie header: "Set-Cookie: hadoop.auth=; Path=/; Domain=127.0.0.1; Expires=Enj, 01-Jan-1970 00:00:00 GMT; HttpOnly". Invalid 'expires' attribute: Enj, 01-Jan-1970 00:00:00 GMT
[junit4] 2> 91678 INFO (TEST-TestSolrCloudWithDelegationTokens.testDelegationTokenRenew-seed#[AECFB86B780AEA4F]) [ ] o.a.s.c.c.ZkStateReader Updated live nodes from ZooKeeper... (0) -> (2)
[junit4] 2> 91688 INFO (qtp1518924145-639) [n:127.0.0.1:58053_solr ] o.a.s.h.a.CollectionsHandler Invoked Collection Action :list with params action=LIST&delegation=GgADYmFyA2JhcgCKAVeYWusyigFXvGdvMgoEFGmG_P5RWuNIfM6l-wkG29FSkRx9B3NvbHItZHQA&wt=javabin&version=2 and sendToOCPQueue=true
[junit4] 2> 91689 INFO (qtp1518924145-639) [n:127.0.0.1:58053_solr ] o.a.s.s.HttpSolrCall [admin] webapp=null path=/admin/collections params={action=LIST&delegation=GgADYmFyA2JhcgCKAVeYWusyigFXvGdvMgoEFGmG_P5RWuNIfM6l-wkG29FSkRx9B3NvbHItZHQA&wt=javabin&version=2} status=0 QTime=0
[junit4] 2> 91710 INFO (TEST-TestSolrCloudWithDelegationTokens.testDelegationTokenRenew-seed#[AECFB86B780AEA4F]) [ ] o.a.s.c.c.ZkStateReader Updated live nodes from ZooKeeper... (0) -> (2)
[junit4] 2> 91718 WARN (TEST-TestSolrCloudWithDelegationTokens.testDelegationTokenRenew-seed#[AECFB86B780AEA4F]) [ ] o.a.h.c.p.ResponseProcessCookies Invalid cookie header: "Set-Cookie: hadoop.auth=; Path=/; Domain=127.0.0.1; Expires=Enj, 01-Jan-1970 00:00:00 GMT; HttpOnly". Invalid 'expires' attribute: Enj, 01-Jan-1970 00:00:00 GMT
[junit4] 2> 91723 INFO (qtp1518924145-639) [n:127.0.0.1:58053_solr ] o.a.s.h.a.CollectionsHandler Invoked Collection Action :list with params action=LIST&delegation=GgADYmFyA2JhcgCKAVeYWusyigFXvGdvMgoEFGmG_P5RWuNIfM6l-wkG29FSkRx9B3NvbHItZHQA&wt=javabin&version=2 and sendToOCPQueue=true
[junit4] 2> 91723 INFO (qtp1518924145-639) [n:127.0.0.1:58053_solr ] o.a.s.s.HttpSolrCall [admin] webapp=null path=/admin/collections params={action=LIST&delegation=GgADYmFyA2JhcgCKAVeYWusyigFXvGdvMgoEFGmG_P5RWuNIfM6l-wkG29FSkRx9B3NvbHItZHQA&wt=javabin&version=2} status=0 QTime=0
[junit4] 2> 91727 WARN (TEST-TestSolrCloudWithDelegationTokens.testDelegationTokenRenew-seed#[AECFB86B780AEA4F]) [ ] o.a.h.c.p.ResponseProcessCookies Invalid cookie header: "Set-Cookie: hadoop.auth=; Path=/; Domain=127.0.0.1; Expires=Enj, 01-Jan-1970 00:00:00 GMT; HttpOnly". Invalid 'expires' attribute: Enj, 01-Jan-1970 00:00:00 GMT
[junit4] 2> 91727 INFO (TEST-TestSolrCloudWithDelegationTokens.testDelegationTokenRenew-seed#[AECFB86B780AEA4F]) [ ] o.a.s.SolrTestCaseJ4 ###Ending testDelegationTokenRenew
[junit4] 2> 91773 INFO (TEST-TestSolrCloudWithDelegationTokens.testDelegationTokenRenewFail-seed#[AECFB86B780AEA4F]) [ ] o.a.s.SolrTestCaseJ4 ###Starting testDelegationTokenRenewFail
[junit4] 2> 91786 WARN (qtp1403705369-648) [n:127.0.0.1:37567_solr ] o.a.h.s.a.s.AuthenticationFilter Authentication exception: org.apache.hadoop.security.AccessControlException: foo tries to renew a token with renewer bar
[junit4] 2> 91786 WARN (qtp1403705369-648) [n:127.0.0.1:37567_solr ] o.a.s.s.KerberosPlugin Could not find org.apache.solr.security.kerberosplugin.requestcontinues
[junit4] 2> 91787 WARN (TEST-TestSolrCloudWithDelegationTokens.testDelegationTokenRenewFail-seed#[AECFB86B780AEA4F]) [ ] o.a.h.c.p.ResponseProcessCookies Invalid cookie header: "Set-Cookie: hadoop.auth=; Path=/; Domain=127.0.0.1; Expires=Enj, 01-Jan-1970 00:00:00 GMT; HttpOnly". Invalid 'expires' attribute: Enj, 01-Jan-1970 00:00:00 GMT
[junit4] 2> 91789 WARN (qtp1518924145-642) [ ] o.a.h.s.a.s.AuthenticationFilter Authentication exception: org.apache.hadoop.security.AccessControlException: foo tries to renew a token with renewer bar
[junit4] 2> 91791 WARN (qtp1518924145-642) [ ] o.a.s.s.KerberosPlugin Could not find org.apache.solr.security.kerberosplugin.requestcontinues
[junit4] 2> 91792 WARN (TEST-TestSolrCloudWithDelegationTokens.testDelegationTokenRenewFail-seed#[AECFB86B780AEA4F]) [ ] o.a.h.c.p.ResponseProcessCookies Invalid cookie header: "Set-Cookie: hadoop.auth=; Path=/; Domain=127.0.0.1; Expires=Enj, 01-Jan-1970 00:00:00 GMT; HttpOnly". Invalid 'expires' attribute: Enj, 01-Jan-1970 00:00:00 GMT
[junit4] 2> 91807 WARN (qtp1403705369-645) [n:127.0.0.1:37567_solr ] o.a.h.s.a.s.AuthenticationFilter Authentication exception: org.apache.hadoop.security.AccessControlException: notRenewUser tries to renew a token with renewer renewUser
[junit4] 2> 91807 WARN (qtp1403705369-645) [n:127.0.0.1:37567_solr ] o.a.s.s.KerberosPlugin Could not find org.apache.solr.security.kerberosplugin.requestcontinues
[junit4] 2> 91810 WARN (TEST-TestSolrCloudWithDelegationTokens.testDelegationTokenRenewFail-seed#[AECFB86B780AEA4F]) [ ] o.a.h.c.p.ResponseProcessCookies Invalid cookie header: "Set-Cookie: hadoop.auth=; Path=/; Domain=127.0.0.1; Expires=Enj, 01-Jan-1970 00:00:00 GMT; HttpOnly". Invalid 'expires' attribute: Enj, 01-Jan-1970 00:00:00 GMT
[junit4] 2> 91812 WARN (qtp1518924145-643) [ ] o.a.h.s.a.s.AuthenticationFilter Authentication exception: org.apache.hadoop.security.AccessControlException: notRenewUser tries to renew a token with renewer renewUser
[junit4] 2> 91812 WARN (qtp1518924145-643) [ ] o.a.s.s.KerberosPlugin Could not find org.apache.solr.security.kerberosplugin.requestcontinues
[junit4] 2> 91814 WARN (TEST-TestSolrCloudWithDelegationTokens.testDelegationTokenRenewFail-seed#[AECFB86B780AEA4F]) [ ] o.a.h.c.p.ResponseProcessCookies Invalid cookie header: "Set-Cookie: hadoop.auth=; Path=/; Domain=127.0.0.1; Expires=Enj, 01-Jan-1970 00:00:00 GMT; HttpOnly". Invalid 'expires' attribute: Enj, 01-Jan-1970 00:00:00 GMT
[junit4] 2> 91815 INFO (TEST-TestSolrCloudWithDelegationTokens.testDelegationTokenRenewFail-seed#[AECFB86B780AEA4F]) [ ] o.a.s.SolrTestCaseJ4 ###Ending testDelegationTokenRenewFail
[junit4] 2> 91818 INFO (jetty-launcher-101-thread-2) [ ] o.e.j.s.ServerConnector Stopped ServerConnector@4d30eb6{HTTP/1.1,[http/1.1]}{127.0.0.1:0}
[junit4] 2> 91819 INFO (jetty-launcher-101-thread-2) [ ] o.a.s.c.CoreContainer Shutting down CoreContainer instance=339253341
[junit4] 2> 91819 INFO (jetty-launcher-101-thread-1) [ ] o.e.j.s.ServerConnector Stopped ServerConnector@704fc8e9{HTTP/1.1,[http/1.1]}{127.0.0.1:0}
[junit4] 2> 91820 INFO (jetty-launcher-101-thread-1) [ ] o.a.s.c.CoreContainer Shutting down CoreContainer instance=733132016
[junit4] 2> 91834 INFO (jetty-launcher-101-thread-1) [ ] o.a.s.c.Overseer Overseer (id=96713433091997701-127.0.0.1:37567_solr-n_0000000000) closing
[junit4] 2> 91834 INFO (OverseerStateUpdate-96713433091997701-127.0.0.1:37567_solr-n_0000000000) [n:127.0.0.1:37567_solr ] o.a.s.c.Overseer Overseer Loop exiting : 127.0.0.1:37567_solr
[junit4] 2> 91838 WARN (zkCallback-111-thread-1-processing-n:127.0.0.1:58053_solr) [n:127.0.0.1:58053_solr ] o.a.s.c.c.ZkStateReader ZooKeeper watch triggered, but Solr cannot talk to ZK: [KeeperErrorCode = Session expired for /live_nodes]
[junit4] 2> 91839 ERROR (Thread[Thread-171,5,TGRP-TestSolrCloudWithDelegationTokens]) [n:127.0.0.1:37567_solr ] o.a.h.s.t.d.AbstractDelegationTokenSecretManager ExpiredTokenRemover received java.lang.InterruptedException: sleep interrupted
[junit4] 2> 91840 ERROR (Thread[Thread-170,5,TGRP-TestSolrCloudWithDelegationTokens]) [n:127.0.0.1:58053_solr ] o.a.h.s.t.d.AbstractDelegationTokenSecretManager ExpiredTokenRemover received java.lang.InterruptedException: sleep interrupted
[junit4] 2> 91860 WARN (NIOServerCxn.Factory:0.0.0.0/0.0.0.0:0) [ ] o.a.z.s.NIOServerCnxn caught end of stream exception
[junit4] 2> EndOfStreamException: Unable to read additional data from client sessionid 0x157985ae0750008, likely client has closed socket
[junit4] 2> at org.apache.zookeeper.server.NIOServerCnxn.doIO(NIOServerCnxn.java:228)
[junit4] 2> at org.apache.zookeeper.server.NIOServerCnxnFactory.run(NIOServerCnxnFactory.java:208)
[junit4] 2> at java.lang.Thread.run(Thread.java:745)
[junit4] 2> 91862 INFO (jetty-launcher-101-thread-2) [ ] o.e.j.s.h.ContextHandler Stopped o.e.j.s.ServletContextHandler@58de60ae{/solr,null,UNAVAILABLE}
[junit4] 2> 91862 INFO (jetty-launcher-101-thread-1) [ ] o.e.j.s.h.ContextHandler Stopped o.e.j.s.ServletContextHandler@ba4ec62{/solr,null,UNAVAILABLE}
[junit4] 2> 91869 INFO (SUITE-TestSolrCloudWithDelegationTokens-seed#[AECFB86B780AEA4F]-worker) [ ] o.a.s.c.ZkTestServer connecting to 127.0.0.1:44973 44973
[junit4] 2> 92007 WARN (NIOServerCxn.Factory:0.0.0.0/0.0.0.0:0) [ ] o.a.z.s.NIOServerCnxnFactory Ignoring unexpected runtime exception
[junit4] 2> java.nio.channels.CancelledKeyException
[junit4] 2> at sun.nio.ch.SelectionKeyImpl.ensureValid(SelectionKeyImpl.java:73)
[junit4] 2> at sun.nio.ch.SelectionKeyImpl.readyOps(SelectionKeyImpl.java:87)
[junit4] 2> at org.apache.zookeeper.server.NIOServerCnxnFactory.run(NIOServerCnxnFactory.java:187)
[junit4] 2> at java.lang.Thread.run(Thread.java:745)
[junit4] 2> 92009 INFO (Thread-153) [ ] o.a.s.c.ZkTestServer connecting to 127.0.0.1:44973 44973
[junit4] 2> 92013 WARN (Thread-153) [ ] o.a.s.c.ZkTestServer Watch limit violations:
[junit4] 2> Maximum concurrent create/delete watches above limit:
[junit4] 2>
[junit4] 2> 17 /solr/aliases.json
[junit4] 2> 17 /solr/clusterprops.json
[junit4] 2> 2 /solr/security.json
[junit4] 2>
[junit4] 2> Maximum concurrent data watches above limit:
[junit4] 2>
[junit4] 2> 17 /solr/clusterstate.json
[junit4] 2> 3 /solr/security/zkdtsm/ZKDTSMRoot/ZKDTSMKeyIdRoot
[junit4] 2> 2 /solr/security/zkdtsm/ZKDTSMRoot/ZKDTSMTokensRoot/DT_7
[junit4] 2> 2 /solr/security/zkdtsm/ZKDTSMRoot/ZKDTSMTokensRoot/DT_6
[junit4] 2> 2 /solr/security/zkdtsm/ZKDTSMRoot/ZKDTSMTokensRoot/DT_9
[junit4] 2> 2 /solr/security/zkdtsm/ZKDTSMRoot/ZKDTSMTokensRoot/DT_8
[junit4] 2> 2 /solr/security/zkdtsm/ZKDTSMRoot/ZKDTSMMasterKeyRoot/DK_1
[junit4] 2> 2 /solr/security/zkdtsm/ZKDTSMRoot/ZKDTSMTokensRoot/DT_1
[junit4] 2> 2 /solr/security/zkdtsm/ZKDTSMRoot/ZKDTSMMasterKeyRoot/DK_3
[junit4] 2> 2 /solr/security/zkdtsm/ZKDTSMRoot/ZKDTSMTokensRoot/DT_3
[junit4] 2> 2 /solr/security/zkdtsm/ZKDTSMRoot/ZKDTSMMasterKeyRoot/DK_2
[junit4] 2> 2 /solr/security/zkdtsm/ZKDTSMRoot/ZKDTSMTokensRoot/DT_2
[junit4] 2> 2 /solr/security/zkdtsm/ZKDTSMRoot/ZKDTSMTokensRoot/DT_5
[junit4] 2> 2 /solr/security/zkdtsm/ZKDTSMRoot/ZKDTSMMasterKeyRoot/DK_4
[junit4] 2> 2 /solr/security/zkdtsm/ZKDTSMRoot/ZKDTSMTokensRoot/DT_4
[junit4] 2> 2 /solr/security/zkdtsm/ZKDTSMRoot/ZKDTSMTokensRoot/DT_12
[junit4] 2> 2 /solr/security/zkdtsm/ZKDTSMRoot/ZKDTSMSeqNumRoot
[junit4] 2> 2 /solr/security/zkdtsm/ZKDTSMRoot/ZKDTSMTokensRoot/DT_11
[junit4] 2> 2 /solr/security/zkdtsm/ZKDTSMRoot/ZKDTSMTokensRoot/DT_10
[junit4] 2>
[junit4] 2> Maximum concurrent children watches above limit:
[junit4] 2>
[junit4] 2> 17 /solr/live_nodes
[junit4] 2> 17 /solr/collections
[junit4] 2> 3 /solr/overseer/queue
[junit4] 2> 3 /solr/overseer/collection-queue-work
[junit4] 2> 2 /solr/security/zkdtsm/ZKDTSMRoot/ZKDTSMMasterKeyRoot
[junit4] 2> 2 /solr/overseer/queue-work
[junit4] 2> 2 /solr/security/zkdtsm/ZKDTSMRoot/ZKDTSMTokensRoot
[junit4] 2>
[junit4] 2> 92015 INFO (SUITE-TestSolrCloudWithDelegationTokens-seed#[AECFB86B780AEA4F]-worker) [ ] o.a.s.SolrTestCaseJ4 ###deleteCore
[junit4] 2> NOTE: leaving temporary files on disk at: /export/home/jenkins/workspace/Lucene-Solr-6.x-Solaris/solr/build/solr-core/test/J0/temp/solr.cloud.TestSolrCloudWithDelegationTokens_AECFB86B780AEA4F-001
[junit4] 2> Oct 06, 2016 4:57:58 AM com.carrotsearch.randomizedtesting.ThreadLeakControl checkThreadLeaks
[junit4] 2> WARNING: Will linger awaiting termination of 1 leaked thread(s).
[junit4] 2> NOTE: test params are: codec=FastDecompressionCompressingStoredFields(storedFieldsFormat=CompressingStoredFieldsFormat(compressionMode=FAST_DECOMPRESSION, chunkSize=31468, maxDocsPerChunk=10, blockSize=2), termVectorsFormat=CompressingTermVectorsFormat(compressionMode=FAST_DECOMPRESSION, chunkSize=31468, blockSize=2)), sim=RandomSimilarity(queryNorm=false,coord=no): {}, locale=sq-AL, timezone=America/Knox_IN
[junit4] 2> NOTE: SunOS 5.11 amd64/Oracle Corporation 1.8.0_102 (64-bit)/cpus=3,threads=1,free=111999584,total=285212672
[junit4] 2> NOTE: All tests run in this JVM: [TestCoreContainer, TestLRUCache, TestConfigSetsAPIExclusivity, ConjunctionSolrSpellCheckerTest, TestPivotHelperCode, SyncSliceTest, TestImplicitCoreProperties, ExplicitHLLTest, TestSolrConfigHandler, DirectUpdateHandlerTest, TestSolrCloudWithDelegationTokens]
[junit4] Completed [16/637 (1!)] on J0 in 4.16s, 8 tests, 1 failure <<< FAILURES!
[...truncated 62358 lines...]
[JENKINS] Lucene-Solr-6.x-Solaris (64bit/jdk1.8.0) - Build # 435 -
Still Unstable!
Posted by Policeman Jenkins Server <je...@thetaphi.de>.
Build: https://jenkins.thetaphi.de/job/Lucene-Solr-6.x-Solaris/435/
Java: 64bit/jdk1.8.0 -XX:-UseCompressedOops -XX:+UseG1GC
1 tests failed.
FAILED: org.apache.solr.update.AutoCommitTest.testCommitWithin
Error Message:
Exception during query
Stack Trace:
java.lang.RuntimeException: Exception during query
at __randomizedtesting.SeedInfo.seed([C2C2811B21090BC:B6FE4769313E7EA9]:0)
at org.apache.solr.SolrTestCaseJ4.assertQ(SolrTestCaseJ4.java:813)
at org.apache.solr.update.AutoCommitTest.testCommitWithin(AutoCommitTest.java:353)
at sun.reflect.NativeMethodAccessorImpl.invoke0(Native Method)
at sun.reflect.NativeMethodAccessorImpl.invoke(NativeMethodAccessorImpl.java:62)
at sun.reflect.DelegatingMethodAccessorImpl.invoke(DelegatingMethodAccessorImpl.java:43)
at java.lang.reflect.Method.invoke(Method.java:498)
at com.carrotsearch.randomizedtesting.RandomizedRunner.invoke(RandomizedRunner.java:1764)
at com.carrotsearch.randomizedtesting.RandomizedRunner$8.evaluate(RandomizedRunner.java:871)
at com.carrotsearch.randomizedtesting.RandomizedRunner$9.evaluate(RandomizedRunner.java:907)
at com.carrotsearch.randomizedtesting.RandomizedRunner$10.evaluate(RandomizedRunner.java:921)
at com.carrotsearch.randomizedtesting.rules.SystemPropertiesRestoreRule$1.evaluate(SystemPropertiesRestoreRule.java:57)
at org.apache.lucene.util.TestRuleSetupTeardownChained$1.evaluate(TestRuleSetupTeardownChained.java:49)
at org.apache.lucene.util.AbstractBeforeAfterRule$1.evaluate(AbstractBeforeAfterRule.java:45)
at org.apache.lucene.util.TestRuleThreadAndTestName$1.evaluate(TestRuleThreadAndTestName.java:48)
at org.apache.lucene.util.TestRuleIgnoreAfterMaxFailures$1.evaluate(TestRuleIgnoreAfterMaxFailures.java:64)
at org.apache.lucene.util.TestRuleMarkFailure$1.evaluate(TestRuleMarkFailure.java:47)
at com.carrotsearch.randomizedtesting.rules.StatementAdapter.evaluate(StatementAdapter.java:36)
at com.carrotsearch.randomizedtesting.ThreadLeakControl$StatementRunner.run(ThreadLeakControl.java:367)
at com.carrotsearch.randomizedtesting.ThreadLeakControl.forkTimeoutingTask(ThreadLeakControl.java:809)
at com.carrotsearch.randomizedtesting.ThreadLeakControl$3.evaluate(ThreadLeakControl.java:460)
at com.carrotsearch.randomizedtesting.RandomizedRunner.runSingleTest(RandomizedRunner.java:880)
at com.carrotsearch.randomizedtesting.RandomizedRunner$5.evaluate(RandomizedRunner.java:781)
at com.carrotsearch.randomizedtesting.RandomizedRunner$6.evaluate(RandomizedRunner.java:816)
at com.carrotsearch.randomizedtesting.RandomizedRunner$7.evaluate(RandomizedRunner.java:827)
at com.carrotsearch.randomizedtesting.rules.StatementAdapter.evaluate(StatementAdapter.java:36)
at com.carrotsearch.randomizedtesting.rules.SystemPropertiesRestoreRule$1.evaluate(SystemPropertiesRestoreRule.java:57)
at org.apache.lucene.util.AbstractBeforeAfterRule$1.evaluate(AbstractBeforeAfterRule.java:45)
at com.carrotsearch.randomizedtesting.rules.StatementAdapter.evaluate(StatementAdapter.java:36)
at org.apache.lucene.util.TestRuleStoreClassName$1.evaluate(TestRuleStoreClassName.java:41)
at com.carrotsearch.randomizedtesting.rules.NoShadowingOrOverridesOnMethodsRule$1.evaluate(NoShadowingOrOverridesOnMethodsRule.java:40)
at com.carrotsearch.randomizedtesting.rules.NoShadowingOrOverridesOnMethodsRule$1.evaluate(NoShadowingOrOverridesOnMethodsRule.java:40)
at com.carrotsearch.randomizedtesting.rules.StatementAdapter.evaluate(StatementAdapter.java:36)
at com.carrotsearch.randomizedtesting.rules.StatementAdapter.evaluate(StatementAdapter.java:36)
at com.carrotsearch.randomizedtesting.rules.StatementAdapter.evaluate(StatementAdapter.java:36)
at org.apache.lucene.util.TestRuleAssertionsRequired$1.evaluate(TestRuleAssertionsRequired.java:53)
at org.apache.lucene.util.TestRuleMarkFailure$1.evaluate(TestRuleMarkFailure.java:47)
at org.apache.lucene.util.TestRuleIgnoreAfterMaxFailures$1.evaluate(TestRuleIgnoreAfterMaxFailures.java:64)
at org.apache.lucene.util.TestRuleIgnoreTestSuites$1.evaluate(TestRuleIgnoreTestSuites.java:54)
at com.carrotsearch.randomizedtesting.rules.StatementAdapter.evaluate(StatementAdapter.java:36)
at com.carrotsearch.randomizedtesting.ThreadLeakControl$StatementRunner.run(ThreadLeakControl.java:367)
at java.lang.Thread.run(Thread.java:745)
Caused by: java.lang.RuntimeException: REQUEST FAILED: xpath=//result[@numFound=1]
xml response was: <?xml version="1.0" encoding="UTF-8"?>
<response>
<lst name="responseHeader"><int name="status">0</int><int name="QTime">0</int></lst><result name="response" numFound="0" start="0"></result>
</response>
request was:q=id:529&qt=standard&start=0&rows=20&version=2.2
at org.apache.solr.SolrTestCaseJ4.assertQ(SolrTestCaseJ4.java:806)
... 40 more
Build Log:
[...truncated 11670 lines...]
[junit4] Suite: org.apache.solr.update.AutoCommitTest
[junit4] 2> Creating dataDir: /export/home/jenkins/workspace/Lucene-Solr-6.x-Solaris/solr/build/solr-core/test/J1/temp/solr.update.AutoCommitTest_C2C2811B21090BC-001/init-core-data-001
[junit4] 2> 1596351 INFO (SUITE-AutoCommitTest-seed#[C2C2811B21090BC]-worker) [ ] o.a.s.SolrTestCaseJ4 Randomized ssl (false) and clientAuth (false) via: @org.apache.solr.util.RandomizeSSL(reason=, value=NaN, ssl=NaN, clientAuth=NaN)
[junit4] 2> 1596352 INFO (SUITE-AutoCommitTest-seed#[C2C2811B21090BC]-worker) [ ] o.a.s.SolrTestCaseJ4 ####initCore
[junit4] 2> 1596353 INFO (SUITE-AutoCommitTest-seed#[C2C2811B21090BC]-worker) [ ] o.a.s.c.SolrResourceLoader [null] Added 2 libs to classloader, from paths: [/export/home/jenkins/workspace/Lucene-Solr-6.x-Solaris/solr/core/src/test-files/solr/collection1/lib, /export/home/jenkins/workspace/Lucene-Solr-6.x-Solaris/solr/core/src/test-files/solr/collection1/lib/classes]
[junit4] 2> 1596396 WARN (SUITE-AutoCommitTest-seed#[C2C2811B21090BC]-worker) [ ] o.a.s.c.Config Beginning with Solr 5.5, <mergePolicy> is deprecated, use <mergePolicyFactory> instead.
[junit4] 2> 1596398 INFO (SUITE-AutoCommitTest-seed#[C2C2811B21090BC]-worker) [ ] o.a.s.c.SolrConfig Using Lucene MatchVersion: 6.3.0
[junit4] 2> 1596431 INFO (SUITE-AutoCommitTest-seed#[C2C2811B21090BC]-worker) [ ] o.a.s.s.IndexSchema [null] Schema name=test
[junit4] 2> 1596595 WARN (SUITE-AutoCommitTest-seed#[C2C2811B21090BC]-worker) [ ] o.a.s.s.IndexSchema [null] default search field in schema is text. WARNING: Deprecated, please use 'df' on request instead.
[junit4] 2> 1596598 INFO (SUITE-AutoCommitTest-seed#[C2C2811B21090BC]-worker) [ ] o.a.s.s.IndexSchema Loaded schema test/1.0 with uniqueid field id
[junit4] 2> 1596610 INFO (SUITE-AutoCommitTest-seed#[C2C2811B21090BC]-worker) [ ] o.a.s.u.UpdateShardHandler Creating UpdateShardHandler HTTP client with params: socketTimeout=30000&connTimeout=30000&retry=true
[junit4] 2> 1596614 INFO (coreLoadExecutor-5854-thread-1) [ ] o.a.s.c.SolrResourceLoader [null] Added 2 libs to classloader, from paths: [/export/home/jenkins/workspace/Lucene-Solr-6.x-Solaris/solr/core/src/test-files/solr/collection1/lib, /export/home/jenkins/workspace/Lucene-Solr-6.x-Solaris/solr/core/src/test-files/solr/collection1/lib/classes]
[junit4] 2> 1596642 WARN (coreLoadExecutor-5854-thread-1) [ ] o.a.s.c.Config Beginning with Solr 5.5, <mergePolicy> is deprecated, use <mergePolicyFactory> instead.
[junit4] 2> 1596643 INFO (coreLoadExecutor-5854-thread-1) [ ] o.a.s.c.SolrConfig Using Lucene MatchVersion: 6.3.0
[junit4] 2> 1596664 INFO (coreLoadExecutor-5854-thread-1) [ ] o.a.s.s.IndexSchema [collection1] Schema name=test
[junit4] 2> 1596847 WARN (coreLoadExecutor-5854-thread-1) [ ] o.a.s.s.IndexSchema [collection1] default search field in schema is text. WARNING: Deprecated, please use 'df' on request instead.
[junit4] 2> 1596849 INFO (coreLoadExecutor-5854-thread-1) [ ] o.a.s.s.IndexSchema Loaded schema test/1.0 with uniqueid field id
[junit4] 2> 1596857 INFO (coreLoadExecutor-5854-thread-1) [ ] o.a.s.c.CoreContainer Creating SolrCore 'collection1' using configuration from instancedir /export/home/jenkins/workspace/Lucene-Solr-6.x-Solaris/solr/core/src/test-files/solr/collection1
[junit4] 2> 1596857 INFO (coreLoadExecutor-5854-thread-1) [ x:collection1] o.a.s.c.SolrCore [[collection1] ] Opening new SolrCore at [/export/home/jenkins/workspace/Lucene-Solr-6.x-Solaris/solr/core/src/test-files/solr/collection1], dataDir=[/export/home/jenkins/workspace/Lucene-Solr-6.x-Solaris/solr/build/solr-core/test/J1/temp/solr.update.AutoCommitTest_C2C2811B21090BC-001/init-core-data-001/]
[junit4] 2> 1596857 INFO (coreLoadExecutor-5854-thread-1) [ x:collection1] o.a.s.c.JmxMonitoredMap JMX monitoring is enabled. Adding Solr mbeans to JMX Server: com.sun.jmx.mbeanserver.JmxMBeanServer@57c75c38
[junit4] 2> 1596858 INFO (coreLoadExecutor-5854-thread-1) [ x:collection1] o.a.s.u.RandomMergePolicy RandomMergePolicy wrapping class org.apache.lucene.index.TieredMergePolicy: [TieredMergePolicy: maxMergeAtOnce=36, maxMergeAtOnceExplicit=22, maxMergedSegmentMB=41.9384765625, floorSegmentMB=1.4560546875, forceMergeDeletesPctAllowed=26.611174845021683, segmentsPerTier=38.0, maxCFSSegmentSizeMB=8.796093022207999E12, noCFSRatio=0.7985059270350227
[junit4] 2> 1596874 INFO (coreLoadExecutor-5854-thread-1) [ x:collection1] o.a.s.u.UpdateHandler Using UpdateLog implementation: org.apache.solr.update.UpdateLog
[junit4] 2> 1596875 INFO (coreLoadExecutor-5854-thread-1) [ x:collection1] o.a.s.u.UpdateLog Initializing UpdateLog: dataDir= defaultSyncLevel=FLUSH numRecordsToKeep=100 maxNumLogsToKeep=10 numVersionBuckets=65536
[junit4] 2> 1596876 INFO (coreLoadExecutor-5854-thread-1) [ x:collection1] o.a.s.u.CommitTracker Hard AutoCommit: disabled
[junit4] 2> 1596876 INFO (coreLoadExecutor-5854-thread-1) [ x:collection1] o.a.s.u.CommitTracker Soft AutoCommit: disabled
[junit4] 2> 1596877 INFO (coreLoadExecutor-5854-thread-1) [ x:collection1] o.a.s.u.RandomMergePolicy RandomMergePolicy wrapping class org.apache.lucene.index.TieredMergePolicy: [TieredMergePolicy: maxMergeAtOnce=48, maxMergeAtOnceExplicit=40, maxMergedSegmentMB=32.818359375, floorSegmentMB=0.765625, forceMergeDeletesPctAllowed=29.878024508138747, segmentsPerTier=49.0, maxCFSSegmentSizeMB=8.796093022207999E12, noCFSRatio=0.5329995786460127
[junit4] 2> 1596877 INFO (coreLoadExecutor-5854-thread-1) [ x:collection1] o.a.s.s.SolrIndexSearcher Opening [Searcher@9ad8e91[collection1] main]
[junit4] 2> 1596877 INFO (coreLoadExecutor-5854-thread-1) [ x:collection1] o.a.s.h.c.SpellCheckComponent Initializing spell checkers
[junit4] 2> 1596881 INFO (coreLoadExecutor-5854-thread-1) [ x:collection1] o.a.s.s.DirectSolrSpellChecker init: {name=direct,classname=DirectSolrSpellChecker,field=lowerfilt,minQueryLength=3}
[junit4] 2> 1596922 INFO (coreLoadExecutor-5854-thread-1) [ x:collection1] o.a.s.h.ReplicationHandler Commits will be reserved for 10000
[junit4] 2> 1596922 INFO (searcherExecutor-5855-thread-1-processing-x:collection1) [ x:collection1] o.a.s.h.c.SpellCheckComponent Loading spell index for spellchecker: default
[junit4] 2> 1596923 INFO (searcherExecutor-5855-thread-1-processing-x:collection1) [ x:collection1] o.a.s.h.c.SpellCheckComponent Loading spell index for spellchecker: direct
[junit4] 2> 1596923 INFO (searcherExecutor-5855-thread-1-processing-x:collection1) [ x:collection1] o.a.s.h.c.SpellCheckComponent Loading spell index for spellchecker: wordbreak
[junit4] 2> 1596923 INFO (searcherExecutor-5855-thread-1-processing-x:collection1) [ x:collection1] o.a.s.h.c.SpellCheckComponent Loading spell index for spellchecker: multipleFields
[junit4] 2> 1596923 INFO (coreLoadExecutor-5854-thread-1) [ x:collection1] o.a.s.u.UpdateLog Could not find max version in index or recent updates, using new clock 1547452060388032512
[junit4] 2> 1596923 INFO (searcherExecutor-5855-thread-1-processing-x:collection1) [ x:collection1] o.a.s.h.c.SpellCheckComponent Loading spell index for spellchecker: jarowinkler
[junit4] 2> 1596924 INFO (searcherExecutor-5855-thread-1-processing-x:collection1) [ x:collection1] o.a.s.h.c.SpellCheckComponent Loading spell index for spellchecker: external
[junit4] 2> 1596925 INFO (searcherExecutor-5855-thread-1-processing-x:collection1) [ x:collection1] o.a.s.h.c.SpellCheckComponent Loading spell index for spellchecker: freq
[junit4] 2> 1596925 INFO (searcherExecutor-5855-thread-1-processing-x:collection1) [ x:collection1] o.a.s.h.c.SpellCheckComponent Loading spell index for spellchecker: fqcn
[junit4] 2> 1596926 INFO (searcherExecutor-5855-thread-1-processing-x:collection1) [ x:collection1] o.a.s.h.c.SpellCheckComponent Loading spell index for spellchecker: perDict
[junit4] 2> 1596926 INFO (searcherExecutor-5855-thread-1-processing-x:collection1) [ x:collection1] o.a.s.c.SolrCore [collection1] Registered new searcher Searcher@9ad8e91[collection1] main{ExitableDirectoryReader(UninvertingDirectoryReader())}
[junit4] 2> 1596927 INFO (SUITE-AutoCommitTest-seed#[C2C2811B21090BC]-worker) [ ] o.a.s.SolrTestCaseJ4 ####initCore end
[junit4] 2> 1596931 INFO (TEST-AutoCommitTest.testMaxDocs-seed#[C2C2811B21090BC]) [ ] o.a.s.SolrTestCaseJ4 ###Starting testMaxDocs
[junit4] 2> 1596933 INFO (TEST-AutoCommitTest.testMaxDocs-seed#[C2C2811B21090BC]) [ ] o.a.s.u.p.LogUpdateProcessorFactory [collection1] webapp=null path=null params={}{deleteByQuery=*:* (-1547452060396421120)} 0 1
[junit4] 2> 1596935 INFO (TEST-AutoCommitTest.testMaxDocs-seed#[C2C2811B21090BC]) [ ] o.a.s.c.SolrResourceLoader [null] Added 2 libs to classloader, from paths: [/export/home/jenkins/workspace/Lucene-Solr-6.x-Solaris/solr/core/src/test-files/solr/collection1/lib, /export/home/jenkins/workspace/Lucene-Solr-6.x-Solaris/solr/core/src/test-files/solr/collection1/lib/classes]
[junit4] 2> 1596971 WARN (TEST-AutoCommitTest.testMaxDocs-seed#[C2C2811B21090BC]) [ ] o.a.s.c.Config Beginning with Solr 5.5, <mergePolicy> is deprecated, use <mergePolicyFactory> instead.
[junit4] 2> 1596973 INFO (TEST-AutoCommitTest.testMaxDocs-seed#[C2C2811B21090BC]) [ ] o.a.s.c.SolrConfig Using Lucene MatchVersion: 6.3.0
[junit4] 2> 1597014 INFO (TEST-AutoCommitTest.testMaxDocs-seed#[C2C2811B21090BC]) [ ] o.a.s.s.IndexSchema [collection1] Schema name=test
[junit4] 2> 1597155 WARN (TEST-AutoCommitTest.testMaxDocs-seed#[C2C2811B21090BC]) [ ] o.a.s.s.IndexSchema [collection1] default search field in schema is text. WARNING: Deprecated, please use 'df' on request instead.
[junit4] 2> 1597159 INFO (TEST-AutoCommitTest.testMaxDocs-seed#[C2C2811B21090BC]) [ ] o.a.s.s.IndexSchema Loaded schema test/1.0 with uniqueid field id
[junit4] 2> 1597171 INFO (TEST-AutoCommitTest.testMaxDocs-seed#[C2C2811B21090BC]) [ ] o.a.s.c.CoreContainer Reloading SolrCore 'collection1' using configuration from instancedir /export/home/jenkins/workspace/Lucene-Solr-6.x-Solaris/solr/core/src/test-files/solr/collection1
[junit4] 2> 1597171 INFO (TEST-AutoCommitTest.testMaxDocs-seed#[C2C2811B21090BC]) [ x:collection1] o.a.s.c.SolrCore [[collection1] ] Opening new SolrCore at [/export/home/jenkins/workspace/Lucene-Solr-6.x-Solaris/solr/core/src/test-files/solr/collection1], dataDir=[/export/home/jenkins/workspace/Lucene-Solr-6.x-Solaris/solr/build/solr-core/test/J1/temp/solr.update.AutoCommitTest_C2C2811B21090BC-001/init-core-data-001/]
[junit4] 2> 1597172 INFO (TEST-AutoCommitTest.testMaxDocs-seed#[C2C2811B21090BC]) [ x:collection1] o.a.s.c.JmxMonitoredMap JMX monitoring is enabled. Adding Solr mbeans to JMX Server: com.sun.jmx.mbeanserver.JmxMBeanServer@57c75c38
[junit4] 2> 1597203 INFO (TEST-AutoCommitTest.testMaxDocs-seed#[C2C2811B21090BC]) [ x:collection1] o.a.s.u.CommitTracker Hard AutoCommit: disabled
[junit4] 2> 1597203 INFO (TEST-AutoCommitTest.testMaxDocs-seed#[C2C2811B21090BC]) [ x:collection1] o.a.s.u.CommitTracker Soft AutoCommit: disabled
[junit4] 2> 1597204 INFO (TEST-AutoCommitTest.testMaxDocs-seed#[C2C2811B21090BC]) [ x:collection1] o.a.s.s.SolrIndexSearcher Opening [Searcher@7e6bc80b[collection1] main]
[junit4] 2> 1597205 INFO (TEST-AutoCommitTest.testMaxDocs-seed#[C2C2811B21090BC]) [ x:collection1] o.a.s.h.c.SpellCheckComponent Initializing spell checkers
[junit4] 2> 1597206 INFO (TEST-AutoCommitTest.testMaxDocs-seed#[C2C2811B21090BC]) [ x:collection1] o.a.s.s.DirectSolrSpellChecker init: {name=direct,classname=DirectSolrSpellChecker,field=lowerfilt,minQueryLength=3}
[junit4] 2> 1597213 INFO (TEST-AutoCommitTest.testMaxDocs-seed#[C2C2811B21090BC]) [ x:collection1] o.a.s.h.ReplicationHandler Commits will be reserved for 10000
[junit4] 2> 1597214 INFO (searcherExecutor-5860-thread-1-processing-x:collection1) [ x:collection1] o.a.s.h.c.SpellCheckComponent Loading spell index for spellchecker: default
[junit4] 2> 1597214 INFO (searcherExecutor-5860-thread-1-processing-x:collection1) [ x:collection1] o.a.s.h.c.SpellCheckComponent Loading spell index for spellchecker: direct
[junit4] 2> 1597214 INFO (searcherExecutor-5860-thread-1-processing-x:collection1) [ x:collection1] o.a.s.h.c.SpellCheckComponent Loading spell index for spellchecker: wordbreak
[junit4] 2> 1597214 INFO (searcherExecutor-5860-thread-1-processing-x:collection1) [ x:collection1] o.a.s.h.c.SpellCheckComponent Loading spell index for spellchecker: multipleFields
[junit4] 2> 1597215 INFO (searcherExecutor-5860-thread-1-processing-x:collection1) [ x:collection1] o.a.s.h.c.SpellCheckComponent Loading spell index for spellchecker: jarowinkler
[junit4] 2> 1597216 INFO (searcherExecutor-5860-thread-1-processing-x:collection1) [ x:collection1] o.a.s.h.c.SpellCheckComponent Loading spell index for spellchecker: external
[junit4] 2> 1597216 INFO (searcherExecutor-5860-thread-1-processing-x:collection1) [ x:collection1] o.a.s.h.c.SpellCheckComponent Loading spell index for spellchecker: freq
[junit4] 2> 1597217 INFO (searcherExecutor-5860-thread-1-processing-x:collection1) [ x:collection1] o.a.s.h.c.SpellCheckComponent Loading spell index for spellchecker: fqcn
[junit4] 2> 1597217 INFO (TEST-AutoCommitTest.testMaxDocs-seed#[C2C2811B21090BC]) [ x:collection1] o.a.s.u.RandomMergePolicy RandomMergePolicy wrapping class org.apache.lucene.index.LogDocMergePolicy: [LogDocMergePolicy: minMergeSize=1000, mergeFactor=19, maxMergeSize=9223372036854775807, maxMergeSizeForForcedMerge=9223372036854775807, calibrateSizeByDeletes=false, maxMergeDocs=2147483647, maxCFSSegmentSizeMB=8.796093022207999E12, noCFSRatio=0.5887387035944357]
[junit4] 2> 1597217 INFO (searcherExecutor-5860-thread-1-processing-x:collection1) [ x:collection1] o.a.s.h.c.SpellCheckComponent Loading spell index for spellchecker: perDict
[junit4] 2> 1597218 INFO (TEST-AutoCommitTest.testMaxDocs-seed#[C2C2811B21090BC]) [ x:collection1] o.a.s.u.DefaultSolrCoreState New IndexWriter is ready to be used.
[junit4] 2> 1597219 INFO (searcherExecutor-5860-thread-1-processing-x:collection1) [ x:collection1] o.a.s.c.SolrCore [collection1] Registered new searcher Searcher@7e6bc80b[collection1] main{ExitableDirectoryReader(UninvertingDirectoryReader())}
[junit4] 2> 1597219 INFO (TEST-AutoCommitTest.testMaxDocs-seed#[C2C2811B21090BC]) [ x:collection1] o.a.s.s.SolrIndexSearcher Opening [Searcher@9e9ec18[collection1] main]
[junit4] 2> 1597220 INFO (TEST-AutoCommitTest.testMaxDocs-seed#[C2C2811B21090BC]) [ x:collection1] o.a.s.c.SolrCore [collection1] CLOSING SolrCore org.apache.solr.core.SolrCore@6d50f0b5
[junit4] 2> 1597221 INFO (searcherExecutor-5860-thread-1-processing-x:collection1) [ x:collection1] o.a.s.c.SolrCore [collection1] Registered new searcher Searcher@9e9ec18[collection1] main{ExitableDirectoryReader(UninvertingDirectoryReader())}
[junit4] 2> 1597237 INFO (TEST-AutoCommitTest.testMaxDocs-seed#[C2C2811B21090BC]) [ x:collection1] o.a.s.u.p.LogUpdateProcessorFactory [collection1] {add=[0 (1547452060716236800)]} 0 1
[junit4] 2> 1597237 INFO (TEST-AutoCommitTest.testMaxDocs-seed#[C2C2811B21090BC]) [ x:collection1] o.a.s.u.p.LogUpdateProcessorFactory [collection1] {add=[1 (1547452060717285376)]} 0 1
[junit4] 2> 1597238 INFO (TEST-AutoCommitTest.testMaxDocs-seed#[C2C2811B21090BC]) [ x:collection1] o.a.s.u.p.LogUpdateProcessorFactory [collection1] {add=[2 (1547452060717285377)]} 0 2
[junit4] 2> 1597238 INFO (TEST-AutoCommitTest.testMaxDocs-seed#[C2C2811B21090BC]) [ x:collection1] o.a.s.u.p.LogUpdateProcessorFactory [collection1] {add=[3 (1547452060718333952)]} 0 2
[junit4] 2> 1597238 INFO (TEST-AutoCommitTest.testMaxDocs-seed#[C2C2811B21090BC]) [ x:collection1] o.a.s.u.p.LogUpdateProcessorFactory [collection1] {add=[4 (1547452060718333953)]} 0 2
[junit4] 2> 1597238 INFO (TEST-AutoCommitTest.testMaxDocs-seed#[C2C2811B21090BC]) [ x:collection1] o.a.s.u.p.LogUpdateProcessorFactory [collection1] {add=[5 (1547452060718333954)]} 0 2
[junit4] 2> 1597239 INFO (TEST-AutoCommitTest.testMaxDocs-seed#[C2C2811B21090BC]) [ x:collection1] o.a.s.u.p.LogUpdateProcessorFactory [collection1] {add=[6 (1547452060719382528)]} 0 3
[junit4] 2> 1597239 INFO (TEST-AutoCommitTest.testMaxDocs-seed#[C2C2811B21090BC]) [ x:collection1] o.a.s.u.p.LogUpdateProcessorFactory [collection1] {add=[7 (1547452060719382529)]} 0 3
[junit4] 2> 1597239 INFO (TEST-AutoCommitTest.testMaxDocs-seed#[C2C2811B21090BC]) [ x:collection1] o.a.s.u.p.LogUpdateProcessorFactory [collection1] {add=[8 (1547452060719382530)]} 0 3
[junit4] 2> 1597239 INFO (TEST-AutoCommitTest.testMaxDocs-seed#[C2C2811B21090BC]) [ x:collection1] o.a.s.u.p.LogUpdateProcessorFactory [collection1] {add=[9 (1547452060719382531)]} 0 3
[junit4] 2> 1597239 INFO (TEST-AutoCommitTest.testMaxDocs-seed#[C2C2811B21090BC]) [ x:collection1] o.a.s.u.p.LogUpdateProcessorFactory [collection1] {add=[10 (1547452060719382532)]} 0 3
[junit4] 2> 1597240 INFO (TEST-AutoCommitTest.testMaxDocs-seed#[C2C2811B21090BC]) [ x:collection1] o.a.s.u.p.LogUpdateProcessorFactory [collection1] {add=[11 (1547452060719382533)]} 0 4
[junit4] 2> 1597240 INFO (TEST-AutoCommitTest.testMaxDocs-seed#[C2C2811B21090BC]) [ x:collection1] o.a.s.u.p.LogUpdateProcessorFactory [collection1] {add=[12 (1547452060720431104)]} 0 4
[junit4] 2> 1597241 INFO (TEST-AutoCommitTest.testMaxDocs-seed#[C2C2811B21090BC]) [ x:collection1] o.a.s.u.p.LogUpdateProcessorFactory [collection1] {add=[13 (1547452060720431105)]} 0 5
[junit4] 2> 1597241 INFO (TEST-AutoCommitTest.testMaxDocs-seed#[C2C2811B21090BC]) [ x:collection1] o.a.s.c.S.Request [collection1] webapp=null path=null params={q=id:1&qt=standard&start=0&rows=20&version=2.2} hits=0 status=0 QTime=0
[junit4] 2> 1597242 INFO (TEST-AutoCommitTest.testMaxDocs-seed#[C2C2811B21090BC]) [ x:collection1] o.a.s.u.p.LogUpdateProcessorFactory [collection1] {add=[14 (1547452060721479680)]} 0 6
[junit4] 2> 1597244 INFO (commitScheduler-5863-thread-1) [ x:collection1] o.a.s.u.DirectUpdateHandler2 start commit{,optimize=false,openSearcher=true,waitSearcher=true,expungeDeletes=false,softCommit=true,prepareCommit=false}
[junit4] 2> 1597247 INFO (commitScheduler-5863-thread-1) [ x:collection1] o.a.s.s.SolrIndexSearcher Opening [Searcher@1e949b61[collection1] main]
[junit4] 2> 1597249 INFO (commitScheduler-5863-thread-1) [ x:collection1] o.a.s.u.DirectUpdateHandler2 end_commit_flush
[junit4] 2> 1597249 INFO (searcherExecutor-5860-thread-1-processing-x:collection1) [ x:collection1] o.a.s.c.SolrCore [collection1] Registered new searcher Searcher@1e949b61[collection1] main{ExitableDirectoryReader(UninvertingDirectoryReader(Uninverting(_0(6.3.0):c15)))}
[junit4] 2> 1597493 INFO (TEST-AutoCommitTest.testMaxDocs-seed#[C2C2811B21090BC]) [ x:collection1] o.a.s.u.p.LogUpdateProcessorFactory [collection1] {add=[15 (1547452060985720832)]} 0 258
[junit4] 2> 1597494 INFO (TEST-AutoCommitTest.testMaxDocs-seed#[C2C2811B21090BC]) [ x:collection1] o.a.s.c.S.Request [collection1] webapp=null path=null params={q=id:14&qt=standard&start=0&rows=20&version=2.2} hits=1 status=0 QTime=0
[junit4] 2> 1597495 INFO (TEST-AutoCommitTest.testMaxDocs-seed#[C2C2811B21090BC]) [ x:collection1] o.a.s.c.S.Request [collection1] webapp=null path=null params={q=id:15&qt=standard&start=0&rows=20&version=2.2} hits=0 status=0 QTime=0
[junit4] 2> 1597495 INFO (TEST-AutoCommitTest.testMaxDocs-seed#[C2C2811B21090BC]) [ x:collection1] o.a.s.SolrTestCaseJ4 ###Ending testMaxDocs
[junit4] 2> 1597501 INFO (TEST-AutoCommitTest.testCommitWithin-seed#[C2C2811B21090BC]) [ x:collection1] o.a.s.SolrTestCaseJ4 ###Starting testCommitWithin
[junit4] 2> 1597507 INFO (TEST-AutoCommitTest.testCommitWithin-seed#[C2C2811B21090BC]) [ x:collection1] o.a.s.s.SolrIndexSearcher Opening [Searcher@22528e60[collection1] realtime]
[junit4] 2> 1597508 INFO (TEST-AutoCommitTest.testCommitWithin-seed#[C2C2811B21090BC]) [ x:collection1] o.a.s.u.p.LogUpdateProcessorFactory [collection1] webapp=null path=null params={}{deleteByQuery=*:* (-1547452060994109440)} 0 6
[junit4] 2> 1597509 INFO (TEST-AutoCommitTest.testCommitWithin-seed#[C2C2811B21090BC]) [ x:collection1] o.a.s.c.SolrResourceLoader [null] Added 2 libs to classloader, from paths: [/export/home/jenkins/workspace/Lucene-Solr-6.x-Solaris/solr/core/src/test-files/solr/collection1/lib, /export/home/jenkins/workspace/Lucene-Solr-6.x-Solaris/solr/core/src/test-files/solr/collection1/lib/classes]
[junit4] 2> 1597557 WARN (TEST-AutoCommitTest.testCommitWithin-seed#[C2C2811B21090BC]) [ x:collection1] o.a.s.c.Config Beginning with Solr 5.5, <mergePolicy> is deprecated, use <mergePolicyFactory> instead.
[junit4] 2> 1597560 INFO (TEST-AutoCommitTest.testCommitWithin-seed#[C2C2811B21090BC]) [ x:collection1] o.a.s.c.SolrConfig Using Lucene MatchVersion: 6.3.0
[junit4] 2> 1597602 INFO (TEST-AutoCommitTest.testCommitWithin-seed#[C2C2811B21090BC]) [ x:collection1] o.a.s.s.IndexSchema [collection1] Schema name=test
[junit4] 2> 1597748 WARN (TEST-AutoCommitTest.testCommitWithin-seed#[C2C2811B21090BC]) [ x:collection1] o.a.s.s.IndexSchema [collection1] default search field in schema is text. WARNING: Deprecated, please use 'df' on request instead.
[junit4] 2> 1597751 INFO (TEST-AutoCommitTest.testCommitWithin-seed#[C2C2811B21090BC]) [ x:collection1] o.a.s.s.IndexSchema Loaded schema test/1.0 with uniqueid field id
[junit4] 2> 1597760 INFO (TEST-AutoCommitTest.testCommitWithin-seed#[C2C2811B21090BC]) [ x:collection1] o.a.s.c.CoreContainer Reloading SolrCore 'collection1' using configuration from instancedir /export/home/jenkins/workspace/Lucene-Solr-6.x-Solaris/solr/core/src/test-files/solr/collection1
[junit4] 2> 1597760 INFO (TEST-AutoCommitTest.testCommitWithin-seed#[C2C2811B21090BC]) [ x:collection1] o.a.s.c.SolrCore [[collection1] ] Opening new SolrCore at [/export/home/jenkins/workspace/Lucene-Solr-6.x-Solaris/solr/core/src/test-files/solr/collection1], dataDir=[/export/home/jenkins/workspace/Lucene-Solr-6.x-Solaris/solr/build/solr-core/test/J1/temp/solr.update.AutoCommitTest_C2C2811B21090BC-001/init-core-data-001/]
[junit4] 2> 1597760 INFO (TEST-AutoCommitTest.testCommitWithin-seed#[C2C2811B21090BC]) [ x:collection1] o.a.s.c.JmxMonitoredMap JMX monitoring is enabled. Adding Solr mbeans to JMX Server: com.sun.jmx.mbeanserver.JmxMBeanServer@57c75c38
[junit4] 2> 1597800 INFO (TEST-AutoCommitTest.testCommitWithin-seed#[C2C2811B21090BC]) [ x:collection1] o.a.s.u.CommitTracker Hard AutoCommit: disabled
[junit4] 2> 1597801 INFO (TEST-AutoCommitTest.testCommitWithin-seed#[C2C2811B21090BC]) [ x:collection1] o.a.s.u.CommitTracker Soft AutoCommit: disabled
[junit4] 2> 1597802 INFO (TEST-AutoCommitTest.testCommitWithin-seed#[C2C2811B21090BC]) [ x:collection1] o.a.s.s.SolrIndexSearcher Opening [Searcher@14dfb2d8[collection1] main]
[junit4] 2> 1597802 INFO (TEST-AutoCommitTest.testCommitWithin-seed#[C2C2811B21090BC]) [ x:collection1] o.a.s.h.c.SpellCheckComponent Initializing spell checkers
[junit4] 2> 1597803 INFO (TEST-AutoCommitTest.testCommitWithin-seed#[C2C2811B21090BC]) [ x:collection1] o.a.s.s.DirectSolrSpellChecker init: {name=direct,classname=DirectSolrSpellChecker,field=lowerfilt,minQueryLength=3}
[junit4] 2> 1597811 INFO (TEST-AutoCommitTest.testCommitWithin-seed#[C2C2811B21090BC]) [ x:collection1] o.a.s.h.ReplicationHandler Commits will be reserved for 10000
[junit4] 2> 1597812 INFO (searcherExecutor-5864-thread-1-processing-x:collection1) [ x:collection1] o.a.s.h.c.SpellCheckComponent Loading spell index for spellchecker: default
[junit4] 2> 1597813 INFO (searcherExecutor-5864-thread-1-processing-x:collection1) [ x:collection1] o.a.s.h.c.SpellCheckComponent Loading spell index for spellchecker: direct
[junit4] 2> 1597813 INFO (searcherExecutor-5864-thread-1-processing-x:collection1) [ x:collection1] o.a.s.h.c.SpellCheckComponent Loading spell index for spellchecker: wordbreak
[junit4] 2> 1597813 INFO (searcherExecutor-5864-thread-1-processing-x:collection1) [ x:collection1] o.a.s.h.c.SpellCheckComponent Loading spell index for spellchecker: multipleFields
[junit4] 2> 1597813 INFO (searcherExecutor-5864-thread-1-processing-x:collection1) [ x:collection1] o.a.s.h.c.SpellCheckComponent Loading spell index for spellchecker: jarowinkler
[junit4] 2> 1597814 INFO (searcherExecutor-5864-thread-1-processing-x:collection1) [ x:collection1] o.a.s.h.c.SpellCheckComponent Loading spell index for spellchecker: external
[junit4] 2> 1597814 INFO (searcherExecutor-5864-thread-1-processing-x:collection1) [ x:collection1] o.a.s.h.c.SpellCheckComponent Loading spell index for spellchecker: freq
[junit4] 2> 1597815 INFO (searcherExecutor-5864-thread-1-processing-x:collection1) [ x:collection1] o.a.s.h.c.SpellCheckComponent Loading spell index for spellchecker: fqcn
[junit4] 2> 1597815 INFO (searcherExecutor-5864-thread-1-processing-x:collection1) [ x:collection1] o.a.s.h.c.SpellCheckComponent Loading spell index for spellchecker: perDict
[junit4] 2> 1597817 INFO (searcherExecutor-5864-thread-1-processing-x:collection1) [ x:collection1] o.a.s.c.SolrCore [collection1] Registered new searcher Searcher@14dfb2d8[collection1] main{ExitableDirectoryReader(UninvertingDirectoryReader())}
[junit4] 2> 1597818 INFO (TEST-AutoCommitTest.testCommitWithin-seed#[C2C2811B21090BC]) [ x:collection1] o.a.s.u.RandomMergePolicy RandomMergePolicy wrapping class org.apache.lucene.index.LogByteSizeMergePolicy: [LogByteSizeMergePolicy: minMergeSize=1677721, mergeFactor=22, maxMergeSize=2147483648, maxMergeSizeForForcedMerge=9223372036854775807, calibrateSizeByDeletes=true, maxMergeDocs=2147483647, maxCFSSegmentSizeMB=8.796093022207999E12, noCFSRatio=0.4541869239802362]
[junit4] 2> 1597818 INFO (TEST-AutoCommitTest.testCommitWithin-seed#[C2C2811B21090BC]) [ x:collection1] o.a.s.u.DefaultSolrCoreState New IndexWriter is ready to be used.
[junit4] 2> 1597819 INFO (TEST-AutoCommitTest.testCommitWithin-seed#[C2C2811B21090BC]) [ x:collection1] o.a.s.s.SolrIndexSearcher Opening [Searcher@756ae577[collection1] main]
[junit4] 2> 1597819 INFO (TEST-AutoCommitTest.testCommitWithin-seed#[C2C2811B21090BC]) [ x:collection1] o.a.s.c.SolrCore [collection1] CLOSING SolrCore org.apache.solr.core.SolrCore@3bbddcbe
[junit4] 2> 1597832 INFO (TEST-AutoCommitTest.testCommitWithin-seed#[C2C2811B21090BC]) [ x:collection1] o.a.s.u.p.LogUpdateProcessorFactory [collection1] {add=[529 (1547452061340139520)]} 0 1
[junit4] 2> 1597832 INFO (TEST-AutoCommitTest.testCommitWithin-seed#[C2C2811B21090BC]) [ x:collection1] o.a.s.c.S.Request [collection1] webapp=null path=null params={q=id:529&qt=standard&start=0&rows=20&version=2.2} hits=0 status=0 QTime=0
[junit4] 2> 1597834 INFO (searcherExecutor-5864-thread-1-processing-x:collection1) [ x:collection1] o.a.s.c.SolrCore [collection1] Registered new searcher Searcher@756ae577[collection1] main{ExitableDirectoryReader(UninvertingDirectoryReader())}
[junit4] 2> 1597835 INFO (TEST-AutoCommitTest.testCommitWithin-seed#[C2C2811B21090BC]) [ x:collection1] o.a.s.u.p.LogUpdateProcessorFactory [collection1] {add=[530 (1547452061343285248)]} 0 4
[junit4] 2> 1597835 INFO (TEST-AutoCommitTest.testCommitWithin-seed#[C2C2811B21090BC]) [ x:collection1] o.a.s.c.S.Request [collection1] webapp=null path=null params={q=id:530&qt=standard&start=0&rows=20&version=2.2} hits=0 status=0 QTime=0
[junit4] 2> 1597835 INFO (TEST-AutoCommitTest.testCommitWithin-seed#[C2C2811B21090BC]) [ x:collection1] o.a.s.u.p.LogUpdateProcessorFactory [collection1] {delete=[529 (-1547452061344333824)]} 0 4
[junit4] 2> 1597836 INFO (TEST-AutoCommitTest.testCommitWithin-seed#[C2C2811B21090BC]) [ x:collection1] o.a.s.c.S.Request [collection1] webapp=null path=null params={q=id:529&qt=standard&start=0&rows=20&version=2.2} hits=0 status=0 QTime=0
[junit4] 2> 1597836 ERROR (TEST-AutoCommitTest.testCommitWithin-seed#[C2C2811B21090BC]) [ x:collection1] o.a.s.SolrTestCaseJ4 REQUEST FAILED: xpath=//result[@numFound=1]
[junit4] 2> xml response was: <?xml version="1.0" encoding="UTF-8"?>
[junit4] 2> <response>
[junit4] 2> <lst name="responseHeader"><int name="status">0</int><int name="QTime">0</int></lst><result name="response" numFound="0" start="0"></result>
[junit4] 2> </response>
[junit4] 2>
[junit4] 2> request was:q=id:529&qt=standard&start=0&rows=20&version=2.2
[junit4] 2> 1597837 ERROR (TEST-AutoCommitTest.testCommitWithin-seed#[C2C2811B21090BC]) [ x:collection1] o.a.s.SolrTestCaseJ4 REQUEST FAILED: q=id:529&qt=standard&start=0&rows=20&version=2.2:java.lang.RuntimeException: REQUEST FAILED: xpath=//result[@numFound=1]
[junit4] 2> xml response was: <?xml version="1.0" encoding="UTF-8"?>
[junit4] 2> <response>
[junit4] 2> <lst name="responseHeader"><int name="status">0</int><int name="QTime">0</int></lst><result name="response" numFound="0" start="0"></result>
[junit4] 2> </response>
[junit4] 2>
[junit4] 2> request was:q=id:529&qt=standard&start=0&rows=20&version=2.2
[junit4] 2> at org.apache.solr.SolrTestCaseJ4.assertQ(SolrTestCaseJ4.java:806)
[junit4] 2> at org.apache.solr.update.AutoCommitTest.testCommitWithin(AutoCommitTest.java:353)
[junit4] 2> at sun.reflect.NativeMethodAccessorImpl.invoke0(Native Method)
[junit4] 2> at sun.reflect.NativeMethodAccessorImpl.invoke(NativeMethodAccessorImpl.java:62)
[junit4] 2> at sun.reflect.DelegatingMethodAccessorImpl.invoke(DelegatingMethodAccessorImpl.java:43)
[junit4] 2> at java.lang.reflect.Method.invoke(Method.java:498)
[junit4] 2> at com.carrotsearch.randomizedtesting.RandomizedRunner.invoke(RandomizedRunner.java:1764)
[junit4] 2> at com.carrotsearch.randomizedtesting.RandomizedRunner$8.evaluate(RandomizedRunner.java:871)
[junit4] 2> at com.carrotsearch.randomizedtesting.RandomizedRunner$9.evaluate(RandomizedRunner.java:907)
[junit4] 2> at com.carrotsearch.randomizedtesting.RandomizedRunner$10.evaluate(RandomizedRunner.java:921)
[junit4] 2> at com.carrotsearch.randomizedtesting.rules.SystemPropertiesRestoreRule$1.evaluate(SystemPropertiesRestoreRule.java:57)
[junit4] 2> at org.apache.lucene.util.TestRuleSetupTeardownChained$1.evaluate(TestRuleSetupTeardownChained.java:49)
[junit4] 2> at org.apache.lucene.util.AbstractBeforeAfterRule$1.evaluate(AbstractBeforeAfterRule.java:45)
[junit4] 2> at org.apache.lucene.util.TestRuleThreadAndTestName$1.evaluate(TestRuleThreadAndTestName.java:48)
[junit4] 2> at org.apache.lucene.util.TestRuleIgnoreAfterMaxFailures$1.evaluate(TestRuleIgnoreAfterMaxFailures.java:64)
[junit4] 2> at org.apache.lucene.util.TestRuleMarkFailure$1.evaluate(TestRuleMarkFailure.java:47)
[junit4] 2> at com.carrotsearch.randomizedtesting.rules.StatementAdapter.evaluate(StatementAdapter.java:36)
[junit4] 2> at com.carrotsearch.randomizedtesting.ThreadLeakControl$StatementRunner.run(ThreadLeakControl.java:367)
[junit4] 2> at com.carrotsearch.randomizedtesting.ThreadLeakControl.forkTimeoutingTask(ThreadLeakControl.java:809)
[junit4] 2> at com.carrotsearch.randomizedtesting.ThreadLeakControl$3.evaluate(ThreadLeakControl.java:460)
[junit4] 2> at com.carrotsearch.randomizedtesting.RandomizedRunner.runSingleTest(RandomizedRunner.java:880)
[junit4] 2> at com.carrotsearch.randomizedtesting.RandomizedRunner$5.evaluate(RandomizedRunner.java:781)
[junit4] 2> at com.carrotsearch.randomizedtesting.RandomizedRunner$6.evaluate(RandomizedRunner.java:816)
[junit4] 2> at com.carrotsearch.randomizedtesting.RandomizedRunner$7.evaluate(RandomizedRunner.java:827)
[junit4] 2> at com.carrotsearch.randomizedtesting.rules.StatementAdapter.evaluate(StatementAdapter.java:36)
[junit4] 2> at com.carrotsearch.randomizedtesting.rules.SystemPropertiesRestoreRule$1.evaluate(SystemPropertiesRestoreRule.java:57)
[junit4] 2> at org.apache.lucene.util.AbstractBeforeAfterRule$1.evaluate(AbstractBeforeAfterRule.java:45)
[junit4] 2> at com.carrotsearch.randomizedtesting.rules.StatementAdapter.evaluate(StatementAdapter.java:36)
[junit4] 2> at org.apache.lucene.util.TestRuleStoreClassName$1.evaluate(TestRuleStoreClassName.java:41)
[junit4] 2> at com.carrotsearch.randomizedtesting.rules.NoShadowingOrOverridesOnMethodsRule$1.evaluate(NoShadowingOrOverridesOnMethodsRule.java:40)
[junit4] 2> at com.carrotsearch.randomizedtesting.rules.NoShadowingOrOverridesOnMethodsRule$1.evaluate(NoShadowingOrOverridesOnMethodsRule.java:40)
[junit4] 2> at com.carrotsearch.randomizedtesting.rules.StatementAdapter.evaluate(StatementAdapter.java:36)
[junit4] 2> at com.carrotsearch.randomizedtesting.rules.StatementAdapter.evaluate(StatementAdapter.java:36)
[junit4] 2> at com.carrotsearch.randomizedtesting.rules.StatementAdapter.evaluate(StatementAdapter.java:36)
[junit4] 2> at org.apache.lucene.util.TestRuleAssertionsRequired$1.evaluate(TestRuleAssertionsRequired.java:53)
[junit4] 2> at org.apache.lucene.util.TestRuleMarkFailure$1.evaluate(TestRuleMarkFailure.java:47)
[junit4] 2> at org.apache.lucene.util.TestRuleIgnoreAfterMaxFailures$1.evaluate(TestRuleIgnoreAfterMaxFailures.java:64)
[junit4] 2> at org.apache.lucene.util.TestRuleIgnoreTestSuites$1.evaluate(TestRuleIgnoreTestSuites.java:54)
[junit4] 2> at com.carrotsearch.randomizedtesting.rules.StatementAdapter.evaluate(StatementAdapter.java:36)
[junit4] 2> at com.carrotsearch.randomizedtesting.ThreadLeakControl$StatementRunner.run(ThreadLeakControl.java:367)
[junit4] 2> at java.lang.Thread.run(Thread.java:745)
[junit4] 2>
[junit4] 2> 1597837 INFO (TEST-AutoCommitTest.testCommitWithin-seed#[C2C2811B21090BC]) [ x:collection1] o.a.s.SolrTestCaseJ4 ###Ending testCommitWithin
[junit4] 2> NOTE: reproduce with: ant test -Dtestcase=AutoCommitTest -Dtests.method=testCommitWithin -Dtests.seed=C2C2811B21090BC -Dtests.slow=true -Dtests.locale=sk-SK -Dtests.timezone=Chile/EasterIsland -Dtests.asserts=true -Dtests.file.encoding=ISO-8859-1
[junit4] ERROR 0.35s J1 | AutoCommitTest.testCommitWithin <<<
[junit4] > Throwable #1: java.lang.RuntimeException: Exception during query
[junit4] > at __randomizedtesting.SeedInfo.seed([C2C2811B21090BC:B6FE4769313E7EA9]:0)
[junit4] > at org.apache.solr.SolrTestCaseJ4.assertQ(SolrTestCaseJ4.java:813)
[junit4] > at org.apache.solr.update.AutoCommitTest.testCommitWithin(AutoCommitTest.java:353)
[junit4] > at java.lang.Thread.run(Thread.java:745)
[junit4] > Caused by: java.lang.RuntimeException: REQUEST FAILED: xpath=//result[@numFound=1]
[junit4] > xml response was: <?xml version="1.0" encoding="UTF-8"?>
[junit4] > <response>
[junit4] > <lst name="responseHeader"><int name="status">0</int><int name="QTime">0</int></lst><result name="response" numFound="0" start="0"></result>
[junit4] > </response>
[junit4] > request was:q=id:529&qt=standard&start=0&rows=20&version=2.2
[junit4] > at org.apache.solr.SolrTestCaseJ4.assertQ(SolrTestCaseJ4.java:806)
[junit4] > ... 40 more
[junit4] 2> 1597847 INFO (TEST-AutoCommitTest.testMaxTime-seed#[C2C2811B21090BC]) [ x:collection1] o.a.s.SolrTestCaseJ4 ###Starting testMaxTime
[junit4] 2> 1597850 INFO (TEST-AutoCommitTest.testMaxTime-seed#[C2C2811B21090BC]) [ x:collection1] o.a.s.s.SolrIndexSearcher Opening [Searcher@40a76c86[collection1] realtime]
[junit4] 2> 1597850 INFO (TEST-AutoCommitTest.testMaxTime-seed#[C2C2811B21090BC]) [ x:collection1] o.a.s.u.p.LogUpdateProcessorFactory [collection1] webapp=null path=null params={}{deleteByQuery=*:* (-1547452061356916736)} 0 3
[junit4] 2> 1597851 INFO (TEST-AutoCommitTest.testMaxTime-seed#[C2C2811B21090BC]) [ x:collection1] o.a.s.c.SolrResourceLoader [null] Added 2 libs to classloader, from paths: [/export/home/jenkins/workspace/Lucene-Solr-6.x-Solaris/solr/core/src/test-files/solr/collection1/lib, /export/home/jenkins/workspace/Lucene-Solr-6.x-Solaris/solr/core/src/test-files/solr/collection1/lib/classes]
[junit4] 2> 1597899 WARN (TEST-AutoCommitTest.testMaxTime-seed#[C2C2811B21090BC]) [ x:collection1] o.a.s.c.Config Beginning with Solr 5.5, <mergePolicy> is deprecated, use <mergePolicyFactory> instead.
[junit4] 2> 1597901 INFO (TEST-AutoCommitTest.testMaxTime-seed#[C2C2811B21090BC]) [ x:collection1] o.a.s.c.SolrConfig Using Lucene MatchVersion: 6.3.0
[junit4] 2> 1597928 INFO (TEST-AutoCommitTest.testMaxTime-seed#[C2C2811B21090BC]) [ x:collection1] o.a.s.s.IndexSchema [collection1] Schema name=test
[junit4] 2> 1598118 WARN (TEST-AutoCommitTest.testMaxTime-seed#[C2C2811B21090BC]) [ x:collection1] o.a.s.s.IndexSchema [collection1] default search field in schema is text. WARNING: Deprecated, please use 'df' on request instead.
[junit4] 2> 1598121 INFO (TEST-AutoCommitTest.testMaxTime-seed#[C2C2811B21090BC]) [ x:collection1] o.a.s.s.IndexSchema Loaded schema test/1.0 with uniqueid field id
[junit4] 2> 1598156 INFO (TEST-AutoCommitTest.testMaxTime-seed#[C2C2811B21090BC]) [ x:collection1] o.a.s.c.CoreContainer Reloading SolrCore 'collection1' using configuration from instancedir /export/home/jenkins/workspace/Lucene-Solr-6.x-Solaris/solr/core/src/test-files/solr/collection1
[junit4] 2> 1598156 INFO (TEST-AutoCommitTest.testMaxTime-seed#[C2C2811B21090BC]) [ x:collection1] o.a.s.c.SolrCore [[collection1] ] Opening new SolrCore at [/export/home/jenkins/workspace/Lucene-Solr-6.x-Solaris/solr/core/src/test-files/solr/collection1], dataDir=[/export/home/jenkins/workspace/Lucene-Solr-6.x-Solaris/solr/build/solr-core/test/J1/temp/solr.update.AutoCommitTest_C2C2811B21090BC-001/init-core-data-001/]
[junit4] 2> 1598156 INFO (TEST-AutoCommitTest.testMaxTime-seed#[C2C2811B21090BC]) [ x:collection1] o.a.s.c.JmxMonitoredMap JMX monitoring is enabled. Adding Solr mbeans to JMX Server: com.sun.jmx.mbeanserver.JmxMBeanServer@57c75c38
[junit4] 2> 1598186 INFO (TEST-AutoCommitTest.testMaxTime-seed#[C2C2811B21090BC]) [ x:collection1] o.a.s.u.CommitTracker Hard AutoCommit: disabled
[junit4] 2> 1598186 INFO (TEST-AutoCommitTest.testMaxTime-seed#[C2C2811B21090BC]) [ x:collection1] o.a.s.u.CommitTracker Soft AutoCommit: disabled
[junit4] 2> 1598186 INFO (TEST-AutoCommitTest.testMaxTime-seed#[C2C2811B21090BC]) [ x:collection1] o.a.s.s.SolrIndexSearcher Opening [Searcher@1de5619b[collection1] main]
[junit4] 2> 1598187 INFO (TEST-AutoCommitTest.testMaxTime-seed#[C2C2811B21090BC]) [ x:collection1] o.a.s.h.c.SpellCheckComponent Initializing spell checkers
[junit4] 2> 1598188 INFO (TEST-AutoCommitTest.testMaxTime-seed#[C2C2811B21090BC]) [ x:collection1] o.a.s.s.DirectSolrSpellChecker init: {name=direct,classname=DirectSolrSpellChecker,field=lowerfilt,minQueryLength=3}
[junit4] 2> 1598194 INFO (TEST-AutoCommitTest.testMaxTime-seed#[C2C2811B21090BC]) [ x:collection1] o.a.s.h.ReplicationHandler Commits will be reserved for 10000
[junit4] 2> 1598196 INFO (searcherExecutor-5868-thread-1-processing-x:collection1) [ x:collection1] o.a.s.h.c.SpellCheckComponent Loading spell index for spellchecker: default
[junit4] 2> 1598197 INFO (searcherExecutor-5868-thread-1-processing-x:collection1) [ x:collection1] o.a.s.h.c.SpellCheckComponent Loading spell index for spellchecker: direct
[junit4] 2> 1598197 INFO (searcherExecutor-5868-thread-1-processing-x:collection1) [ x:collection1] o.a.s.h.c.SpellCheckComponent Loading spell index for spellchecker: wordbreak
[junit4] 2> 1598197 INFO (searcherExecutor-5868-thread-1-processing-x:collection1) [ x:collection1] o.a.s.h.c.SpellCheckComponent Loading spell index for spellchecker: multipleFields
[junit4] 2> 1598199 INFO (TEST-AutoCommitTest.testMaxTime-seed#[C2C2811B21090BC]) [ x:collection1] o.a.s.u.RandomMergePolicy RandomMergePolicy wrapping class org.apache.lucene.index.TieredMergePolicy: [TieredMergePolicy: maxMergeAtOnce=35, maxMergeAtOnceExplicit=37, maxMergedSegmentMB=13.693359375, floorSegmentMB=0.662109375, forceMergeDeletesPctAllowed=22.15092180037206, segmentsPerTier=15.0, maxCFSSegmentSizeMB=8.796093022207999E12, noCFSRatio=0.1380002999351751
[junit4] 2> 1598199 INFO (TEST-AutoCommitTest.testMaxTime-seed#[C2C2811B21090BC]) [ x:collection1] o.a.s.u.DefaultSolrCoreState New IndexWriter is ready to be used.
[junit4] 2> 1598199 WARN (TEST-AutoCommitTest.testMaxTime-seed#[C2C2811B21090BC]) [ x:collection1] o.a.s.c.SolrCore [collection1] PERFORMANCE WARNING: Overlapping onDeckSearchers=2
[junit4] 2> 1598199 INFO (TEST-AutoCommitTest.testMaxTime-seed#[C2C2811B21090BC]) [ x:collection1] o.a.s.s.SolrIndexSearcher Opening [Searcher@734025fd[collection1] main]
[junit4] 2> 1598200 INFO (TEST-AutoCommitTest.testMaxTime-seed#[C2C2811B21090BC]) [ x:collection1] o.a.s.c.SolrCore [collection1] CLOSING SolrCore org.apache.solr.core.SolrCore@38ec66ef
[junit4] 2> 1598202 INFO (searcherExecutor-5868-thread-1-processing-x:collection1) [ x:collection1] o.a.s.h.c.SpellCheckComponent Loading spell index for spellchecker: jarowinkler
[junit4] 2> 1598202 INFO (searcherExecutor-5868-thread-1-processing-x:collection1) [ x:collection1] o.a.s.h.c.SpellCheckComponent Loading spell index for spellchecker: external
[junit4] 2> 1598203 INFO (searcherExecutor-5868-thread-1-processing-x:collection1) [ x:collection1] o.a.s.h.c.SpellCheckComponent Loading spell index for spellchecker: freq
[junit4] 2> 1598204 INFO (searcherExecutor-5868-thread-1-processing-x:collection1) [ x:collection1] o.a.s.h.c.SpellCheckComponent Loading spell index for spellchecker: fqcn
[junit4] 2> 1598205 INFO (searcherExecutor-5868-thread-1-processing-x:collection1) [ x:collection1] o.a.s.h.c.SpellCheckComponent Loading spell index for spellchecker: perDict
[junit4] 2> 1598206 INFO (searcherExecutor-5868-thread-1-processing-x:collection1) [ x:collection1] o.a.s.c.SolrCore [collection1] Registered new searcher Searcher@1de5619b[collection1] main{ExitableDirectoryReader(UninvertingDirectoryReader())}
[junit4] 2> 1598206 INFO (searcherExecutor-5868-thread-1-processing-x:collection1) [ x:collection1] o.a.s.h.c.SpellCheckComponent Loading spell index for spellchecker: default
[junit4] 2> 1598207 INFO (searcherExecutor-5868-thread-1-processing-x:collection1) [ x:collection1] o.a.s.h.c.SpellCheckComponent Loading spell index for spellchecker: direct
[junit4] 2> 1598207 INFO (searcherExecutor-5868-thread-1-processing-x:collection1) [ x:collection1] o.a.s.h.c.SpellCheckComponent Loading spell index for spellchecker: wordbreak
[junit4] 2> 1598207 INFO (searcherExecutor-5868-thread-1-processing-x:collection1) [ x:collection1] o.a.s.h.c.SpellCheckComponent Loading spell index for spellchecker: multipleFields
[junit4] 2> 1598208 INFO (searcherExecutor-5868-thread-1-processing-x:collection1) [ x:collection1] o.a.s.h.c.SpellCheckComponent Loading spell index for spellchecker: jarowinkler
[junit4] 2> 1598208 INFO (searcherExecutor-5868-thread-1-processing-x:collection1) [ x:collection1] o.a.s.h.c.SpellCheckComponent Loading spell index for spellchecker: external
[junit4] 2> 1598209 INFO (searcherExecutor-5868-thread-1-processing-x:collection1) [ x:collection1] o.a.s.h.c.SpellCheckComponent Loading spell index for spellchecker: freq
[junit4] 2> 1598209 INFO (searcherExecutor-5868-thread-1-processing-x:collection1) [ x:collection1] o.a.s.h.c.SpellCheckComponent Loading spell index for spellchecker: fqcn
[junit4] 2> 1598210 INFO (searcherExecutor-5868-thread-1-processing-x:collection1) [ x:collection1] o.a.s.h.c.SpellCheckComponent Loading spell index for spellchecker: perDict
[junit4] 2> 1598213 INFO (searcherExecutor-5868-thread-1-processing-x:collection1) [ x:collection1] o.a.s.c.SolrCore [collection1] Registered new searcher Searcher@734025fd[collection1] main{ExitableDirectoryReader(UninvertingDirectoryReader())}
[junit4] 2> 1598250 INFO (TEST-AutoCommitTest.testMaxTime-seed#[C2C2811B21090BC]) [ x:collection1] o.a.s.u.p.LogUpdateProcessorFactory [collection1] {add=[529 (1547452061778444288)]} 0 4
[junit4] 2> 1598252 INFO (TEST-AutoCommitTest.testMaxTime-seed#[C2C2811B21090BC]) [ x:collection1] o.a.s.c.S.Request [collection1] webapp=null path=null params={q=id:529&qt=standard&start=0&rows=20&version=2.2} hits=0 status=0 QTime=2
[junit4] 2> 1599251 INFO (commitScheduler-5871-thread-1) [ x:collection1] o.a.s.u.DirectUpdateHandler2 start commit{,optimize=false,openSearcher=true,waitSearcher=true,expungeDeletes=false,softCommit=true,prepareCommit=false}
[junit4] 2> 1599253 INFO (commitScheduler-5871-thread-1) [ x:collection1] o.a.s.s.SolrIndexSearcher Opening [Searcher@39f4b02e[collection1] main]
[junit4] 2> 1599254 INFO (commitScheduler-5871-thread-1) [ x:collection1] o.a.s.u.DirectUpdateHandler2 end_commit_flush
[junit4] 2> 1599255 INFO (searcherExecutor-5868-thread-1-processing-x:collection1) [ x:collection1] o.a.s.c.SolrCore [collection1] Registered new searcher Searcher@39f4b02e[collection1] main{ExitableDirectoryReader(UninvertingDirectoryReader(Uninverting(_3(6.3.0):c1)))}
[junit4] 2> 1599258 INFO (TEST-AutoCommitTest.testMaxTime-seed#[C2C2811B21090BC]) [ x:collection1] o.a.s.u.p.LogUpdateProcessorFactory [collection1] {add=[530 (1547452062835408896)]} 0 1013
[junit4] 2> 1599258 INFO (TEST-AutoCommitTest.testMaxTime-seed#[C2C2811B21090BC]) [ x:collection1] o.a.s.c.S.Request [collection1] webapp=null path=null params={q=id:529&qt=standard&start=0&rows=20&version=2.2} hits=1 status=0 QTime=0
[junit4] 2> 1599259 INFO (TEST-AutoCommitTest.testMaxTime-seed#[C2C2811B21090BC]) [ x:collection1] o.a.s.c.S.Request [collection1] webapp=null path=null params={q=id:530&qt=standard&start=0&rows=20&version=2.2} hits=0 status=0 QTime=0
[junit4] 2> 1599259 INFO (TEST-AutoCommitTest.testMaxTime-seed#[C2C2811B21090BC]) [ x:collection1] o.a.s.u.p.LogUpdateProcessorFactory [collection1] webapp=null path=null params={}{delete=[529 (-1547452062837506048)]} 0 0
[junit4] 2> 1599260 INFO (TEST-AutoCommitTest.testMaxTime-seed#[C2C2811B21090BC]) [ x:collection1] o.a.s.c.S.Request [collection1] webapp=null path=null params={q=id:529&qt=standard&start=0&rows=20&version=2.2} hits=1 status=0 QTime=0
[junit4] 2> 1600259 INFO (commitScheduler-5871-thread-1) [ x:collection1] o.a.s.u.DirectUpdateHandler2 start commit{,optimize=false,openSearcher=true,waitSearcher=true,expungeDeletes=false,softCommit=true,prepareCommit=false}
[junit4] 2> 1600262 INFO (commitScheduler-5871-thread-1) [ x:collection1] o.a.s.s.SolrIndexSearcher Opening [Searcher@3f3057e1[collection1] main]
[junit4] 2> 1600262 INFO (commitScheduler-5871-thread-1) [ x:collection1] o.a.s.u.DirectUpdateHandler2 end_commit_flush
[junit4] 2> 1600264 INFO (searcherExecutor-5868-thread-1-processing-x:collection1) [ x:collection1] o.a.s.c.SolrCore [collection1] Registered new searcher Searcher@3f3057e1[collection1] main{ExitableDirectoryReader(UninvertingDirectoryReader(Uninverting(_4(6.3.0):c1)))}
[junit4] 2> 1600265 INFO (TEST-AutoCommitTest.testMaxTime-seed#[C2C2811B21090BC]) [ x:collection1] o.a.s.u.p.LogUpdateProcessorFactory [collection1] {add=[550 (1547452063891324928)]} 0 2020
[junit4] 2> 1600265 INFO (TEST-AutoCommitTest.testMaxTime-seed#[C2C2811B21090BC]) [ x:collection1] o.a.s.c.S.Request [collection1] webapp=null path=null params={q=id:529&qt=standard&start=0&rows=20&version=2.2} hits=0 status=0 QTime=0
[junit4] 2> 1600268 INFO (TEST-AutoCommitTest.testMaxTime-seed#[C2C2811B21090BC]) [ x:collection1] o.a.s.u.p.LogUpdateProcessorFactory [collection1] {add=[500 (1547452063893422080)]} 0 2023
[junit4] 2> 1600269 INFO (TEST-AutoCommitTest.testMaxTime-seed#[C2C2811B21090BC]) [ x:collection1] o.a.s.u.p.LogUpdateProcessorFactory [collection1] {add=[500 (1547452063895519232)]} 0 2023
[junit4] 2> 1600269 INFO (TEST-AutoCommitTest.testMaxTime-seed#[C2C2811B21090BC]) [ x:collection1] o.a.s.u.p.LogUpdateProcessorFactory [collection1] {add=[500 (1547452063896567808)]} 0 2024
[junit4] 2> 1600269 INFO (TEST-AutoCommitTest.testMaxTime-seed#[C2C2811B21090BC]) [ x:collection1] o.a.s.u.p.LogUpdateProcessorFactory [collection1] {add=[500 (1547452063896567809)]} 0 2024
[junit4] 2> 1600269 INFO (TEST-AutoCommitTest.testMaxTime-seed#[C2C2811B21090BC]) [ x:collection1] o.a.s.u.p.LogUpdateProcessorFactory [collection1] {add=[500 (1547452063896567810)]} 0 2024
[junit4] 2> 1600269 INFO (TEST-AutoCommitTest.testMaxTime-seed#[C2C2811B21090BC]) [ x:collection1] o.a.s.u.p.LogUpdateProcessorFactory [collection1] {add=[500 (1547452063896567811)]} 0 2024
[junit4] 2> 1600270 INFO (TEST-AutoCommitTest.testMaxTime-seed#[C2C2811B21090BC]) [ x:collection1] o.a.s.u.p.LogUpdateProcessorFactory [collection1] {add=[500 (1547452063896567812)]} 0 2025
[junit4] 2> 1600270 INFO (TEST-AutoCommitTest.testMaxTime-seed#[C2C2811B21090BC]) [ x:collection1] o.a.s.u.p.LogUpdateProcessorFactory [collection1] {add=[500 (1547452063897616384)]} 0 2025
[junit4] 2> 1600270 INFO (TEST-AutoCommitTest.testMaxTime-seed#[C2C2811B21090BC]) [ x:collection1] o.a.s.u.p.LogUpdateProcessorFactory [collection1] {add=[500 (1547452063897616385)]} 0 2025
[junit4] 2> 1600270 INFO (TEST-AutoCommitTest.testMaxTime-seed#[C2C2811B21090BC]) [ x:collection1] o.a.s.u.p.LogUpdateProcessorFactory [collection1] {add=[500 (1547452063897616386)]} 0 2025
[junit4] 2> 1600271 INFO (TEST-AutoCommitTest.testMaxTime-seed#[C2C2811B21090BC]) [ x:collection1] o.a.s.c.S.Request [collection1] webapp=null path=null params={q=id:500&qt=standard&start=0&rows=20&version=2.2} hits=0 status=0 QTime=0
[junit4] 2> 1601266 INFO (commitScheduler-5871-thread-1) [ x:collection1] o.a.s.u.DirectUpdateHandler2 start commit{,optimize=false,openSearcher=true,waitSearcher=true,expungeDeletes=false,softCommit=true,prepareCommit=false}
[junit4] 2> 1601268 INFO (commitScheduler-5871-thread-1) [ x:collection1] o.a.s.s.SolrIndexSearcher Opening [Searcher@2db643e5[collection1] main]
[junit4] 2> 1601269 INFO (commitScheduler-5871-thread-1) [ x:collection1] o.a.s.u.DirectUpdateHandler2 end_commit_flush
[junit4] 2> 1601270 INFO (searcherExecutor-5868-thread-1-processing-x:collection1) [ x:collection1] o.a.s.c.SolrCore [collection1] Registered new searcher Searcher@2db643e5[collection1] main{ExitableDirectoryReader(UninvertingDirectoryReader(Uninverting(_4(6.3.0):c1) Uninverting(_5(6.3.0):c11/9:delGen=1)))}
[junit4] 2> 1601273 INFO (TEST-AutoCommitTest.testMaxTime-seed#[C2C2811B21090BC]) [ x:collection1] o.a.s.u.p.LogUpdateProcessorFactory [collection1] {add=[531 (1547452064948289536)]} 0 3028
[junit4] 2> 1601274 INFO (TEST-AutoCommitTest.testMaxTime-seed#[C2C2811B21090BC]) [ x:collection1] o.a.s.c.S.Request [collection1] webapp=null path=null params={q=id:500&qt=standard&start=0&rows=20&version=2.2} hits=1 status=0 QTime=0
[junit4] 2> 1601274 INFO (TEST-AutoCommitTest.testMaxTime-seed#[C2C2811B21090BC]) [ x:collection1] o.a.s.SolrTestCaseJ4 ###Ending testMaxTime
[junit4] 2> 1601275 INFO (SUITE-AutoCommitTest-seed#[C2C2811B21090BC]-worker) [ x:collection1] o.a.s.SolrTestCaseJ4 ###deleteCore
[junit4] 2> 1601275 INFO (SUITE-AutoCommitTest-seed#[C2C2811B21090BC]-worker) [ x:collection1] o.a.s.c.CoreContainer Shutting down CoreContainer instance=1961179563
[junit4] 2> 1601276 INFO (coreCloseExecutor-5872-thread-1-processing-x:collection1) [ x:collection1] o.a.s.c.SolrCore [collection1] CLOSING SolrCore org.apache.solr.core.SolrCore@6795e461
[junit4] 2> 1601276 INFO (coreCloseExecutor-5872-thread-1-processing-x:collection1) [ x:collection1] o.a.s.u.DirectUpdateHandler2 Committing on IndexWriter close.
[junit4] 2> 1601276 INFO (coreCloseExecutor-5872-thread-1-processing-x:collection1) [ x:collection1] o.a.s.u.SolrIndexWriter Calling setCommitData with IW:org.apache.solr.update.SolrIndexWriter@2f1f4b23
[junit4] 2> NOTE: leaving temporary files on disk at: /export/home/jenkins/workspace/Lucene-Solr-6.x-Solaris/solr/build/solr-core/test/J1/temp/solr.update.AutoCommitTest_C2C2811B21090BC-001
[junit4] 2> NOTE: test params are: codec=CheapBastard, sim=ClassicSimilarity, locale=sk-SK, timezone=Chile/EasterIsland
[junit4] 2> NOTE: SunOS 5.11 amd64/Oracle Corporation 1.8.0_102 (64-bit)/cpus=3,threads=1,free=305158808,total=536870912
[junit4] 2> NOTE: All tests run in this JVM: [TestSolrQueryParserDefaultOperatorResource, ZkStateReaderTest, TestMinMaxOnMultiValuedField, TestConfigSetProperties, BlockJoinFacetSimpleTest, TestReloadDeadlock, SolrIndexConfigTest, LoggingHandlerTest, CSVRequestHandlerTest, DistributedQueryComponentCustomSortTest, TestHdfsUpdateLog, TestSimpleQParserPlugin, HighlighterMaxOffsetTest, SortByFunctionTest, TestReload, TestSchemaVersionResource, TestUtils, PeerSyncReplicationTest, TestMiniSolrCloudCluster, BadIndexSchemaTest, TestFoldingMultitermQuery, OverriddenZkACLAndCredentialsProvidersTest, TestSystemIdResolver, TestWriterPerf, TestReRankQParserPlugin, ShowFileRequestHandlerTest, TestPerFieldSimilarityClassic, TestAuthenticationFramework, DistribCursorPagingTest, TestDocSet, JSONWriterTest, DistributedTermsComponentTest, TestSearchPerf, DeleteShardTest, IndexSchemaTest, HdfsBasicDistributedZk2Test, TestDynamicLoading, TestManagedResource, TestManagedSchemaAPI, DistributedIntervalFacetingTest, TestInfoStreamLogging, NoCacheHeaderTest, CoreAdminRequestStatusTest, TestRuleBasedAuthorizationPlugin, LeaderInitiatedRecoveryOnShardRestartTest, TestAuthorizationFramework, CoreAdminHandlerTest, TestLegacyFieldCache, TestUniqueKeyFieldResource, BasicAuthIntegrationTest, TestAtomicUpdateErrorCases, MergeStrategyTest, SolrInfoMBeanTest, HdfsRecoverLeaseTest, TestQueryUtils, SignatureUpdateProcessorFactoryTest, CdcrVersionReplicationTest, DateRangeFieldTest, QueryParsingTest, ReplicationFactorTest, TestConfig, TestValueSourceCache, BasicFunctionalityTest, TestReversedWildcardFilterFactory, TestConfigOverlay, CdcrBootstrapTest, HdfsUnloadDistributedZkTest, SearchHandlerTest, TestHighFrequencyDictionaryFactory, TestRandomFaceting, TestSolrQueryParser, CollectionTooManyReplicasTest, DirectUpdateHandlerOptimizeTest, DefaultValueUpdateProcessorTest, UpdateRequestProcessorFactoryTest, TestShardHandlerFactory, ResourceLoaderTest, SpellPossibilityIteratorTest, BlockDirectoryTest, AnalyticsQueryTest, TestQuerySenderListener, TestSolrConfigHandlerConcurrent, TestFieldSortValues, DateMathParserTest, DistributedFacetPivotLongTailTest, TestQuerySenderNoQuery, LukeRequestHandlerTest, TestDocBasedVersionConstraints, TestExclusionRuleCollectionAccess, HLLUtilTest, TestComplexPhraseQParserPlugin, TestTrieFacet, TestIndexingPerformance, SpatialHeatmapFacetsTest, EchoParamsTest, TestSchemaManager, TestCoreDiscovery, TestObjectReleaseTracker, TestPHPSerializedResponseWriter, TestRawResponseWriter, UpdateParamsTest, ScriptEngineTest, TestJsonRequest, RulesTest, TestFuzzyAnalyzedSuggestions, TriLevelCompositeIdRoutingTest, TestRequestForwarding, SuggesterWFSTTest, HighlighterConfigTest, TestOverriddenPrefixQueryForCustomFieldType, TestExactStatsCache, MBeansHandlerTest, RAMDirectoryFactoryTest, TestSizeLimitedDistributedMap, RemoteQueryErrorTest, ParsingFieldUpdateProcessorsTest, TestFiltering, TestLocalFSCloudBackupRestore, CdcrReplicationHandlerTest, TestJoin, SuggesterTSTTest, TestSolrQueryResponse, SegmentsInfoRequestHandlerTest, CoreSorterTest, TestLMJelinekMercerSimilarityFactory, BasicDistributedZk2Test, TestSortByMinMaxFunction, BitVectorTest, BigEndianAscendingWordDeserializerTest, CollectionsAPIDistributedZkTest, HdfsRestartWhileUpdatingTest, TestScoreJoinQPNoScore, TestDistribDocBasedVersion, SimpleCollectionCreateDeleteTest, CreateCollectionCleanupTest, TestFieldCacheVsDocValues, ShardRoutingCustomTest, TestAnalyzeInfixSuggestions, TestLMDirichletSimilarityFactory, TestTolerantUpdateProcessorRandomCloud, TestLeaderInitiatedRecoveryThread, SliceStateTest, OverseerModifyCollectionTest, TestRangeQuery, TestSolrCloudWithKerberosAlt, TestSSLRandomization, TestDistribIDF, TestStandardQParsers, TestReqParamsAPI, DistributedFacetPivotSmallTest, SyncSliceTest, RecoveryZkTest, ClusterStateUpdateTest, TestZkChroot, ZkCLITest, AutoCommitTest]
[junit4] Completed [333/637 (1!)] on J1 in 4.98s, 3 tests, 1 error <<< FAILURES!
[...truncated 61324 lines...]