You are viewing a plain text version of this content. The canonical link for it is here.
Posted to issues@flink.apache.org by "Leonard Xu (Jira)" <ji...@apache.org> on 2023/11/28 06:51:00 UTC

[jira] [Assigned] (FLINK-32269) CreateTableAsITCase.testCreateTableAsInStatementSet fails on AZP

     [ https://issues.apache.org/jira/browse/FLINK-32269?page=com.atlassian.jira.plugin.system.issuetabpanels:all-tabpanel ]

Leonard Xu reassigned FLINK-32269:
----------------------------------

    Assignee: Jiabao Sun

> CreateTableAsITCase.testCreateTableAsInStatementSet fails on AZP
> ----------------------------------------------------------------
>
>                 Key: FLINK-32269
>                 URL: https://issues.apache.org/jira/browse/FLINK-32269
>             Project: Flink
>          Issue Type: Bug
>          Components: Tests
>            Reporter: Sergey Nuyanzin
>            Assignee: Jiabao Sun
>            Priority: Major
>              Labels: auto-deprioritized-critical, test-stability
>
> https://dev.azure.com/apache-flink/apache-flink/_build/results?buildId=49532&view=logs&j=af184cdd-c6d8-5084-0b69-7e9c67b35f7a&t=0f3adb59-eefa-51c6-2858-3654d9e0749d&l=15797
> {noformat}
> Jun 01 03:40:51 03:40:51.881 [ERROR] Tests run: 4, Failures: 1, Errors: 0, Skipped: 0, Time elapsed: 104.874 s <<< FAILURE! - in org.apache.flink.table.sql.codegen.CreateTableAsITCase
> Jun 01 03:40:51 03:40:51.881 [ERROR] CreateTableAsITCase.testCreateTableAsInStatementSet  Time elapsed: 40.729 s  <<< FAILURE!
> Jun 01 03:40:51 org.opentest4j.AssertionFailedError: Did not get expected results before timeout, actual result: [{"before":null,"after":{"user_name":"Bob","order_cnt":1},"op":"c"}, {"before":null,"after":{"user_name":"Alice","order_cnt":1},"op":"c"}, {"before":{"user_name":"Bob","order_cnt":1},"after":null,"op":"d"}, {"before":null,"after":{"user_name":"Bob","order_cnt":2},"op":"c"}]. ==> expected: <true> but was: <false>
> Jun 01 03:40:51 	at org.junit.jupiter.api.AssertionFailureBuilder.build(AssertionFailureBuilder.java:151)
> Jun 01 03:40:51 	at org.junit.jupiter.api.AssertionFailureBuilder.buildAndThrow(AssertionFailureBuilder.java:132)
> Jun 01 03:40:51 	at org.junit.jupiter.api.AssertTrue.failNotTrue(AssertTrue.java:63)
> Jun 01 03:40:51 	at org.junit.jupiter.api.AssertTrue.assertTrue(AssertTrue.java:36)
> Jun 01 03:40:51 	at org.junit.jupiter.api.Assertions.assertTrue(Assertions.java:211)
> Jun 01 03:40:51 	at org.apache.flink.table.sql.codegen.SqlITCaseBase.checkJsonResultFile(SqlITCaseBase.java:168)
> Jun 01 03:40:51 	at org.apache.flink.table.sql.codegen.SqlITCaseBase.runAndCheckSQL(SqlITCaseBase.java:111)
> Jun 01 03:40:51 	at org.apache.flink.table.sql.codegen.CreateTableAsITCase.testCreateTableAsInStatementSet(CreateTableAsITCase.java:50)
> Jun 01 03:40:51 	at sun.reflect.NativeMethodAccessorImpl.invoke0(Native Method)
> Jun 01 03:40:51 	at sun.reflect.NativeMethodAccessorImpl.invoke(NativeMethodAccessorImpl.java:62)
> Jun 01 03:40:51 	at sun.reflect.DelegatingMethodAccessorImpl.invoke(DelegatingMethodAccessorImpl.java:43)
> Jun 01 03:40:51 	at java.lang.reflect.Method.invoke(Method.java:498)
> {noformat}



--
This message was sent by Atlassian Jira
(v8.20.10#820010)