You are viewing a plain text version of this content. The canonical link for it is here.
Posted to dev@lucene.apache.org by Policeman Jenkins Server <je...@thetaphi.de> on 2016/04/04 22:20:50 UTC
[JENKINS] Lucene-Solr-6.x-Linux (64bit/jdk1.8.0_72) - Build # 341 -
Failure!
Build: http://jenkins.thetaphi.de/job/Lucene-Solr-6.x-Linux/341/
Java: 64bit/jdk1.8.0_72 -XX:+UseCompressedOops -XX:+UseParallelGC
1 tests failed.
FAILED: org.apache.solr.cloud.BasicDistributedZkTest.test
Error Message:
Error from server at http://127.0.0.1:43078/q/collection1: Async exception during distributed update: Bad Request request: http://127.0.0.1:46196/q/collection1/update?update.chain=distrib-dup-test-chain-explicit&update.distrib=TOLEADER&distrib.from=http%3A%2F%2F127.0.0.1%3A43078%2Fq%2Fcollection1%2F&wt=javabin&version=2
Stack Trace:
org.apache.solr.client.solrj.impl.HttpSolrClient$RemoteSolrException: Error from server at http://127.0.0.1:43078/q/collection1: Async exception during distributed update: Bad Request
request: http://127.0.0.1:46196/q/collection1/update?update.chain=distrib-dup-test-chain-explicit&update.distrib=TOLEADER&distrib.from=http%3A%2F%2F127.0.0.1%3A43078%2Fq%2Fcollection1%2F&wt=javabin&version=2
at __randomizedtesting.SeedInfo.seed([2794DC7CF1ECBA58:AFC0E3A65F10D7A0]:0)
at org.apache.solr.client.solrj.impl.HttpSolrClient.executeMethod(HttpSolrClient.java:577)
at org.apache.solr.client.solrj.impl.HttpSolrClient.request(HttpSolrClient.java:241)
at org.apache.solr.client.solrj.impl.HttpSolrClient.request(HttpSolrClient.java:230)
at org.apache.solr.client.solrj.SolrRequest.process(SolrRequest.java:149)
at org.apache.solr.client.solrj.SolrRequest.process(SolrRequest.java:166)
at org.apache.solr.BaseDistributedSearchTestCase.add(BaseDistributedSearchTestCase.java:514)
at org.apache.solr.cloud.BasicDistributedZkTest.testUpdateProcessorsRunOnlyOnce(BasicDistributedZkTest.java:669)
at org.apache.solr.cloud.BasicDistributedZkTest.test(BasicDistributedZkTest.java:365)
at sun.reflect.NativeMethodAccessorImpl.invoke0(Native Method)
at sun.reflect.NativeMethodAccessorImpl.invoke(NativeMethodAccessorImpl.java:62)
at sun.reflect.DelegatingMethodAccessorImpl.invoke(DelegatingMethodAccessorImpl.java:43)
at java.lang.reflect.Method.invoke(Method.java:498)
at com.carrotsearch.randomizedtesting.RandomizedRunner.invoke(RandomizedRunner.java:1764)
at com.carrotsearch.randomizedtesting.RandomizedRunner$8.evaluate(RandomizedRunner.java:871)
at com.carrotsearch.randomizedtesting.RandomizedRunner$9.evaluate(RandomizedRunner.java:907)
at com.carrotsearch.randomizedtesting.RandomizedRunner$10.evaluate(RandomizedRunner.java:921)
at org.apache.solr.BaseDistributedSearchTestCase$ShardsRepeatRule$ShardsFixedStatement.callStatement(BaseDistributedSearchTestCase.java:992)
at org.apache.solr.BaseDistributedSearchTestCase$ShardsRepeatRule$ShardsStatement.evaluate(BaseDistributedSearchTestCase.java:967)
at com.carrotsearch.randomizedtesting.rules.SystemPropertiesRestoreRule$1.evaluate(SystemPropertiesRestoreRule.java:57)
at org.apache.lucene.util.TestRuleSetupTeardownChained$1.evaluate(TestRuleSetupTeardownChained.java:49)
at org.apache.lucene.util.AbstractBeforeAfterRule$1.evaluate(AbstractBeforeAfterRule.java:45)
at org.apache.lucene.util.TestRuleThreadAndTestName$1.evaluate(TestRuleThreadAndTestName.java:48)
at org.apache.lucene.util.TestRuleIgnoreAfterMaxFailures$1.evaluate(TestRuleIgnoreAfterMaxFailures.java:64)
at org.apache.lucene.util.TestRuleMarkFailure$1.evaluate(TestRuleMarkFailure.java:47)
at com.carrotsearch.randomizedtesting.rules.StatementAdapter.evaluate(StatementAdapter.java:36)
at com.carrotsearch.randomizedtesting.ThreadLeakControl$StatementRunner.run(ThreadLeakControl.java:367)
at com.carrotsearch.randomizedtesting.ThreadLeakControl.forkTimeoutingTask(ThreadLeakControl.java:809)
at com.carrotsearch.randomizedtesting.ThreadLeakControl$3.evaluate(ThreadLeakControl.java:460)
at com.carrotsearch.randomizedtesting.RandomizedRunner.runSingleTest(RandomizedRunner.java:880)
at com.carrotsearch.randomizedtesting.RandomizedRunner$5.evaluate(RandomizedRunner.java:781)
at com.carrotsearch.randomizedtesting.RandomizedRunner$6.evaluate(RandomizedRunner.java:816)
at com.carrotsearch.randomizedtesting.RandomizedRunner$7.evaluate(RandomizedRunner.java:827)
at com.carrotsearch.randomizedtesting.rules.StatementAdapter.evaluate(StatementAdapter.java:36)
at com.carrotsearch.randomizedtesting.rules.SystemPropertiesRestoreRule$1.evaluate(SystemPropertiesRestoreRule.java:57)
at org.apache.lucene.util.AbstractBeforeAfterRule$1.evaluate(AbstractBeforeAfterRule.java:45)
at com.carrotsearch.randomizedtesting.rules.StatementAdapter.evaluate(StatementAdapter.java:36)
at org.apache.lucene.util.TestRuleStoreClassName$1.evaluate(TestRuleStoreClassName.java:41)
at com.carrotsearch.randomizedtesting.rules.NoShadowingOrOverridesOnMethodsRule$1.evaluate(NoShadowingOrOverridesOnMethodsRule.java:40)
at com.carrotsearch.randomizedtesting.rules.NoShadowingOrOverridesOnMethodsRule$1.evaluate(NoShadowingOrOverridesOnMethodsRule.java:40)
at com.carrotsearch.randomizedtesting.rules.StatementAdapter.evaluate(StatementAdapter.java:36)
at com.carrotsearch.randomizedtesting.rules.StatementAdapter.evaluate(StatementAdapter.java:36)
at com.carrotsearch.randomizedtesting.rules.StatementAdapter.evaluate(StatementAdapter.java:36)
at org.apache.lucene.util.TestRuleAssertionsRequired$1.evaluate(TestRuleAssertionsRequired.java:53)
at org.apache.lucene.util.TestRuleMarkFailure$1.evaluate(TestRuleMarkFailure.java:47)
at org.apache.lucene.util.TestRuleIgnoreAfterMaxFailures$1.evaluate(TestRuleIgnoreAfterMaxFailures.java:64)
at org.apache.lucene.util.TestRuleIgnoreTestSuites$1.evaluate(TestRuleIgnoreTestSuites.java:54)
at com.carrotsearch.randomizedtesting.rules.StatementAdapter.evaluate(StatementAdapter.java:36)
at com.carrotsearch.randomizedtesting.ThreadLeakControl$StatementRunner.run(ThreadLeakControl.java:367)
at java.lang.Thread.run(Thread.java:745)
Build Log:
[...truncated 11306 lines...]
[junit4] Suite: org.apache.solr.cloud.BasicDistributedZkTest
[junit4] 2> Creating dataDir: /home/jenkins/workspace/Lucene-Solr-6.x-Linux/solr/build/solr-core/test/J0/temp/solr.cloud.BasicDistributedZkTest_2794DC7CF1ECBA58-001/init-core-data-001
[junit4] 2> 545874 INFO (SUITE-BasicDistributedZkTest-seed#[2794DC7CF1ECBA58]-worker) [ ] o.a.s.BaseDistributedSearchTestCase Setting hostContext system property: /q/
[junit4] 2> 545876 INFO (TEST-BasicDistributedZkTest.test-seed#[2794DC7CF1ECBA58]) [ ] o.a.s.c.ZkTestServer STARTING ZK TEST SERVER
[junit4] 2> 545876 INFO (Thread-1673) [ ] o.a.s.c.ZkTestServer client port:0.0.0.0/0.0.0.0:0
[junit4] 2> 545876 INFO (Thread-1673) [ ] o.a.s.c.ZkTestServer Starting server
[junit4] 2> 545976 INFO (TEST-BasicDistributedZkTest.test-seed#[2794DC7CF1ECBA58]) [ ] o.a.s.c.ZkTestServer start zk server on port:33185
[junit4] 2> 545976 INFO (TEST-BasicDistributedZkTest.test-seed#[2794DC7CF1ECBA58]) [ ] o.a.s.c.c.SolrZkClient Using default ZkCredentialsProvider
[junit4] 2> 545977 INFO (TEST-BasicDistributedZkTest.test-seed#[2794DC7CF1ECBA58]) [ ] o.a.s.c.c.ConnectionManager Waiting for client to connect to ZooKeeper
[junit4] 2> 545979 INFO (zkCallback-663-thread-1) [ ] o.a.s.c.c.ConnectionManager Watcher org.apache.solr.common.cloud.ConnectionManager@c516312 name:ZooKeeperConnection Watcher:127.0.0.1:33185 got event WatchedEvent state:SyncConnected type:None path:null path:null type:None
[junit4] 2> 545979 INFO (TEST-BasicDistributedZkTest.test-seed#[2794DC7CF1ECBA58]) [ ] o.a.s.c.c.ConnectionManager Client is connected to ZooKeeper
[junit4] 2> 545979 INFO (TEST-BasicDistributedZkTest.test-seed#[2794DC7CF1ECBA58]) [ ] o.a.s.c.c.SolrZkClient Using default ZkACLProvider
[junit4] 2> 545979 INFO (TEST-BasicDistributedZkTest.test-seed#[2794DC7CF1ECBA58]) [ ] o.a.s.c.c.SolrZkClient makePath: /solr
[junit4] 2> 545980 INFO (TEST-BasicDistributedZkTest.test-seed#[2794DC7CF1ECBA58]) [ ] o.a.s.c.c.SolrZkClient Using default ZkCredentialsProvider
[junit4] 2> 545981 INFO (TEST-BasicDistributedZkTest.test-seed#[2794DC7CF1ECBA58]) [ ] o.a.s.c.c.ConnectionManager Waiting for client to connect to ZooKeeper
[junit4] 2> 545981 INFO (zkCallback-664-thread-1) [ ] o.a.s.c.c.ConnectionManager Watcher org.apache.solr.common.cloud.ConnectionManager@64efe8d2 name:ZooKeeperConnection Watcher:127.0.0.1:33185/solr got event WatchedEvent state:SyncConnected type:None path:null path:null type:None
[junit4] 2> 545981 INFO (TEST-BasicDistributedZkTest.test-seed#[2794DC7CF1ECBA58]) [ ] o.a.s.c.c.ConnectionManager Client is connected to ZooKeeper
[junit4] 2> 545982 INFO (TEST-BasicDistributedZkTest.test-seed#[2794DC7CF1ECBA58]) [ ] o.a.s.c.c.SolrZkClient Using default ZkACLProvider
[junit4] 2> 545982 INFO (TEST-BasicDistributedZkTest.test-seed#[2794DC7CF1ECBA58]) [ ] o.a.s.c.c.SolrZkClient makePath: /collections/collection1
[junit4] 2> 545982 INFO (TEST-BasicDistributedZkTest.test-seed#[2794DC7CF1ECBA58]) [ ] o.a.s.c.c.SolrZkClient makePath: /collections/collection1/shards
[junit4] 2> 545983 INFO (TEST-BasicDistributedZkTest.test-seed#[2794DC7CF1ECBA58]) [ ] o.a.s.c.c.SolrZkClient makePath: /collections/control_collection
[junit4] 2> 545983 INFO (TEST-BasicDistributedZkTest.test-seed#[2794DC7CF1ECBA58]) [ ] o.a.s.c.c.SolrZkClient makePath: /collections/control_collection/shards
[junit4] 2> 545985 INFO (TEST-BasicDistributedZkTest.test-seed#[2794DC7CF1ECBA58]) [ ] o.a.s.c.AbstractZkTestCase put /home/jenkins/workspace/Lucene-Solr-6.x-Linux/solr/core/src/test-files/solr/collection1/conf/solrconfig-tlog.xml to /configs/conf1/solrconfig.xml
[junit4] 2> 545985 INFO (TEST-BasicDistributedZkTest.test-seed#[2794DC7CF1ECBA58]) [ ] o.a.s.c.c.SolrZkClient makePath: /configs/conf1/solrconfig.xml
[junit4] 2> 545986 INFO (TEST-BasicDistributedZkTest.test-seed#[2794DC7CF1ECBA58]) [ ] o.a.s.c.AbstractZkTestCase put /home/jenkins/workspace/Lucene-Solr-6.x-Linux/solr/core/src/test-files/solr/collection1/conf/schema.xml to /configs/conf1/schema.xml
[junit4] 2> 545987 INFO (TEST-BasicDistributedZkTest.test-seed#[2794DC7CF1ECBA58]) [ ] o.a.s.c.c.SolrZkClient makePath: /configs/conf1/schema.xml
[junit4] 2> 545988 INFO (TEST-BasicDistributedZkTest.test-seed#[2794DC7CF1ECBA58]) [ ] o.a.s.c.AbstractZkTestCase put /home/jenkins/workspace/Lucene-Solr-6.x-Linux/solr/core/src/test-files/solr/collection1/conf/solrconfig.snippet.randomindexconfig.xml to /configs/conf1/solrconfig.snippet.randomindexconfig.xml
[junit4] 2> 545988 INFO (TEST-BasicDistributedZkTest.test-seed#[2794DC7CF1ECBA58]) [ ] o.a.s.c.c.SolrZkClient makePath: /configs/conf1/solrconfig.snippet.randomindexconfig.xml
[junit4] 2> 545988 INFO (TEST-BasicDistributedZkTest.test-seed#[2794DC7CF1ECBA58]) [ ] o.a.s.c.AbstractZkTestCase put /home/jenkins/workspace/Lucene-Solr-6.x-Linux/solr/core/src/test-files/solr/collection1/conf/stopwords.txt to /configs/conf1/stopwords.txt
[junit4] 2> 545988 INFO (TEST-BasicDistributedZkTest.test-seed#[2794DC7CF1ECBA58]) [ ] o.a.s.c.c.SolrZkClient makePath: /configs/conf1/stopwords.txt
[junit4] 2> 545990 INFO (TEST-BasicDistributedZkTest.test-seed#[2794DC7CF1ECBA58]) [ ] o.a.s.c.AbstractZkTestCase put /home/jenkins/workspace/Lucene-Solr-6.x-Linux/solr/core/src/test-files/solr/collection1/conf/protwords.txt to /configs/conf1/protwords.txt
[junit4] 2> 545990 INFO (TEST-BasicDistributedZkTest.test-seed#[2794DC7CF1ECBA58]) [ ] o.a.s.c.c.SolrZkClient makePath: /configs/conf1/protwords.txt
[junit4] 2> 545991 INFO (TEST-BasicDistributedZkTest.test-seed#[2794DC7CF1ECBA58]) [ ] o.a.s.c.AbstractZkTestCase put /home/jenkins/workspace/Lucene-Solr-6.x-Linux/solr/core/src/test-files/solr/collection1/conf/currency.xml to /configs/conf1/currency.xml
[junit4] 2> 545991 INFO (TEST-BasicDistributedZkTest.test-seed#[2794DC7CF1ECBA58]) [ ] o.a.s.c.c.SolrZkClient makePath: /configs/conf1/currency.xml
[junit4] 2> 545992 INFO (TEST-BasicDistributedZkTest.test-seed#[2794DC7CF1ECBA58]) [ ] o.a.s.c.AbstractZkTestCase put /home/jenkins/workspace/Lucene-Solr-6.x-Linux/solr/core/src/test-files/solr/collection1/conf/enumsConfig.xml to /configs/conf1/enumsConfig.xml
[junit4] 2> 545992 INFO (TEST-BasicDistributedZkTest.test-seed#[2794DC7CF1ECBA58]) [ ] o.a.s.c.c.SolrZkClient makePath: /configs/conf1/enumsConfig.xml
[junit4] 2> 545992 INFO (TEST-BasicDistributedZkTest.test-seed#[2794DC7CF1ECBA58]) [ ] o.a.s.c.AbstractZkTestCase put /home/jenkins/workspace/Lucene-Solr-6.x-Linux/solr/core/src/test-files/solr/collection1/conf/open-exchange-rates.json to /configs/conf1/open-exchange-rates.json
[junit4] 2> 545992 INFO (TEST-BasicDistributedZkTest.test-seed#[2794DC7CF1ECBA58]) [ ] o.a.s.c.c.SolrZkClient makePath: /configs/conf1/open-exchange-rates.json
[junit4] 2> 545993 INFO (TEST-BasicDistributedZkTest.test-seed#[2794DC7CF1ECBA58]) [ ] o.a.s.c.AbstractZkTestCase put /home/jenkins/workspace/Lucene-Solr-6.x-Linux/solr/core/src/test-files/solr/collection1/conf/mapping-ISOLatin1Accent.txt to /configs/conf1/mapping-ISOLatin1Accent.txt
[junit4] 2> 545993 INFO (TEST-BasicDistributedZkTest.test-seed#[2794DC7CF1ECBA58]) [ ] o.a.s.c.c.SolrZkClient makePath: /configs/conf1/mapping-ISOLatin1Accent.txt
[junit4] 2> 545993 INFO (TEST-BasicDistributedZkTest.test-seed#[2794DC7CF1ECBA58]) [ ] o.a.s.c.AbstractZkTestCase put /home/jenkins/workspace/Lucene-Solr-6.x-Linux/solr/core/src/test-files/solr/collection1/conf/old_synonyms.txt to /configs/conf1/old_synonyms.txt
[junit4] 2> 545993 INFO (TEST-BasicDistributedZkTest.test-seed#[2794DC7CF1ECBA58]) [ ] o.a.s.c.c.SolrZkClient makePath: /configs/conf1/old_synonyms.txt
[junit4] 2> 545994 INFO (TEST-BasicDistributedZkTest.test-seed#[2794DC7CF1ECBA58]) [ ] o.a.s.c.AbstractZkTestCase put /home/jenkins/workspace/Lucene-Solr-6.x-Linux/solr/core/src/test-files/solr/collection1/conf/synonyms.txt to /configs/conf1/synonyms.txt
[junit4] 2> 545994 INFO (TEST-BasicDistributedZkTest.test-seed#[2794DC7CF1ECBA58]) [ ] o.a.s.c.c.SolrZkClient makePath: /configs/conf1/synonyms.txt
[junit4] 2> 546040 INFO (TEST-BasicDistributedZkTest.test-seed#[2794DC7CF1ECBA58]) [ ] o.a.s.SolrTestCaseJ4 Writing core.properties file to /home/jenkins/workspace/Lucene-Solr-6.x-Linux/solr/build/solr-core/test/J0/temp/solr.cloud.BasicDistributedZkTest_2794DC7CF1ECBA58-001/control-001/cores/collection1
[junit4] 2> 546041 INFO (TEST-BasicDistributedZkTest.test-seed#[2794DC7CF1ECBA58]) [ ] o.e.j.s.Server jetty-9.3.8.v20160314
[junit4] 2> 546042 INFO (TEST-BasicDistributedZkTest.test-seed#[2794DC7CF1ECBA58]) [ ] o.e.j.s.h.ContextHandler Started o.e.j.s.ServletContextHandler@5120a333{/q,null,AVAILABLE}
[junit4] 2> 546044 INFO (TEST-BasicDistributedZkTest.test-seed#[2794DC7CF1ECBA58]) [ ] o.e.j.s.ServerConnector Started ServerConnector@62248972{HTTP/1.1,[http/1.1]}{127.0.0.1:41695}
[junit4] 2> 546044 INFO (TEST-BasicDistributedZkTest.test-seed#[2794DC7CF1ECBA58]) [ ] o.e.j.s.Server Started @547635ms
[junit4] 2> 546044 INFO (TEST-BasicDistributedZkTest.test-seed#[2794DC7CF1ECBA58]) [ ] o.a.s.c.s.e.JettySolrRunner Jetty properties: {solr.data.dir=/home/jenkins/workspace/Lucene-Solr-6.x-Linux/solr/build/solr-core/test/J0/temp/solr.cloud.BasicDistributedZkTest_2794DC7CF1ECBA58-001/tempDir-001/control/data, hostContext=/q, hostPort=41695, coreRootDirectory=/home/jenkins/workspace/Lucene-Solr-6.x-Linux/solr/build/solr-core/test/J0/../../../../../../../../../home/jenkins/workspace/Lucene-Solr-6.x-Linux/solr/build/solr-core/test/J0/temp/solr.cloud.BasicDistributedZkTest_2794DC7CF1ECBA58-001/control-001/cores}
[junit4] 2> 546044 INFO (TEST-BasicDistributedZkTest.test-seed#[2794DC7CF1ECBA58]) [ ] o.a.s.s.SolrDispatchFilter SolrDispatchFilter.init(): sun.misc.Launcher$AppClassLoader@73d16e93
[junit4] 2> 546044 INFO (TEST-BasicDistributedZkTest.test-seed#[2794DC7CF1ECBA58]) [ ] o.a.s.c.SolrResourceLoader new SolrResourceLoader for directory: '/home/jenkins/workspace/Lucene-Solr-6.x-Linux/solr/build/solr-core/test/J0/temp/solr.cloud.BasicDistributedZkTest_2794DC7CF1ECBA58-001/control-001'
[junit4] 2> 546044 INFO (TEST-BasicDistributedZkTest.test-seed#[2794DC7CF1ECBA58]) [ ] o.a.s.c.SolrResourceLoader JNDI not configured for solr (NoInitialContextEx)
[junit4] 2> 546044 INFO (TEST-BasicDistributedZkTest.test-seed#[2794DC7CF1ECBA58]) [ ] o.a.s.c.SolrResourceLoader solr home defaulted to 'solr/' (could not find system property or JNDI)
[junit4] 2> 546044 INFO (TEST-BasicDistributedZkTest.test-seed#[2794DC7CF1ECBA58]) [ ] o.a.s.c.c.SolrZkClient Using default ZkCredentialsProvider
[junit4] 2> 546044 INFO (TEST-BasicDistributedZkTest.test-seed#[2794DC7CF1ECBA58]) [ ] o.a.s.c.c.ConnectionManager Waiting for client to connect to ZooKeeper
[junit4] 2> 546045 INFO (zkCallback-665-thread-1) [ ] o.a.s.c.c.ConnectionManager Watcher org.apache.solr.common.cloud.ConnectionManager@2f1e8595 name:ZooKeeperConnection Watcher:127.0.0.1:33185/solr got event WatchedEvent state:SyncConnected type:None path:null path:null type:None
[junit4] 2> 546045 INFO (TEST-BasicDistributedZkTest.test-seed#[2794DC7CF1ECBA58]) [ ] o.a.s.c.c.ConnectionManager Client is connected to ZooKeeper
[junit4] 2> 546045 INFO (TEST-BasicDistributedZkTest.test-seed#[2794DC7CF1ECBA58]) [ ] o.a.s.c.c.SolrZkClient Using default ZkACLProvider
[junit4] 2> 546046 INFO (TEST-BasicDistributedZkTest.test-seed#[2794DC7CF1ECBA58]) [ ] o.a.s.s.SolrDispatchFilter Loading solr.xml from SolrHome (not found in ZooKeeper)
[junit4] 2> 546046 INFO (TEST-BasicDistributedZkTest.test-seed#[2794DC7CF1ECBA58]) [ ] o.a.s.c.SolrXmlConfig Loading container configuration from /home/jenkins/workspace/Lucene-Solr-6.x-Linux/solr/build/solr-core/test/J0/temp/solr.cloud.BasicDistributedZkTest_2794DC7CF1ECBA58-001/control-001/solr.xml
[junit4] 2> 546049 INFO (TEST-BasicDistributedZkTest.test-seed#[2794DC7CF1ECBA58]) [ ] o.a.s.c.CorePropertiesLocator Config-defined core root directory: /home/jenkins/workspace/Lucene-Solr-6.x-Linux/solr/build/solr-core/test/J0/../../../../../../../../../home/jenkins/workspace/Lucene-Solr-6.x-Linux/solr/build/solr-core/test/J0/temp/solr.cloud.BasicDistributedZkTest_2794DC7CF1ECBA58-001/control-001/cores
[junit4] 2> 546049 INFO (TEST-BasicDistributedZkTest.test-seed#[2794DC7CF1ECBA58]) [ ] o.a.s.c.CoreContainer New CoreContainer 1612790514
[junit4] 2> 546049 INFO (TEST-BasicDistributedZkTest.test-seed#[2794DC7CF1ECBA58]) [ ] o.a.s.c.CoreContainer Loading cores into CoreContainer [instanceDir=/home/jenkins/workspace/Lucene-Solr-6.x-Linux/solr/build/solr-core/test/J0/temp/solr.cloud.BasicDistributedZkTest_2794DC7CF1ECBA58-001/control-001]
[junit4] 2> 546049 WARN (TEST-BasicDistributedZkTest.test-seed#[2794DC7CF1ECBA58]) [ ] o.a.s.c.CoreContainer Couldn't add files from /home/jenkins/workspace/Lucene-Solr-6.x-Linux/solr/build/solr-core/test/J0/temp/solr.cloud.BasicDistributedZkTest_2794DC7CF1ECBA58-001/control-001/lib to classpath: /home/jenkins/workspace/Lucene-Solr-6.x-Linux/solr/build/solr-core/test/J0/temp/solr.cloud.BasicDistributedZkTest_2794DC7CF1ECBA58-001/control-001/lib
[junit4] 2> 546050 INFO (TEST-BasicDistributedZkTest.test-seed#[2794DC7CF1ECBA58]) [ ] o.a.s.h.c.HttpShardHandlerFactory created with socketTimeout : 90000,urlScheme : ,connTimeout : 15000,maxConnectionsPerHost : 20,maxConnections : 10000,corePoolSize : 0,maximumPoolSize : 2147483647,maxThreadIdleTime : 5,sizeOfQueue : -1,fairnessPolicy : false,useRetries : false,
[junit4] 2> 546050 INFO (TEST-BasicDistributedZkTest.test-seed#[2794DC7CF1ECBA58]) [ ] o.a.s.u.UpdateShardHandler Creating UpdateShardHandler HTTP client with params: socketTimeout=340000&connTimeout=45000&retry=true
[junit4] 2> 546051 INFO (TEST-BasicDistributedZkTest.test-seed#[2794DC7CF1ECBA58]) [ ] o.a.s.l.LogWatcher SLF4J impl is org.slf4j.impl.Log4jLoggerFactory
[junit4] 2> 546051 INFO (TEST-BasicDistributedZkTest.test-seed#[2794DC7CF1ECBA58]) [ ] o.a.s.l.LogWatcher Registering Log Listener [Log4j (org.slf4j.impl.Log4jLoggerFactory)]
[junit4] 2> 546051 INFO (TEST-BasicDistributedZkTest.test-seed#[2794DC7CF1ECBA58]) [ ] o.a.s.c.ZkContainer Zookeeper client=127.0.0.1:33185/solr
[junit4] 2> 546051 INFO (TEST-BasicDistributedZkTest.test-seed#[2794DC7CF1ECBA58]) [ ] o.a.s.c.ZkController zkHost includes chroot
[junit4] 2> 546051 INFO (TEST-BasicDistributedZkTest.test-seed#[2794DC7CF1ECBA58]) [ ] o.a.s.c.c.SolrZkClient Using default ZkCredentialsProvider
[junit4] 2> 546051 INFO (TEST-BasicDistributedZkTest.test-seed#[2794DC7CF1ECBA58]) [ ] o.a.s.c.c.ConnectionManager Waiting for client to connect to ZooKeeper
[junit4] 2> 546052 INFO (zkCallback-668-thread-1) [ ] o.a.s.c.c.ConnectionManager Watcher org.apache.solr.common.cloud.ConnectionManager@53762337 name:ZooKeeperConnection Watcher:127.0.0.1:33185 got event WatchedEvent state:SyncConnected type:None path:null path:null type:None
[junit4] 2> 546052 INFO (TEST-BasicDistributedZkTest.test-seed#[2794DC7CF1ECBA58]) [ ] o.a.s.c.c.ConnectionManager Client is connected to ZooKeeper
[junit4] 2> 546052 INFO (TEST-BasicDistributedZkTest.test-seed#[2794DC7CF1ECBA58]) [ ] o.a.s.c.c.SolrZkClient Using default ZkACLProvider
[junit4] 2> 546053 INFO (TEST-BasicDistributedZkTest.test-seed#[2794DC7CF1ECBA58]) [n:127.0.0.1:41695_q ] o.a.s.c.c.ConnectionManager Waiting for client to connect to ZooKeeper
[junit4] 2> 546053 INFO (zkCallback-669-thread-1-processing-n:127.0.0.1:41695_q) [n:127.0.0.1:41695_q ] o.a.s.c.c.ConnectionManager Watcher org.apache.solr.common.cloud.ConnectionManager@f1e7be2 name:ZooKeeperConnection Watcher:127.0.0.1:33185/solr got event WatchedEvent state:SyncConnected type:None path:null path:null type:None
[junit4] 2> 546054 INFO (TEST-BasicDistributedZkTest.test-seed#[2794DC7CF1ECBA58]) [n:127.0.0.1:41695_q ] o.a.s.c.c.ConnectionManager Client is connected to ZooKeeper
[junit4] 2> 546054 INFO (TEST-BasicDistributedZkTest.test-seed#[2794DC7CF1ECBA58]) [n:127.0.0.1:41695_q ] o.a.s.c.c.SolrZkClient makePath: /overseer/queue
[junit4] 2> 546055 INFO (TEST-BasicDistributedZkTest.test-seed#[2794DC7CF1ECBA58]) [n:127.0.0.1:41695_q ] o.a.s.c.c.SolrZkClient makePath: /overseer/collection-queue-work
[junit4] 2> 546055 INFO (TEST-BasicDistributedZkTest.test-seed#[2794DC7CF1ECBA58]) [n:127.0.0.1:41695_q ] o.a.s.c.c.SolrZkClient makePath: /overseer/collection-map-running
[junit4] 2> 546056 INFO (TEST-BasicDistributedZkTest.test-seed#[2794DC7CF1ECBA58]) [n:127.0.0.1:41695_q ] o.a.s.c.c.SolrZkClient makePath: /overseer/collection-map-completed
[junit4] 2> 546056 INFO (TEST-BasicDistributedZkTest.test-seed#[2794DC7CF1ECBA58]) [n:127.0.0.1:41695_q ] o.a.s.c.c.SolrZkClient makePath: /overseer/collection-map-failure
[junit4] 2> 546057 INFO (TEST-BasicDistributedZkTest.test-seed#[2794DC7CF1ECBA58]) [n:127.0.0.1:41695_q ] o.a.s.c.c.SolrZkClient makePath: /live_nodes
[junit4] 2> 546057 INFO (TEST-BasicDistributedZkTest.test-seed#[2794DC7CF1ECBA58]) [n:127.0.0.1:41695_q ] o.a.s.c.c.SolrZkClient makePath: /aliases.json
[junit4] 2> 546057 INFO (TEST-BasicDistributedZkTest.test-seed#[2794DC7CF1ECBA58]) [n:127.0.0.1:41695_q ] o.a.s.c.c.SolrZkClient makePath: /clusterstate.json
[junit4] 2> 546057 INFO (TEST-BasicDistributedZkTest.test-seed#[2794DC7CF1ECBA58]) [n:127.0.0.1:41695_q ] o.a.s.c.c.SolrZkClient makePath: /security.json
[junit4] 2> 546058 INFO (TEST-BasicDistributedZkTest.test-seed#[2794DC7CF1ECBA58]) [n:127.0.0.1:41695_q ] o.a.s.c.c.ZkStateReader Updating cluster state from ZooKeeper...
[junit4] 2> 546058 INFO (TEST-BasicDistributedZkTest.test-seed#[2794DC7CF1ECBA58]) [n:127.0.0.1:41695_q ] o.a.s.c.c.ZkStateReader Updated live nodes from ZooKeeper... (0) -> (0)
[junit4] 2> 546059 INFO (TEST-BasicDistributedZkTest.test-seed#[2794DC7CF1ECBA58]) [n:127.0.0.1:41695_q ] o.a.s.c.c.SolrZkClient makePath: /overseer_elect
[junit4] 2> 546059 INFO (TEST-BasicDistributedZkTest.test-seed#[2794DC7CF1ECBA58]) [n:127.0.0.1:41695_q ] o.a.s.c.c.SolrZkClient makePath: /overseer_elect/election
[junit4] 2> 546060 INFO (TEST-BasicDistributedZkTest.test-seed#[2794DC7CF1ECBA58]) [n:127.0.0.1:41695_q ] o.a.s.c.Overseer Overseer (id=null) closing
[junit4] 2> 546060 INFO (TEST-BasicDistributedZkTest.test-seed#[2794DC7CF1ECBA58]) [n:127.0.0.1:41695_q ] o.a.s.c.LeaderElector Joined leadership election with path: /overseer_elect/election/95669446086426628-127.0.0.1:41695_q-n_0000000000
[junit4] 2> 546060 INFO (TEST-BasicDistributedZkTest.test-seed#[2794DC7CF1ECBA58]) [n:127.0.0.1:41695_q ] o.a.s.c.OverseerElectionContext I am going to be the leader 127.0.0.1:41695_q
[junit4] 2> 546060 INFO (TEST-BasicDistributedZkTest.test-seed#[2794DC7CF1ECBA58]) [n:127.0.0.1:41695_q ] o.a.s.c.c.SolrZkClient makePath: /overseer_elect/leader
[junit4] 2> 546060 INFO (TEST-BasicDistributedZkTest.test-seed#[2794DC7CF1ECBA58]) [n:127.0.0.1:41695_q ] o.a.s.c.Overseer Overseer (id=95669446086426628-127.0.0.1:41695_q-n_0000000000) starting
[junit4] 2> 546061 INFO (TEST-BasicDistributedZkTest.test-seed#[2794DC7CF1ECBA58]) [n:127.0.0.1:41695_q ] o.a.s.c.c.SolrZkClient makePath: /overseer/queue-work
[junit4] 2> 546062 INFO (TEST-BasicDistributedZkTest.test-seed#[2794DC7CF1ECBA58]) [n:127.0.0.1:41695_q ] o.a.s.c.OverseerAutoReplicaFailoverThread Starting OverseerAutoReplicaFailoverThread autoReplicaFailoverWorkLoopDelay=10000 autoReplicaFailoverWaitAfterExpiration=30000 autoReplicaFailoverBadNodeExpiration=60000
[junit4] 2> 546062 INFO (OverseerCollectionConfigSetProcessor-95669446086426628-127.0.0.1:41695_q-n_0000000000) [n:127.0.0.1:41695_q ] o.a.s.c.OverseerTaskProcessor Process current queue of overseer operations
[junit4] 2> 546062 INFO (TEST-BasicDistributedZkTest.test-seed#[2794DC7CF1ECBA58]) [n:127.0.0.1:41695_q ] o.a.s.c.ZkController Register node as live in ZooKeeper:/live_nodes/127.0.0.1:41695_q
[junit4] 2> 546062 INFO (OverseerStateUpdate-95669446086426628-127.0.0.1:41695_q-n_0000000000) [n:127.0.0.1:41695_q ] o.a.s.c.Overseer Starting to work on the main queue
[junit4] 2> 546063 INFO (TEST-BasicDistributedZkTest.test-seed#[2794DC7CF1ECBA58]) [n:127.0.0.1:41695_q ] o.a.s.c.c.SolrZkClient makePath: /live_nodes/127.0.0.1:41695_q
[junit4] 2> 546063 INFO (zkCallback-669-thread-1-processing-n:127.0.0.1:41695_q) [n:127.0.0.1:41695_q ] o.a.s.c.c.ZkStateReader A live node change: [WatchedEvent state:SyncConnected type:NodeChildrenChanged path:/live_nodes], has occurred - updating... (live nodes size: [0])
[junit4] 2> 546063 INFO (OverseerStateUpdate-95669446086426628-127.0.0.1:41695_q-n_0000000000) [n:127.0.0.1:41695_q ] o.a.s.c.c.ZkStateReader Updated live nodes from ZooKeeper... (0) -> (1)
[junit4] 2> 546064 INFO (zkCallback-669-thread-1-processing-n:127.0.0.1:41695_q) [n:127.0.0.1:41695_q ] o.a.s.c.c.ZkStateReader Updated live nodes from ZooKeeper... (1) -> (1)
[junit4] 2> 546073 INFO (TEST-BasicDistributedZkTest.test-seed#[2794DC7CF1ECBA58]) [n:127.0.0.1:41695_q ] o.a.s.c.CoreContainer Security conf doesn't exist. Skipping setup for authorization module.
[junit4] 2> 546073 INFO (TEST-BasicDistributedZkTest.test-seed#[2794DC7CF1ECBA58]) [n:127.0.0.1:41695_q ] o.a.s.c.CoreContainer No authentication plugin used.
[junit4] 2> 546073 INFO (TEST-BasicDistributedZkTest.test-seed#[2794DC7CF1ECBA58]) [n:127.0.0.1:41695_q ] o.a.s.c.CorePropertiesLocator Looking for core definitions underneath /home/jenkins/workspace/Lucene-Solr-6.x-Linux/solr/build/solr-core/test/J0/../../../../../../../../../home/jenkins/workspace/Lucene-Solr-6.x-Linux/solr/build/solr-core/test/J0/temp/solr.cloud.BasicDistributedZkTest_2794DC7CF1ECBA58-001/control-001/cores
[junit4] 2> 546074 INFO (TEST-BasicDistributedZkTest.test-seed#[2794DC7CF1ECBA58]) [n:127.0.0.1:41695_q ] o.a.s.c.CoreDescriptor Created CoreDescriptor: {name=collection1, config=solrconfig.xml, transient=false, schema=schema.xml, loadOnStartup=true, configSetProperties=configsetprops.json, collection=control_collection, coreNodeName=, dataDir=data/, shard=}
[junit4] 2> 546074 INFO (TEST-BasicDistributedZkTest.test-seed#[2794DC7CF1ECBA58]) [n:127.0.0.1:41695_q ] o.a.s.c.CorePropertiesLocator Found core collection1 in /home/jenkins/workspace/Lucene-Solr-6.x-Linux/solr/build/solr-core/test/J0/../../../../../../../../../home/jenkins/workspace/Lucene-Solr-6.x-Linux/solr/build/solr-core/test/J0/temp/solr.cloud.BasicDistributedZkTest_2794DC7CF1ECBA58-001/control-001/cores/collection1
[junit4] 2> 546074 INFO (TEST-BasicDistributedZkTest.test-seed#[2794DC7CF1ECBA58]) [n:127.0.0.1:41695_q ] o.a.s.c.CorePropertiesLocator Found 1 core definitions
[junit4] 2> 546074 INFO (TEST-BasicDistributedZkTest.test-seed#[2794DC7CF1ECBA58]) [n:127.0.0.1:41695_q ] o.a.s.s.SolrDispatchFilter user.dir=/home/jenkins/workspace/Lucene-Solr-6.x-Linux/solr/build/solr-core/test/J0
[junit4] 2> 546074 INFO (TEST-BasicDistributedZkTest.test-seed#[2794DC7CF1ECBA58]) [n:127.0.0.1:41695_q ] o.a.s.s.SolrDispatchFilter SolrDispatchFilter.init() done
[junit4] 2> 546074 INFO (coreLoadExecutor-2323-thread-1-processing-n:127.0.0.1:41695_q) [n:127.0.0.1:41695_q c:control_collection x:collection1] o.a.s.c.ZkController publishing state=down
[junit4] 2> 546074 INFO (coreLoadExecutor-2323-thread-1-processing-n:127.0.0.1:41695_q) [n:127.0.0.1:41695_q c:control_collection x:collection1] o.a.s.c.ZkController numShards not found on descriptor - reading it from system property
[junit4] 2> 546075 INFO (OverseerStateUpdate-95669446086426628-127.0.0.1:41695_q-n_0000000000) [n:127.0.0.1:41695_q ] o.a.s.c.Overseer processMessage: queueSize: 1, message = {
[junit4] 2> "core":"collection1",
[junit4] 2> "roles":null,
[junit4] 2> "base_url":"http://127.0.0.1:41695/q",
[junit4] 2> "node_name":"127.0.0.1:41695_q",
[junit4] 2> "numShards":"1",
[junit4] 2> "state":"down",
[junit4] 2> "shard":null,
[junit4] 2> "collection":"control_collection",
[junit4] 2> "operation":"state"} current state version: 0
[junit4] 2> 546075 INFO (coreLoadExecutor-2323-thread-1-processing-n:127.0.0.1:41695_q) [n:127.0.0.1:41695_q c:control_collection x:collection1] o.a.s.c.ZkController look for our core node name
[junit4] 2> 546075 INFO (OverseerStateUpdate-95669446086426628-127.0.0.1:41695_q-n_0000000000) [n:127.0.0.1:41695_q ] o.a.s.c.o.ReplicaMutator Update state numShards=1 message={
[junit4] 2> "core":"collection1",
[junit4] 2> "roles":null,
[junit4] 2> "base_url":"http://127.0.0.1:41695/q",
[junit4] 2> "node_name":"127.0.0.1:41695_q",
[junit4] 2> "numShards":"1",
[junit4] 2> "state":"down",
[junit4] 2> "shard":null,
[junit4] 2> "collection":"control_collection",
[junit4] 2> "operation":"state"}
[junit4] 2> 546075 INFO (OverseerStateUpdate-95669446086426628-127.0.0.1:41695_q-n_0000000000) [n:127.0.0.1:41695_q ] o.a.s.c.o.ClusterStateMutator building a new cName: control_collection
[junit4] 2> 546075 INFO (OverseerStateUpdate-95669446086426628-127.0.0.1:41695_q-n_0000000000) [n:127.0.0.1:41695_q ] o.a.s.c.o.ReplicaMutator Assigning new node to shard shard=shard1
[junit4] 2> 546076 INFO (zkCallback-669-thread-1-processing-n:127.0.0.1:41695_q) [n:127.0.0.1:41695_q ] o.a.s.c.c.ZkStateReader A cluster state change: [WatchedEvent state:SyncConnected type:NodeDataChanged path:/clusterstate.json], has occurred - updating... (live nodes size: [1])
[junit4] 2> 547075 INFO (coreLoadExecutor-2323-thread-1-processing-n:127.0.0.1:41695_q) [n:127.0.0.1:41695_q c:control_collection x:collection1] o.a.s.c.ZkController waiting to find shard id in clusterstate for collection1
[junit4] 2> 547075 INFO (coreLoadExecutor-2323-thread-1-processing-n:127.0.0.1:41695_q) [n:127.0.0.1:41695_q c:control_collection x:collection1] o.a.s.c.ZkController Check for collection zkNode:control_collection
[junit4] 2> 547076 INFO (coreLoadExecutor-2323-thread-1-processing-n:127.0.0.1:41695_q) [n:127.0.0.1:41695_q c:control_collection x:collection1] o.a.s.c.ZkController Collection zkNode exists
[junit4] 2> 547076 INFO (coreLoadExecutor-2323-thread-1-processing-n:127.0.0.1:41695_q) [n:127.0.0.1:41695_q c:control_collection x:collection1] o.a.s.c.c.ZkStateReader Load collection config from: [/collections/control_collection]
[junit4] 2> 547076 INFO (coreLoadExecutor-2323-thread-1-processing-n:127.0.0.1:41695_q) [n:127.0.0.1:41695_q c:control_collection x:collection1] o.a.s.c.c.ZkStateReader path=[/collections/control_collection] [configName]=[conf1] specified config exists in ZooKeeper
[junit4] 2> 547076 INFO (coreLoadExecutor-2323-thread-1-processing-n:127.0.0.1:41695_q) [n:127.0.0.1:41695_q c:control_collection x:collection1] o.a.s.c.SolrResourceLoader new SolrResourceLoader for directory: '/home/jenkins/workspace/Lucene-Solr-6.x-Linux/solr/build/solr-core/test/J0/temp/solr.cloud.BasicDistributedZkTest_2794DC7CF1ECBA58-001/control-001/cores/collection1'
[junit4] 2> 547076 INFO (coreLoadExecutor-2323-thread-1-processing-n:127.0.0.1:41695_q) [n:127.0.0.1:41695_q c:control_collection x:collection1] o.a.s.c.SolrResourceLoader JNDI not configured for solr (NoInitialContextEx)
[junit4] 2> 547076 INFO (coreLoadExecutor-2323-thread-1-processing-n:127.0.0.1:41695_q) [n:127.0.0.1:41695_q c:control_collection x:collection1] o.a.s.c.SolrResourceLoader solr home defaulted to 'solr/' (could not find system property or JNDI)
[junit4] 2> 547077 INFO (coreLoadExecutor-2323-thread-1-processing-n:127.0.0.1:41695_q) [n:127.0.0.1:41695_q c:control_collection x:collection1] o.a.s.c.Config loaded config solrconfig.xml with version 0
[junit4] 2> 547081 INFO (coreLoadExecutor-2323-thread-1-processing-n:127.0.0.1:41695_q) [n:127.0.0.1:41695_q c:control_collection x:collection1] o.a.s.c.SolrConfig current version of requestparams : -1
[junit4] 2> 547083 WARN (coreLoadExecutor-2323-thread-1-processing-n:127.0.0.1:41695_q) [n:127.0.0.1:41695_q c:control_collection x:collection1] o.a.s.c.Config Beginning with Solr 5.5, <mergePolicy> is deprecated, use <mergePolicyFactory> instead.
[junit4] 2> 547083 INFO (coreLoadExecutor-2323-thread-1-processing-n:127.0.0.1:41695_q) [n:127.0.0.1:41695_q c:control_collection x:collection1] o.a.s.c.SolrConfig Using Lucene MatchVersion: 6.1.0
[junit4] 2> 547094 INFO (coreLoadExecutor-2323-thread-1-processing-n:127.0.0.1:41695_q) [n:127.0.0.1:41695_q c:control_collection x:collection1] o.a.s.c.SolrConfig Loaded SolrConfig: solrconfig.xml
[junit4] 2> 547097 INFO (coreLoadExecutor-2323-thread-1-processing-n:127.0.0.1:41695_q) [n:127.0.0.1:41695_q c:control_collection x:collection1] o.a.s.s.IndexSchema [collection1] Schema name=test
[junit4] 2> 547156 INFO (coreLoadExecutor-2323-thread-1-processing-n:127.0.0.1:41695_q) [n:127.0.0.1:41695_q c:control_collection x:collection1] o.a.s.s.OpenExchangeRatesOrgProvider Initialized with rates=open-exchange-rates.json, refreshInterval=1440.
[junit4] 2> 547159 INFO (coreLoadExecutor-2323-thread-1-processing-n:127.0.0.1:41695_q) [n:127.0.0.1:41695_q c:control_collection x:collection1] o.a.s.s.IndexSchema default search field in schema is text
[junit4] 2> 547160 INFO (coreLoadExecutor-2323-thread-1-processing-n:127.0.0.1:41695_q) [n:127.0.0.1:41695_q c:control_collection x:collection1] o.a.s.s.IndexSchema unique key field: id
[junit4] 2> 547164 INFO (coreLoadExecutor-2323-thread-1-processing-n:127.0.0.1:41695_q) [n:127.0.0.1:41695_q c:control_collection x:collection1] o.a.s.s.FileExchangeRateProvider Reloading exchange rates from file currency.xml
[junit4] 2> 547165 INFO (coreLoadExecutor-2323-thread-1-processing-n:127.0.0.1:41695_q) [n:127.0.0.1:41695_q c:control_collection x:collection1] o.a.s.s.FileExchangeRateProvider Reloading exchange rates from file currency.xml
[junit4] 2> 547166 INFO (coreLoadExecutor-2323-thread-1-processing-n:127.0.0.1:41695_q) [n:127.0.0.1:41695_q c:control_collection x:collection1] o.a.s.s.OpenExchangeRatesOrgProvider Reloading exchange rates from open-exchange-rates.json
[junit4] 2> 547166 INFO (coreLoadExecutor-2323-thread-1-processing-n:127.0.0.1:41695_q) [n:127.0.0.1:41695_q c:control_collection x:collection1] o.a.s.s.OpenExchangeRatesOrgProvider Reloading exchange rates from open-exchange-rates.json
[junit4] 2> 547167 INFO (coreLoadExecutor-2323-thread-1-processing-n:127.0.0.1:41695_q) [n:127.0.0.1:41695_q c:control_collection x:collection1] o.a.s.c.ConfigSetProperties Did not find ConfigSet properties, assuming default properties: Can't find resource 'configsetprops.json' in classpath or '/configs/conf1', cwd=/home/jenkins/workspace/Lucene-Solr-6.x-Linux/solr/build/solr-core/test/J0
[junit4] 2> 547167 INFO (coreLoadExecutor-2323-thread-1-processing-n:127.0.0.1:41695_q) [n:127.0.0.1:41695_q c:control_collection x:collection1] o.a.s.c.CoreContainer Creating SolrCore 'collection1' using configuration from collection control_collection
[junit4] 2> 547167 INFO (coreLoadExecutor-2323-thread-1-processing-n:127.0.0.1:41695_q) [n:127.0.0.1:41695_q c:control_collection s:shard1 r:core_node1 x:collection1] o.a.s.c.SolrCore org.apache.solr.core.MockDirectoryFactory
[junit4] 2> 547167 INFO (coreLoadExecutor-2323-thread-1-processing-n:127.0.0.1:41695_q) [n:127.0.0.1:41695_q c:control_collection s:shard1 r:core_node1 x:collection1] o.a.s.c.SolrCore [[collection1] ] Opening new SolrCore at [/home/jenkins/workspace/Lucene-Solr-6.x-Linux/solr/build/solr-core/test/J0/temp/solr.cloud.BasicDistributedZkTest_2794DC7CF1ECBA58-001/control-001/cores/collection1], dataDir=[/home/jenkins/workspace/Lucene-Solr-6.x-Linux/solr/build/solr-core/test/J0/../../../../../../../../../home/jenkins/workspace/Lucene-Solr-6.x-Linux/solr/build/solr-core/test/J0/temp/solr.cloud.BasicDistributedZkTest_2794DC7CF1ECBA58-001/control-001/cores/collection1/data/]
[junit4] 2> 547167 INFO (coreLoadExecutor-2323-thread-1-processing-n:127.0.0.1:41695_q) [n:127.0.0.1:41695_q c:control_collection s:shard1 r:core_node1 x:collection1] o.a.s.c.JmxMonitoredMap JMX monitoring is enabled. Adding Solr mbeans to JMX Server: com.sun.jmx.mbeanserver.JmxMBeanServer@478d4c47
[junit4] 2> 547168 INFO (coreLoadExecutor-2323-thread-1-processing-n:127.0.0.1:41695_q) [n:127.0.0.1:41695_q c:control_collection s:shard1 r:core_node1 x:collection1] o.a.s.c.CachingDirectoryFactory return new directory for /home/jenkins/workspace/Lucene-Solr-6.x-Linux/solr/build/solr-core/test/J0/../../../../../../../../../home/jenkins/workspace/Lucene-Solr-6.x-Linux/solr/build/solr-core/test/J0/temp/solr.cloud.BasicDistributedZkTest_2794DC7CF1ECBA58-001/control-001/cores/collection1/data
[junit4] 2> 547168 INFO (coreLoadExecutor-2323-thread-1-processing-n:127.0.0.1:41695_q) [n:127.0.0.1:41695_q c:control_collection s:shard1 r:core_node1 x:collection1] o.a.s.c.SolrCore New index directory detected: old=null new=/home/jenkins/workspace/Lucene-Solr-6.x-Linux/solr/build/solr-core/test/J0/../../../../../../../../../home/jenkins/workspace/Lucene-Solr-6.x-Linux/solr/build/solr-core/test/J0/temp/solr.cloud.BasicDistributedZkTest_2794DC7CF1ECBA58-001/control-001/cores/collection1/data/index/
[junit4] 2> 547168 WARN (coreLoadExecutor-2323-thread-1-processing-n:127.0.0.1:41695_q) [n:127.0.0.1:41695_q c:control_collection s:shard1 r:core_node1 x:collection1] o.a.s.c.SolrCore [collection1] Solr index directory '/home/jenkins/workspace/Lucene-Solr-6.x-Linux/solr/build/solr-core/test/J0/../../../../../../../../../home/jenkins/workspace/Lucene-Solr-6.x-Linux/solr/build/solr-core/test/J0/temp/solr.cloud.BasicDistributedZkTest_2794DC7CF1ECBA58-001/control-001/cores/collection1/data/index' doesn't exist. Creating new index...
[junit4] 2> 547168 INFO (coreLoadExecutor-2323-thread-1-processing-n:127.0.0.1:41695_q) [n:127.0.0.1:41695_q c:control_collection s:shard1 r:core_node1 x:collection1] o.a.s.c.CachingDirectoryFactory return new directory for /home/jenkins/workspace/Lucene-Solr-6.x-Linux/solr/build/solr-core/test/J0/../../../../../../../../../home/jenkins/workspace/Lucene-Solr-6.x-Linux/solr/build/solr-core/test/J0/temp/solr.cloud.BasicDistributedZkTest_2794DC7CF1ECBA58-001/control-001/cores/collection1/data/index
[junit4] 2> 547168 INFO (coreLoadExecutor-2323-thread-1-processing-n:127.0.0.1:41695_q) [n:127.0.0.1:41695_q c:control_collection s:shard1 r:core_node1 x:collection1] o.a.s.u.RandomMergePolicy RandomMergePolicy wrapping class org.apache.lucene.index.AlcoholicMergePolicy: [AlcoholicMergePolicy: minMergeSize=0, mergeFactor=10, maxMergeSize=1656828566, maxMergeSizeForForcedMerge=9223372036854775807, calibrateSizeByDeletes=true, maxMergeDocs=2147483647, maxCFSSegmentSizeMB=8.796093022207999E12, noCFSRatio=0.1]
[junit4] 2> 547169 INFO (coreLoadExecutor-2323-thread-1-processing-n:127.0.0.1:41695_q) [n:127.0.0.1:41695_q c:control_collection s:shard1 r:core_node1 x:collection1] o.a.s.c.SolrDeletionPolicy SolrDeletionPolicy.onCommit: commits: num=1
[junit4] 2> commit{dir=MockDirectoryWrapper(NIOFSDirectory@/home/jenkins/workspace/Lucene-Solr-6.x-Linux/solr/build/solr-core/test/J0/temp/solr.cloud.BasicDistributedZkTest_2794DC7CF1ECBA58-001/index-NIOFSDirectory-001 lockFactory=org.apache.lucene.store.NativeFSLockFactory@746ebca5),segFN=segments_1,generation=1}
[junit4] 2> 547169 INFO (coreLoadExecutor-2323-thread-1-processing-n:127.0.0.1:41695_q) [n:127.0.0.1:41695_q c:control_collection s:shard1 r:core_node1 x:collection1] o.a.s.c.SolrDeletionPolicy newest commit generation = 1
[junit4] 2> 547170 INFO (OldIndexDirectoryCleanupThreadForCore-collection1) [n:127.0.0.1:41695_q c:control_collection s:shard1 r:core_node1 x:collection1] o.a.s.c.SolrCore Looking for old index directories to cleanup for core collection1 in /home/jenkins/workspace/Lucene-Solr-6.x-Linux/solr/build/solr-core/test/J0/../../../../../../../../../home/jenkins/workspace/Lucene-Solr-6.x-Linux/solr/build/solr-core/test/J0/temp/solr.cloud.BasicDistributedZkTest_2794DC7CF1ECBA58-001/control-001/cores/collection1/data/
[junit4] 2> 547170 WARN (OldIndexDirectoryCleanupThreadForCore-collection1) [n:127.0.0.1:41695_q c:control_collection s:shard1 r:core_node1 x:collection1] o.a.s.c.DirectoryFactory /home/jenkins/workspace/Lucene-Solr-6.x-Linux/solr/build/solr-core/test/J0/../../../../../../../../../home/jenkins/workspace/Lucene-Solr-6.x-Linux/solr/build/solr-core/test/J0/temp/solr.cloud.BasicDistributedZkTest_2794DC7CF1ECBA58-001/control-001/cores/collection1/data/ does not point to a valid data directory; skipping clean-up of old index directories.
[junit4] 2> 547172 INFO (coreLoadExecutor-2323-thread-1-processing-n:127.0.0.1:41695_q) [n:127.0.0.1:41695_q c:control_collection s:shard1 r:core_node1 x:collection1] o.a.s.u.p.UpdateRequestProcessorChain creating updateRequestProcessorChain "nodistrib"
[junit4] 2> 547172 INFO (coreLoadExecutor-2323-thread-1-processing-n:127.0.0.1:41695_q) [n:127.0.0.1:41695_q c:control_collection s:shard1 r:core_node1 x:collection1] o.a.s.u.p.UpdateRequestProcessorChain creating updateRequestProcessorChain "dedupe"
[junit4] 2> 547172 INFO (coreLoadExecutor-2323-thread-1-processing-n:127.0.0.1:41695_q) [n:127.0.0.1:41695_q c:control_collection s:shard1 r:core_node1 x:collection1] o.a.s.u.p.UpdateRequestProcessorChain inserting DistributedUpdateProcessorFactory into updateRequestProcessorChain "dedupe"
[junit4] 2> 547172 INFO (coreLoadExecutor-2323-thread-1-processing-n:127.0.0.1:41695_q) [n:127.0.0.1:41695_q c:control_collection s:shard1 r:core_node1 x:collection1] o.a.s.u.p.UpdateRequestProcessorChain creating updateRequestProcessorChain "stored_sig"
[junit4] 2> 547172 INFO (coreLoadExecutor-2323-thread-1-processing-n:127.0.0.1:41695_q) [n:127.0.0.1:41695_q c:control_collection s:shard1 r:core_node1 x:collection1] o.a.s.u.p.UpdateRequestProcessorChain inserting DistributedUpdateProcessorFactory into updateRequestProcessorChain "stored_sig"
[junit4] 2> 547172 INFO (coreLoadExecutor-2323-thread-1-processing-n:127.0.0.1:41695_q) [n:127.0.0.1:41695_q c:control_collection s:shard1 r:core_node1 x:collection1] o.a.s.u.p.UpdateRequestProcessorChain creating updateRequestProcessorChain "distrib-dup-test-chain-explicit"
[junit4] 2> 547172 INFO (coreLoadExecutor-2323-thread-1-processing-n:127.0.0.1:41695_q) [n:127.0.0.1:41695_q c:control_collection s:shard1 r:core_node1 x:collection1] o.a.s.u.p.UpdateRequestProcessorChain creating updateRequestProcessorChain "distrib-dup-test-chain-implicit"
[junit4] 2> 547172 INFO (coreLoadExecutor-2323-thread-1-processing-n:127.0.0.1:41695_q) [n:127.0.0.1:41695_q c:control_collection s:shard1 r:core_node1 x:collection1] o.a.s.u.p.UpdateRequestProcessorChain inserting DistributedUpdateProcessorFactory into updateRequestProcessorChain "distrib-dup-test-chain-implicit"
[junit4] 2> 547172 INFO (coreLoadExecutor-2323-thread-1-processing-n:127.0.0.1:41695_q) [n:127.0.0.1:41695_q c:control_collection s:shard1 r:core_node1 x:collection1] o.a.s.c.SolrCore no updateRequestProcessorChain defined as default, creating implicit default
[junit4] 2> 547172 WARN (coreLoadExecutor-2323-thread-1-processing-n:127.0.0.1:41695_q) [n:127.0.0.1:41695_q c:control_collection s:shard1 r:core_node1 x:collection1] o.a.s.c.RequestHandlers INVALID paramSet a in requestHandler {type = requestHandler,name = /dump,class = DumpRequestHandler,args = {defaults={a=A,b=B}}}
[junit4] 2> 547173 INFO (coreLoadExecutor-2323-thread-1-processing-n:127.0.0.1:41695_q) [n:127.0.0.1:41695_q c:control_collection s:shard1 r:core_node1 x:collection1] o.a.s.h.l.XMLLoader xsltCacheLifetimeSeconds=60
[junit4] 2> 547174 INFO (coreLoadExecutor-2323-thread-1-processing-n:127.0.0.1:41695_q) [n:127.0.0.1:41695_q c:control_collection s:shard1 r:core_node1 x:collection1] o.a.s.h.l.XMLLoader xsltCacheLifetimeSeconds=60
[junit4] 2> 547175 INFO (coreLoadExecutor-2323-thread-1-processing-n:127.0.0.1:41695_q) [n:127.0.0.1:41695_q c:control_collection s:shard1 r:core_node1 x:collection1] o.a.s.h.l.XMLLoader xsltCacheLifetimeSeconds=60
[junit4] 2> 547175 INFO (coreLoadExecutor-2323-thread-1-processing-n:127.0.0.1:41695_q) [n:127.0.0.1:41695_q c:control_collection s:shard1 r:core_node1 x:collection1] o.a.s.h.l.XMLLoader xsltCacheLifetimeSeconds=60
[junit4] 2> 547176 INFO (coreLoadExecutor-2323-thread-1-processing-n:127.0.0.1:41695_q) [n:127.0.0.1:41695_q c:control_collection s:shard1 r:core_node1 x:collection1] o.a.s.c.RequestHandlers Registered paths: /admin/mbeans,standard,/dump,/update/csv,/sql,/update/json/docs,/admin/luke,/export,/admin/segments,/get,/admin/system,/replication,/admin/properties,/config,/stream,/schema,/admin/plugins,/admin/logging,/update/json,/admin/ping,/admin/threads,/update,/admin/file
[junit4] 2> 547176 INFO (coreLoadExecutor-2323-thread-1-processing-n:127.0.0.1:41695_q) [n:127.0.0.1:41695_q c:control_collection s:shard1 r:core_node1 x:collection1] o.a.s.c.SolrCore Using default statsCache cache: org.apache.solr.search.stats.LocalStatsCache
[junit4] 2> 547177 INFO (coreLoadExecutor-2323-thread-1-processing-n:127.0.0.1:41695_q) [n:127.0.0.1:41695_q c:control_collection s:shard1 r:core_node1 x:collection1] o.a.s.u.UpdateHandler Using UpdateLog implementation: org.apache.solr.update.UpdateLog
[junit4] 2> 547177 INFO (coreLoadExecutor-2323-thread-1-processing-n:127.0.0.1:41695_q) [n:127.0.0.1:41695_q c:control_collection s:shard1 r:core_node1 x:collection1] o.a.s.u.UpdateLog Initializing UpdateLog: dataDir= defaultSyncLevel=FLUSH numRecordsToKeep=100 maxNumLogsToKeep=10 numVersionBuckets=65536
[junit4] 2> 547177 INFO (coreLoadExecutor-2323-thread-1-processing-n:127.0.0.1:41695_q) [n:127.0.0.1:41695_q c:control_collection s:shard1 r:core_node1 x:collection1] o.a.s.u.CommitTracker Hard AutoCommit: disabled
[junit4] 2> 547177 INFO (coreLoadExecutor-2323-thread-1-processing-n:127.0.0.1:41695_q) [n:127.0.0.1:41695_q c:control_collection s:shard1 r:core_node1 x:collection1] o.a.s.u.CommitTracker Soft AutoCommit: disabled
[junit4] 2> 547177 INFO (coreLoadExecutor-2323-thread-1-processing-n:127.0.0.1:41695_q) [n:127.0.0.1:41695_q c:control_collection s:shard1 r:core_node1 x:collection1] o.a.s.u.RandomMergePolicy RandomMergePolicy wrapping class org.apache.lucene.index.TieredMergePolicy: [TieredMergePolicy: maxMergeAtOnce=50, maxMergeAtOnceExplicit=13, maxMergedSegmentMB=91.560546875, floorSegmentMB=1.6650390625, forceMergeDeletesPctAllowed=4.565071238338408, segmentsPerTier=50.0, maxCFSSegmentSizeMB=8.796093022207999E12, noCFSRatio=0.0
[junit4] 2> 547178 INFO (coreLoadExecutor-2323-thread-1-processing-n:127.0.0.1:41695_q) [n:127.0.0.1:41695_q c:control_collection s:shard1 r:core_node1 x:collection1] o.a.s.c.SolrDeletionPolicy SolrDeletionPolicy.onInit: commits: num=1
[junit4] 2> commit{dir=MockDirectoryWrapper(NIOFSDirectory@/home/jenkins/workspace/Lucene-Solr-6.x-Linux/solr/build/solr-core/test/J0/temp/solr.cloud.BasicDistributedZkTest_2794DC7CF1ECBA58-001/index-NIOFSDirectory-001 lockFactory=org.apache.lucene.store.NativeFSLockFactory@746ebca5),segFN=segments_1,generation=1}
[junit4] 2> 547178 INFO (coreLoadExecutor-2323-thread-1-processing-n:127.0.0.1:41695_q) [n:127.0.0.1:41695_q c:control_collection s:shard1 r:core_node1 x:collection1] o.a.s.c.SolrDeletionPolicy newest commit generation = 1
[junit4] 2> 547178 INFO (coreLoadExecutor-2323-thread-1-processing-n:127.0.0.1:41695_q) [n:127.0.0.1:41695_q c:control_collection s:shard1 r:core_node1 x:collection1] o.a.s.s.SolrIndexSearcher Opening [Searcher@713001e7[collection1] main]
[junit4] 2> 547178 INFO (coreLoadExecutor-2323-thread-1-processing-n:127.0.0.1:41695_q) [n:127.0.0.1:41695_q c:control_collection s:shard1 r:core_node1 x:collection1] o.a.s.c.c.ZkStateReader Load collection config from: [/collections/control_collection]
[junit4] 2> 547179 INFO (coreLoadExecutor-2323-thread-1-processing-n:127.0.0.1:41695_q) [n:127.0.0.1:41695_q c:control_collection s:shard1 r:core_node1 x:collection1] o.a.s.c.c.ZkStateReader path=[/collections/control_collection] [configName]=[conf1] specified config exists in ZooKeeper
[junit4] 2> 547179 INFO (coreLoadExecutor-2323-thread-1-processing-n:127.0.0.1:41695_q) [n:127.0.0.1:41695_q c:control_collection s:shard1 r:core_node1 x:collection1] o.a.s.r.ManagedResourceStorage Setting up ZooKeeper-based storage for the RestManager with znodeBase: /configs/conf1
[junit4] 2> 547179 INFO (coreLoadExecutor-2323-thread-1-processing-n:127.0.0.1:41695_q) [n:127.0.0.1:41695_q c:control_collection s:shard1 r:core_node1 x:collection1] o.a.s.r.ManagedResourceStorage Configured ZooKeeperStorageIO with znodeBase: /configs/conf1
[junit4] 2> 547179 INFO (coreLoadExecutor-2323-thread-1-processing-n:127.0.0.1:41695_q) [n:127.0.0.1:41695_q c:control_collection s:shard1 r:core_node1 x:collection1] o.a.s.r.RestManager Initializing RestManager with initArgs: {}
[junit4] 2> 547179 INFO (coreLoadExecutor-2323-thread-1-processing-n:127.0.0.1:41695_q) [n:127.0.0.1:41695_q c:control_collection s:shard1 r:core_node1 x:collection1] o.a.s.r.ManagedResourceStorage Reading _rest_managed.json using ZooKeeperStorageIO:path=/configs/conf1
[junit4] 2> 547179 INFO (coreLoadExecutor-2323-thread-1-processing-n:127.0.0.1:41695_q) [n:127.0.0.1:41695_q c:control_collection s:shard1 r:core_node1 x:collection1] o.a.s.r.ManagedResourceStorage No data found for znode /configs/conf1/_rest_managed.json
[junit4] 2> 547179 INFO (coreLoadExecutor-2323-thread-1-processing-n:127.0.0.1:41695_q) [n:127.0.0.1:41695_q c:control_collection s:shard1 r:core_node1 x:collection1] o.a.s.r.ManagedResourceStorage Loaded null at path _rest_managed.json using ZooKeeperStorageIO:path=/configs/conf1
[junit4] 2> 547179 INFO (coreLoadExecutor-2323-thread-1-processing-n:127.0.0.1:41695_q) [n:127.0.0.1:41695_q c:control_collection s:shard1 r:core_node1 x:collection1] o.a.s.r.RestManager Initializing 0 registered ManagedResources
[junit4] 2> 547179 INFO (coreLoadExecutor-2323-thread-1-processing-n:127.0.0.1:41695_q) [n:127.0.0.1:41695_q c:control_collection s:shard1 r:core_node1 x:collection1] o.a.s.h.ReplicationHandler Commits will be reserved for 10000
[junit4] 2> 547180 INFO (searcherExecutor-2324-thread-1-processing-n:127.0.0.1:41695_q x:collection1 s:shard1 c:control_collection r:core_node1) [n:127.0.0.1:41695_q c:control_collection s:shard1 r:core_node1 x:collection1] o.a.s.c.SolrCore [collection1] Registered new searcher Searcher@713001e7[collection1] main{ExitableDirectoryReader(UninvertingDirectoryReader())}
[junit4] 2> 547180 INFO (coreLoadExecutor-2323-thread-1-processing-n:127.0.0.1:41695_q) [n:127.0.0.1:41695_q c:control_collection s:shard1 r:core_node1 x:collection1] o.a.s.u.UpdateLog Looking up max value of version field to seed version buckets
[junit4] 2> 547180 INFO (coreLoadExecutor-2323-thread-1-processing-n:127.0.0.1:41695_q) [n:127.0.0.1:41695_q c:control_collection s:shard1 r:core_node1 x:collection1] o.a.s.u.VersionInfo Refreshing highest value of _version_ for 65536 version buckets from index
[junit4] 2> 547180 INFO (coreLoadExecutor-2323-thread-1-processing-n:127.0.0.1:41695_q) [n:127.0.0.1:41695_q c:control_collection s:shard1 r:core_node1 x:collection1] o.a.s.u.VersionInfo No terms found for _version_, cannot seed version bucket highest value from index
[junit4] 2> 547180 INFO (coreLoadExecutor-2323-thread-1-processing-n:127.0.0.1:41695_q) [n:127.0.0.1:41695_q c:control_collection s:shard1 r:core_node1 x:collection1] o.a.s.u.UpdateLog Could not find max version in index or recent updates, using new clock 1530711138749120512
[junit4] 2> 547181 INFO (coreLoadExecutor-2323-thread-1-processing-n:127.0.0.1:41695_q) [n:127.0.0.1:41695_q c:control_collection s:shard1 r:core_node1 x:collection1] o.a.s.u.UpdateLog Took 1.0ms to seed version buckets with highest version 1530711138749120512
[junit4] 2> 547181 INFO (coreLoadExecutor-2323-thread-1-processing-n:127.0.0.1:41695_q) [n:127.0.0.1:41695_q c:control_collection s:shard1 r:core_node1 x:collection1] o.a.s.c.ZkController watch zkdir /configs/conf1
[junit4] 2> 547182 INFO (coreLoadExecutor-2323-thread-1-processing-n:127.0.0.1:41695_q) [n:127.0.0.1:41695_q c:control_collection s:shard1 r:core_node1 x:collection1] o.a.s.c.CoreContainer registering core: collection1
[junit4] 2> 547182 INFO (coreZkRegister-2317-thread-1-processing-n:127.0.0.1:41695_q x:collection1 s:shard1 c:control_collection r:core_node1) [n:127.0.0.1:41695_q c:control_collection s:shard1 r:core_node1 x:collection1] o.a.s.c.ZkController Register replica - core:collection1 address:http://127.0.0.1:41695/q collection:control_collection shard:shard1
[junit4] 2> 547182 INFO (coreZkRegister-2317-thread-1-processing-n:127.0.0.1:41695_q x:collection1 s:shard1 c:control_collection r:core_node1) [n:127.0.0.1:41695_q c:control_collection s:shard1 r:core_node1 x:collection1] o.a.s.c.c.SolrZkClient makePath: /collections/control_collection/leader_elect/shard1/election
[junit4] 2> 547183 INFO (coreZkRegister-2317-thread-1-processing-n:127.0.0.1:41695_q x:collection1 s:shard1 c:control_collection r:core_node1) [n:127.0.0.1:41695_q c:control_collection s:shard1 r:core_node1 x:collection1] o.a.s.c.LeaderElector Joined leadership election with path: /collections/control_collection/leader_elect/shard1/election/95669446086426628-core_node1-n_0000000000
[junit4] 2> 547183 INFO (coreZkRegister-2317-thread-1-processing-n:127.0.0.1:41695_q x:collection1 s:shard1 c:control_collection r:core_node1) [n:127.0.0.1:41695_q c:control_collection s:shard1 r:core_node1 x:collection1] o.a.s.c.ShardLeaderElectionContext Running the leader process for shard=shard1 and weAreReplacement=false and leaderVoteWait=10000
[junit4] 2> 547184 INFO (coreZkRegister-2317-thread-1-processing-n:127.0.0.1:41695_q x:collection1 s:shard1 c:control_collection r:core_node1) [n:127.0.0.1:41695_q c:control_collection s:shard1 r:core_node1 x:collection1] o.a.s.c.ShardLeaderElectionContext Enough replicas found to continue.
[junit4] 2> 547184 INFO (coreZkRegister-2317-thread-1-processing-n:127.0.0.1:41695_q x:collection1 s:shard1 c:control_collection r:core_node1) [n:127.0.0.1:41695_q c:control_collection s:shard1 r:core_node1 x:collection1] o.a.s.c.ShardLeaderElectionContext I may be the new leader - try and sync
[junit4] 2> 547184 INFO (coreZkRegister-2317-thread-1-processing-n:127.0.0.1:41695_q x:collection1 s:shard1 c:control_collection r:core_node1) [n:127.0.0.1:41695_q c:control_collection s:shard1 r:core_node1 x:collection1] o.a.s.c.SyncStrategy Sync replicas to http://127.0.0.1:41695/q/collection1/
[junit4] 2> 547184 INFO (coreZkRegister-2317-thread-1-processing-n:127.0.0.1:41695_q x:collection1 s:shard1 c:control_collection r:core_node1) [n:127.0.0.1:41695_q c:control_collection s:shard1 r:core_node1 x:collection1] o.a.s.c.SyncStrategy Sync Success - now sync replicas to me
[junit4] 2> 547184 INFO (OverseerStateUpdate-95669446086426628-127.0.0.1:41695_q-n_0000000000) [n:127.0.0.1:41695_q ] o.a.s.c.Overseer processMessage: queueSize: 1, message = {
[junit4] 2> "operation":"leader",
[junit4] 2> "shard":"shard1",
[junit4] 2> "collection":"control_collection"} current state version: 1
[junit4] 2> 547184 INFO (coreZkRegister-2317-thread-1-processing-n:127.0.0.1:41695_q x:collection1 s:shard1 c:control_collection r:core_node1) [n:127.0.0.1:41695_q c:control_collection s:shard1 r:core_node1 x:collection1] o.a.s.c.SyncStrategy http://127.0.0.1:41695/q/collection1/ has no replicas
[junit4] 2> 547184 INFO (coreZkRegister-2317-thread-1-processing-n:127.0.0.1:41695_q x:collection1 s:shard1 c:control_collection r:core_node1) [n:127.0.0.1:41695_q c:control_collection s:shard1 r:core_node1 x:collection1] o.a.s.c.c.SolrZkClient makePath: /collections/control_collection/leaders/shard1
[junit4] 2> 547185 INFO (coreZkRegister-2317-thread-1-processing-n:127.0.0.1:41695_q x:collection1 s:shard1 c:control_collection r:core_node1) [n:127.0.0.1:41695_q c:control_collection s:shard1 r:core_node1 x:collection1] o.a.s.c.ShardLeaderElectionContextBase Creating leader registration node /collections/control_collection/leaders/shard1/leader after winning as /collections/control_collection/leader_elect/shard1/election/95669446086426628-core_node1-n_0000000000
[junit4] 2> 547185 INFO (coreZkRegister-2317-thread-1-processing-n:127.0.0.1:41695_q x:collection1 s:shard1 c:control_collection r:core_node1) [n:127.0.0.1:41695_q c:control_collection s:shard1 r:core_node1 x:collection1] o.a.s.c.ShardLeaderElectionContext I am the new leader: http://127.0.0.1:41695/q/collection1/ shard1
[junit4] 2> 547185 INFO (OverseerStateUpdate-95669446086426628-127.0.0.1:41695_q-n_0000000000) [n:127.0.0.1:41695_q ] o.a.s.c.Overseer processMessage: queueSize: 1, message = {
[junit4] 2> "operation":"leader",
[junit4] 2> "shard":"shard1",
[junit4] 2> "collection":"control_collection",
[junit4] 2> "base_url":"http://127.0.0.1:41695/q",
[junit4] 2> "core":"collection1",
[junit4] 2> "state":"active"} current state version: 1
[junit4] 2> 547287 INFO (zkCallback-669-thread-1-processing-n:127.0.0.1:41695_q) [n:127.0.0.1:41695_q ] o.a.s.c.c.ZkStateReader A cluster state change: [WatchedEvent state:SyncConnected type:NodeDataChanged path:/clusterstate.json], has occurred - updating... (live nodes size: [1])
[junit4] 2> 547336 INFO (coreZkRegister-2317-thread-1-processing-n:127.0.0.1:41695_q x:collection1 s:shard1 c:control_collection r:core_node1) [n:127.0.0.1:41695_q c:control_collection s:shard1 r:core_node1 x:collection1] o.a.s.c.ZkController We are http://127.0.0.1:41695/q/collection1/ and leader is http://127.0.0.1:41695/q/collection1/
[junit4] 2> 547336 INFO (coreZkRegister-2317-thread-1-processing-n:127.0.0.1:41695_q x:collection1 s:shard1 c:control_collection r:core_node1) [n:127.0.0.1:41695_q c:control_collection s:shard1 r:core_node1 x:collection1] o.a.s.c.ZkController No LogReplay needed for core=collection1 baseURL=http://127.0.0.1:41695/q
[junit4] 2> 547336 INFO (coreZkRegister-2317-thread-1-processing-n:127.0.0.1:41695_q x:collection1 s:shard1 c:control_collection r:core_node1) [n:127.0.0.1:41695_q c:control_collection s:shard1 r:core_node1 x:collection1] o.a.s.c.ZkController I am the leader, no recovery necessary
[junit4] 2> 547336 INFO (coreZkRegister-2317-thread-1-processing-n:127.0.0.1:41695_q x:collection1 s:shard1 c:control_collection r:core_node1) [n:127.0.0.1:41695_q c:control_collection s:shard1 r:core_node1 x:collection1] o.a.s.c.ZkController publishing state=active
[junit4] 2> 547336 INFO (coreZkRegister-2317-thread-1-processing-n:127.0.0.1:41695_q x:collection1 s:shard1 c:control_collection r:core_node1) [n:127.0.0.1:41695_q c:control_collection s:shard1 r:core_node1 x:collection1] o.a.s.c.ZkController numShards not found on descriptor - reading it from system property
[junit4] 2> 547337 INFO (OverseerStateUpdate-95669446086426628-127.0.0.1:41695_q-n_0000000000) [n:127.0.0.1:41695_q ] o.a.s.c.Overseer processMessage: queueSize: 1, message = {
[junit4] 2> "core":"collection1",
[junit4] 2> "core_node_name":"core_node1",
[junit4] 2> "roles":null,
[junit4] 2> "base_url":"http://127.0.0.1:41695/q",
[junit4] 2> "node_name":"127.0.0.1:41695_q",
[junit4] 2> "numShards":"1",
[junit4] 2> "state":"active",
[junit4] 2> "shard":"shard1",
[junit4] 2> "collection":"control_collection",
[junit4] 2> "operation":"state"} current state version: 2
[junit4] 2> 547337 INFO (OverseerStateUpdate-95669446086426628-127.0.0.1:41695_q-n_0000000000) [n:127.0.0.1:41695_q ] o.a.s.c.o.ReplicaMutator Update state numShards=1 message={
[junit4] 2> "core":"collection1",
[junit4] 2> "core_node_name":"core_node1",
[junit4] 2> "roles":null,
[junit4] 2> "base_url":"http://127.0.0.1:41695/q",
[junit4] 2> "node_name":"127.0.0.1:41695_q",
[junit4] 2> "numShards":"1",
[junit4] 2> "state":"active",
[junit4] 2> "shard":"shard1",
[junit4] 2> "collection":"control_collection",
[junit4] 2> "operation":"state"}
[junit4] 2> 547438 INFO (zkCallback-669-thread-1-processing-n:127.0.0.1:41695_q) [n:127.0.0.1:41695_q ] o.a.s.c.c.ZkStateReader A cluster state change: [WatchedEvent state:SyncConnected type:NodeDataChanged path:/clusterstate.json], has occurred - updating... (live nodes size: [1])
[junit4] 2> 547575 INFO (TEST-BasicDistributedZkTest.test-seed#[2794DC7CF1ECBA58]) [ ] o.a.s.c.c.SolrZkClient Using default ZkCredentialsProvider
[junit4] 2> 547576 INFO (TEST-BasicDistributedZkTest.test-seed#[2794DC7CF1ECBA58]) [ ] o.a.s.c.c.ConnectionManager Waiting for client to connect to ZooKeeper
[junit4] 2> 547576 INFO (zkCallback-671-thread-1) [ ] o.a.s.c.c.ConnectionManager Watcher org.apache.solr.common.cloud.ConnectionManager@302b888b name:ZooKeeperConnection Watcher:127.0.0.1:33185/solr got event WatchedEvent state:SyncConnected type:None path:null path:null type:None
[junit4] 2> 547576 INFO (TEST-BasicDistributedZkTest.test-seed#[2794DC7CF1ECBA58]) [ ] o.a.s.c.c.ConnectionManager Client is connected to ZooKeeper
[junit4] 2> 547577 INFO (TEST-BasicDistributedZkTest.test-seed#[2794DC7CF1ECBA58]) [ ] o.a.s.c.c.SolrZkClient Using default ZkACLProvider
[junit4] 2> 547577 INFO (TEST-BasicDistributedZkTest.test-seed#[2794DC7CF1ECBA58]) [ ] o.a.s.c.c.ZkStateReader Updating cluster state from ZooKeeper...
[junit4] 2> 547577 INFO (TEST-BasicDistributedZkTest.test-seed#[2794DC7CF1ECBA58]) [ ] o.a.s.c.c.ZkStateReader Updated live nodes from ZooKeeper... (0) -> (1)
[junit4] 2> 547577 INFO (TEST-BasicDistributedZkTest.test-seed#[2794DC7CF1ECBA58]) [ ] o.a.s.c.ChaosMonkey monkey: init - expire sessions:false cause connection loss:false
[junit4] 2> 547633 INFO (TEST-BasicDistributedZkTest.test-seed#[2794DC7CF1ECBA58]) [ ] o.a.s.SolrTestCaseJ4 Writing core.properties file to /home/jenkins/workspace/Lucene-Solr-6.x-Linux/solr/build/solr-core/test/J0/temp/solr.cloud.BasicDistributedZkTest_2794DC7CF1ECBA58-001/shard-1-001/cores/collection1
[junit4] 2> 547633 INFO (TEST-BasicDistributedZkTest.test-seed#[2794DC7CF1ECBA58]) [ ] o.a.s.c.AbstractFullDistribZkTestBase create jetty 1 in directory /home/jenkins/workspace/Lucene-Solr-6.x-Linux/solr/build/solr-core/test/J0/temp/solr.cloud.BasicDistributedZkTest_2794DC7CF1ECBA58-001/shard-1-001
[junit4] 2> 547634 INFO (TEST-BasicDistributedZkTest.test-seed#[2794DC7CF1ECBA58]) [ ] o.e.j.s.Server jetty-9.3.8.v20160314
[junit4] 2> 547635 INFO (TEST-BasicDistributedZkTest.test-seed#[2794DC7CF1ECBA58]) [ ] o.e.j.s.h.ContextHandler Started o.e.j.s.ServletContextHandler@418b2b28{/q,null,AVAILABLE}
[junit4] 2> 547635 INFO (TEST-BasicDistributedZkTest.test-seed#[2794DC7CF1ECBA58]) [ ] o.e.j.s.ServerConnector Started ServerConnector@45c08829{HTTP/1.1,[http/1.1]}{127.0.0.1:46196}
[junit4] 2> 547636 INFO (TEST-BasicDistributedZkTest.test-seed#[2794DC7CF1ECBA58]) [ ] o.e.j.s.Server Started @549227ms
[junit4] 2> 547636 INFO (TEST-BasicDistributedZkTest.test-seed#[2794DC7CF1ECBA58]) [ ] o.a.s.c.s.e.JettySolrRunner Jetty properties: {solr.data.dir=/home/jenkins/workspace/Lucene-Solr-6.x-Linux/solr/build/solr-core/test/J0/temp/solr.cloud.BasicDistributedZkTest_2794DC7CF1ECBA58-001/tempDir-001/jetty1, solrconfig=solrconfig.xml, hostContext=/q, hostPort=46196, coreRootDirectory=/home/jenkins/workspace/Lucene-Solr-6.x-Linux/solr/build/solr-core/test/J0/../../../../../../../../../home/jenkins/workspace/Lucene-Solr-6.x-Linux/solr/build/solr-core/test/J0/temp/solr.cloud.BasicDistributedZkTest_2794DC7CF1ECBA58-001/shard-1-001/cores}
[junit4] 2> 547636 INFO (TEST-BasicDistributedZkTest.test-seed#[2794DC7CF1ECBA58]) [ ] o.a.s.s.SolrDispatchFilter SolrDispatchFilter.init(): sun.misc.Launcher$AppClassLoader@73d16e93
[junit4] 2> 547636 INFO (TEST-BasicDistributedZkTest.test-seed#[2794DC7CF1ECBA58]) [ ] o.a.s.c.SolrResourceLoader new SolrResourceLoader for directory: '/home/jenkins/workspace/Lucene-Solr-6.x-Linux/solr/build/solr-core/test/J0/temp/solr.cloud.BasicDistributedZkTest_2794DC7CF1ECBA58-001/shard-1-001'
[junit4] 2> 547636 INFO (TEST-BasicDistributedZkTest.test-seed#[2794DC7CF1ECBA58]) [ ] o.a.s.c.SolrResourceLoader JNDI not configured for solr (NoInitialContextEx)
[junit4] 2> 547636 INFO (TEST-BasicDistributedZkTest.test-seed#[2794DC7CF1ECBA58]) [ ] o.a.s.c.SolrResourceLoader solr home defaulted to 'solr/' (could not find system property or JNDI)
[junit4] 2> 547636 INFO (TEST-BasicDistributedZkTest.test-seed#[2794DC7CF1ECBA58]) [ ] o.a.s.c.c.SolrZkClient Using default ZkCredentialsProvider
[junit4] 2> 547637 INFO (TEST-BasicDistributedZkTest.test-seed#[2794DC7CF1ECBA58]) [ ] o.a.s.c.c.ConnectionManager Waiting for client to connect to ZooKeeper
[junit4] 2> 547637 INFO (zkCallback-672-thread-1) [ ] o.a.s.c.c.ConnectionManager Watcher org.apache.solr.common.cloud.ConnectionManager@1bd55bc2 name:ZooKeeperConnection Watcher:127.0.0.1:33185/solr got event WatchedEvent state:SyncConnected type:None path:null path:null type:None
[junit4] 2> 547637 INFO (TEST-BasicDistributedZkTest.test-seed#[2794DC7CF1ECBA58]) [ ] o.a.s.c.c.ConnectionManager Client is connected to ZooKeeper
[junit4] 2> 547638 INFO (TEST-BasicDistributedZkTest.test-seed#[2794DC7CF1ECBA58]) [ ] o.a.s.c.c.SolrZkClient Using default ZkACLProvider
[junit4] 2> 547638 INFO (TEST-BasicDistributedZkTest.test-seed#[2794DC7CF1ECBA58]) [ ] o.a.s.s.SolrDispatchFilter Loading solr.xml from SolrHome (not found in ZooKeeper)
[junit4] 2> 547638 INFO (TEST-BasicDistributedZkTest.test-seed#[2794DC7CF1ECBA58]) [ ] o.a.s.c.SolrXmlConfig Loading container configuration from /home/jenkins/workspace/Lucene-Solr-6.x-Linux/solr/build/solr-core/test/J0/temp/solr.cloud.BasicDistributedZkTest_2794DC7CF1ECBA58-001/shard-1-001/solr.xml
[junit4] 2> 547641 INFO (TEST-BasicDistributedZkTest.test-seed#[2794DC7CF1ECBA58]) [ ] o.a.s.c.CorePropertiesLocator Config-defined core root directory: /home/jenkins/workspace/Lucene-Solr-6.x-Linux/solr/build/solr-core/test/J0/../../../../../../../../../home/jenkins/workspace/Lucene-Solr-6.x-Linux/solr/build/solr-core/test/J0/temp/solr.cloud.BasicDistributedZkTest_2794DC7CF1ECBA58-001/shard-1-001/cores
[junit4] 2> 547641 INFO (TEST-BasicDistributedZkTest.test-seed#[2794DC7CF1ECBA58]) [ ] o.a.s.c.CoreContainer New CoreContainer 1448564802
[junit4] 2> 547641 INFO (TEST-BasicDistributedZkTest.test-seed#[2794DC7CF1ECBA58]) [ ] o.a.s.c.CoreContainer Loading cores into CoreContainer [instanceDir=/home/jenkins/workspace/Lucene-Solr-6.x-Linux/solr/build/solr-core/test/J0/temp/solr.cloud.BasicDistributedZkTest_2794DC7CF1ECBA58-001/shard-1-001]
[junit4] 2> 547641 WARN (TEST-BasicDistributedZkTest.test-seed#[2794DC7CF1ECBA58]) [ ] o.a.s.c.CoreContainer Couldn't add files from /home/jenkins/workspace/Lucene-Solr-6.x-Linux/solr/build/solr-core/test/J0/temp/solr.cloud.BasicDistributedZkTest_2794DC7CF1ECBA58-001/shard-1-001/lib to classpath: /home/jenkins/workspace/Lucene-Solr-6.x-Linux/solr/build/solr-core/test/J0/temp/solr.cloud.BasicDistributedZkTest_2794DC7CF1ECBA58-001/shard-1-001/lib
[junit4] 2> 547641 INFO (TEST-BasicDistributedZkTest.test-seed#[2794DC7CF1ECBA58]) [ ] o.a.s.h.c.HttpShardHandlerFactory created with socketTimeout : 90000,urlScheme : ,connTimeout : 15000,maxConnectionsPerHost : 20,maxConnections : 10000,corePoolSize : 0,maximumPoolSize : 2147483647,maxThreadIdleTime : 5,sizeOfQueue : -1,fairnessPolicy : false,useRetries : false,
[junit4] 2> 547642 INFO (TEST-BasicDistributedZkTest.test-seed#[2794DC7CF1ECBA58]) [ ] o.a.s.u.UpdateShardHandler Creating UpdateShardHandler HTTP client with params: socketTimeout=340000&connTimeout=45000&retry=true
[junit4] 2> 547642 INFO (TEST-BasicDistributedZkTest.test-seed#[2794DC7CF1ECBA58]) [ ] o.a.s.l.LogWatcher SLF4J impl is org.slf4j.impl.Log4jLoggerFactory
[junit4] 2> 547642 INFO (TEST-BasicDistributedZkTest.test-seed#[2794DC7CF1ECBA58]) [ ] o.a.s.l.LogWatcher Registering Log Listener [Log4j (org.slf4j.impl.Log4jLoggerFactory)]
[junit4] 2> 547642 INFO (TEST-BasicDistributedZkTest.test-seed#[2794DC7CF1ECBA58]) [ ] o.a.s.c.ZkContainer Zookeeper client=127.0.0.1:33185/solr
[junit4] 2> 547642 INFO (TEST-BasicDistributedZkTest.test-seed#[2794DC7CF1ECBA58]) [ ] o.a.s.c.ZkController zkHost includes chroot
[junit4] 2> 547643 INFO (TEST-BasicDistributedZkTest.test-seed#[2794DC7CF1ECBA58]) [ ] o.a.s.c.c.SolrZkClient Using default ZkCredentialsProvider
[junit4] 2> 547643 INFO (TEST-BasicDistributedZkTest.test-seed#[2794DC7CF1ECBA58]) [ ] o.a.s.c.c.ConnectionManager Waiting for client to connect to ZooKeeper
[junit4] 2> 547643 INFO (zkCallback-675-thread-1) [ ] o.a.s.c.c.ConnectionManager Watcher org.apache.solr.common.cloud.ConnectionManager@ecd6441 name:ZooKeeperConnection Watcher:127.0.0.1:33185 got event WatchedEvent state:SyncConnected type:None path:null path:null type:None
[junit4] 2> 547644 INFO (TEST-BasicDistributedZkTest.test-seed#[2794DC7CF1ECBA58]) [ ] o.a.s.c.c.ConnectionManager Client is connected to ZooKeeper
[junit4] 2> 547644 INFO (TEST-BasicDistributedZkTest.test-seed#[2794DC7CF1ECBA58]) [ ] o.a.s.c.c.SolrZkClient Using default ZkACLProvider
[junit4] 2> 547645 INFO (TEST-BasicDistributedZkTest.test-seed#[2794DC7CF1ECBA58]) [n:127.0.0.1:46196_q ] o.a.s.c.c.ConnectionManager Waiting for client to connect to ZooKeeper
[junit4] 2> 547646 INFO (zkCallback-676-thread-1-processing-n:127.0.0.1:46196_q) [n:127.0.0.1:46196_q ] o.a.s.c.c.ConnectionManager Watcher org.apache.solr.common.cloud.ConnectionManager@53ea9fa1 name:ZooKeeperConnection Watcher:127.0.0.1:33185/solr got event WatchedEvent state:SyncConnected type:None path:null path:null type:None
[junit4] 2> 547646 INFO (TEST-BasicDistributedZkTest.test-seed#[2794DC7CF1ECBA58]) [n:127.0.0.1:46196_q ] o.a.s.c.c.ConnectionManager Client is connected to ZooKeeper
[junit4] 2> 547647 INFO (TEST-BasicDistributedZkTest.test-seed#[2794DC7CF1ECBA58]) [n:127.0.0.1:46196_q ] o.a.s.c.c.ZkStateReader Updating cluster state from ZooKeeper...
[junit4] 2> 547648 INFO (TEST-BasicDistributedZkTest.test-seed#[2794DC7CF1ECBA58]) [n:127.0.0.1:46196_q ] o.a.s.c.c.ZkStateReader Updated live nodes from ZooKeeper... (0) -> (1)
[junit4] 2> 547648 INFO (TEST-BasicDistributedZkTest.test-seed#[2794DC7CF1ECBA58]) [n:127.0.0.1:46196_q ] o.a.s.c.Overseer Overseer (id=null) closing
[junit4] 2> 547648 INFO (TEST-BasicDistributedZkTest.test-seed#[2794DC7CF1ECBA58]) [n:127.0.0.1:46196_q ] o.a.s.c.LeaderElector Joined leadership election with path: /overseer_elect/election/95669446086426632-127.0.0.1:46196_q-n_0000000001
[junit4] 2> 547648 INFO (TEST-BasicDistributedZkTest.test-seed#[2794DC7CF1ECBA58]) [n:127.0.0.1:46196_q ] o.a.s.c.LeaderElector Watching path /overseer_elect/election/95669446086426628-127.0.0.1:41695_q-n_0000000000 to know if I could be the leader
[junit4] 2> 547649 INFO (TEST-BasicDistributedZkTest.test-seed#[2794DC7CF1ECBA58]) [n:127.0.0.1:46196_q ] o.a.s.c.ZkController Publish node=127.0.0.1:46196_q as DOWN
[junit4] 2> 547649 INFO (OverseerStateUpdate-95669446086426628-127.0.0.1:41695_q-n_0000000000) [n:127.0.0.1:41695_q ] o.a.s.c.Overseer processMessage: queueSize: 1, message = {
[junit4] 2> "operation":"downnode",
[junit4] 2> "node_name":"127.0.0.1:46196_q"} current state version: 3
[junit4] 2> 547649 INFO (OverseerStateUpdate-95669446086426628-127.0.0.1:41695_q-n_0000000000) [n:127.0.0.1:41695_q ] o.a.s.c.o.NodeMutator DownNode state invoked for node: 127.0.0.1:46196_q
[junit4] 2> 547750 INFO (zkCallback-671-thread-1) [ ] o.a.s.c.c.ZkStateReader A cluster state change: [WatchedEvent state:SyncConnected type:NodeDataChanged path:/clusterstate.json], has occurred - updating... (live nodes size: [1])
[junit4] 2> 547750 INFO (zkCallback-676-thread-1-processing-n:127.0.0.1:46196_q) [n:127.0.0.1:46196_q ] o.a.s.c.c.ZkStateReader A cluster state change: [WatchedEvent state:SyncConnected type:NodeDataChanged path:/clusterstate.json], has occurred - updating... (live nodes size: [1])
[junit4] 2> 547750 INFO (zkCallback-669-thread-1-processing-n:127.0.0.1:41695_q) [n:127.0.0.1:41695_q ] o.a.s.c.c.ZkStateReader A cluster state change: [WatchedEvent state:SyncConnected type:NodeDataChanged path:/clusterstate.json], has occurred - updating... (live nodes size: [1])
[junit4] 2> 548649 INFO (TEST-BasicDistributedZkTest.test-seed#[2794DC7CF1ECBA58]) [n:127.0.0.1:46196_q ] o.a.s.c.ZkController Register node as live in ZooKeeper:/live_nodes/127.0.0.1:46196_q
[junit4] 2> 548650 INFO (TEST-BasicDistributedZkTest.test-seed#[2794DC7CF1ECBA58]) [n:127.0.0.1:46196_q ] o.a.s.c.c.SolrZkClient makePath: /live_nodes/127.0.0.1:46196_q
[junit4] 2> 548650 INFO (zkCallback-671-thread-1) [ ] o.a.s.c.c.ZkStateReader A live node change: [WatchedEvent state:SyncConnected type:NodeChildrenChanged path:/live_nodes], has occurred - updating... (live nodes size: [1])
[junit4] 2> 548650 INFO (zkCallback-676-thread-1-processing-n:127.0.0.1:46196_q) [n:127.0.0.1:46196_q ] o.a.s.c.c.ZkStateReader A live node change: [WatchedEvent state:SyncConnected type:NodeChildrenChanged path:/live_nodes], has occurred - updating... (live nodes size: [1])
[junit4] 2> 548651 INFO (zkCallback-669-thread-1-processing-n:127.0.0.1:41695_q) [n:127.0.0.1:41695_q ] o.a.s.c.c.ZkStateReader A live node change: [WatchedEvent state:SyncConnected type:NodeChildrenChanged path:/live_nodes], has occurred - updating... (live nodes size: [1])
[junit4] 2> 548651 INFO (zkCallback-671-thread-1) [ ] o.a.s.c.c.ZkStateReader Updated live nodes from ZooKeeper... (1) -> (2)
[junit4] 2> 548651 INFO (zkCallback-676-thread-1-processing-n:127.0.0.1:46196_q) [n:127.0.0.1:46196_q ] o.a.s.c.c.ZkStateReader Updated live nodes from ZooKeeper... (1) -> (2)
[junit4] 2> 548651 INFO (zkCallback-669-thread-1-processing-n:127.0.0.1:41695_q) [n:127.0.0.1:41695_q ] o.a.s.c.c.ZkStateReader Updated live nodes from ZooKeeper... (1) -> (2)
[junit4] 2> 548658 INFO (TEST-BasicDistributedZkTest.test-seed#[2794DC7CF1ECBA58]) [n:127.0.0.1:46196_q ] o.a.s.c.CoreContainer Security conf doesn't exist. Skipping setup for authorization module.
[junit4] 2> 548658 INFO (TEST-BasicDistributedZkTest.test-seed#[2794DC7CF1ECBA58]) [n:127.0.0.1:46196_q ] o.a.s.c.CoreContainer No authentication plugin used.
[junit4] 2> 548658 INFO (TEST-BasicDistributedZkTest.test-seed#[2794DC7CF1ECBA58]) [n:127.0.0.1:46196_q ] o.a.s.c.CorePropertiesLocator Looking for core definitions underneath /home/jenkins/workspace/Lucene-Solr-6.x-Linux/solr/build/solr-core/test/J0/../../../../../../../../../home/jenkins/workspace/Lucene-Solr-6.x-Linux/solr/build/solr-core/test/J0/temp/solr.cloud.BasicDistributedZkTest_2794DC7CF1ECBA58-001/shard-1-001/cores
[junit4] 2> 548659 INFO (TEST-BasicDistributedZkTest.test-seed#[2794DC7CF1ECBA58]) [n:127.0.0.1:46196_q ] o.a.s.c.CoreDescriptor Created CoreDescriptor: {name=collection1, config=solrconfig.xml, transient=false, schema=schema.xml, loadOnStartup=true, configSetProperties=configsetprops.json, collection=collection1, coreNodeName=, dataDir=data/, shard=}
[junit4] 2> 548659 INFO (TEST-BasicDistributedZkTest.test-seed#[2794DC7CF1ECBA58]) [n:127.0.0.1:46196_q ] o.a.s.c.CorePropertiesLocator Found core collection1 in /home/jenkins/workspace/Lucene-Solr-6.x-Linux/solr/build/solr-core/test/J0/../../../../../../../../../home/jenkins/workspace/Lucene-Solr-6.x-Linux/solr/build/solr-core/test/J0/temp/solr.cloud.BasicDistributedZkTest_2794DC7CF1ECBA58-001/shard-1-001/cores/collection1
[junit4] 2> 548659 INFO (TEST-BasicDistributedZkTest.test-seed#[2794DC7CF1ECBA58]) [n:127.0.0.1:46196_q ] o.a.s.c.CorePropertiesLocator Found 1 core definitions
[junit4] 2> 548660 INFO (TEST-BasicDistributedZkTest.test-seed#[2794DC7CF1ECBA58]) [n:127.0.0.1:46196_q ] o.a.s.s.SolrDispatchFilter user.dir=/home/jenkins/workspace/Lucene-Solr-6.x-Linux/solr/build/solr-core/test/J0
[junit4] 2> 548660 INFO (TEST-BasicDistributedZkTest.test-seed#[2794DC7CF1ECBA58]) [n:127.0.0.1:46196_q ] o.a.s.s.SolrDispatchFilter SolrDispatchFilter.init() done
[junit4] 2> 548660 INFO (coreLoadExecutor-2334-thread-1-processing-n:127.0.0.1:46196_q) [n:127.0.0.1:46196_q c:collection1 x:collection1] o.a.s.c.ZkController publishing state=down
[junit4] 2> 548660 INFO (coreLoadExecutor-2334-thread-1-processing-n:127.0.0.1:46196_q) [n:127.0.0.1:46196_q c:collection1 x:collection1] o.a.s.c.ZkController numShards not found on descriptor - reading it from system property
[junit4] 2> 548660 INFO (coreLoadExecutor-2334-thread-1-processing-n:127.0.0.1:46196_q) [n:127.0.0.1:46196_q c:collection1 x:collection1] o.a.s.c.ZkController look for our core node name
[junit4] 2> 548660 INFO (OverseerStateUpdate-95669446086426628-127.0.0.1:41695_q-n_0000000000) [n:127.0.0.1:41695_q ] o.a.s.c.Overseer processMessage: queueSize: 1, message = {
[junit4] 2> "core":"collection1",
[junit4] 2> "roles":null,
[junit4] 2> "base_url":"http://127.0.0.1:46196/q",
[junit4] 2> "node_name":"127.0.0.1:46196_q",
[junit4] 2> "numShards":"2",
[junit4] 2> "state":"down",
[junit4] 2> "shard":null,
[junit4] 2> "collection":"collection1",
[junit4] 2> "operation":"state"} current state version: 4
[junit4] 2> 548661 INFO (OverseerStateUpdate-95669446086426628-127.0.0.1:41695_q-n_0000000000) [n:127.0.0.1:41695_q ] o.a.s.c.o.ReplicaMutator Update state numShards=2 message={
[junit4] 2> "core":"collection1",
[junit4] 2> "roles":null,
[junit4] 2> "base_url":"http://127.0.0.1:46196/q",
[junit4] 2> "node_name":"127.0.0.1:46196_q",
[junit4] 2> "numShards":"2",
[junit4] 2> "state":"down",
[junit4] 2> "shard":null,
[junit4] 2> "collection":"collection1",
[junit4] 2> "operation":"state"}
[junit4] 2> 548661 INFO (OverseerStateUpdate-95669446086426628-127.0.0.1:41695_q-n_0000000000) [n:127.0.0.1:41695_q ] o.a.s.c.o.ClusterStateMutator building a new cName: collection1
[junit4] 2> 548661 INFO (OverseerStateUpdate-95669446086426628-127.0.0.1:41695_q-n_0000000000) [n:127.0.0.1:41695_q ] o.a.s.c.o.ReplicaMutator Assigning new node to shard shard=shard2
[junit4] 2> 548762 INFO (zkCallback-669-thread-1-processing-n:127.0.0.1:41695_q) [n:127.0.0.1:41695_q ] o.a.s.c.c.ZkStateReader A cluster state change: [WatchedEvent state:SyncConnected type:NodeDataChanged path:/clusterstate.json], has occurred - updating... (live nodes size: [2])
[junit4] 2> 548762 INFO (zkCallback-676-thread-1-processing-n:127.0.0.1:46196_q) [n:127.0.0.1:46196_q ] o.a.s.c.c.ZkStateReader A cluster state change: [WatchedEvent state:SyncConnected type:NodeDataChanged path:/clusterstate.json], has occurred - updating... (live nodes size: [2])
[junit4] 2> 548762 INFO (zkCallback-671-thread-1) [ ] o.a.s.c.c.ZkStateReader A cluster state change: [WatchedEvent state:SyncConnected type:NodeDataChanged path:/clusterstate.json], has occurred - updating... (live nodes size: [2])
[junit4] 2> 549660 INFO (coreLoadExecutor-2334-thread-1-processing-n:127.0.0.1:46196_q) [n:127.0.0.1:46196_q c:collection1 x:collection1] o.a.s.c.ZkController waiting to find shard id in clusterstate for collection1
[junit4] 2> 549661 INFO (coreLoadExecutor-2334-thread-1-processing-n:127.0.0.1:46196_q) [n:127.0.0.1:46196_q c:collection1 x:collection1] o.a.s.c.ZkController Check for collection zkNode:collection1
[junit4] 2> 549661 INFO (coreLoadExecutor-2334-thread-1-processing-n:127.0.0.1:46196_q) [n:127.0.0.1:46196_q c:collection1 x:collection1] o.a.s.c.ZkController Collection zkNode exists
[junit4] 2> 549661 INFO (coreLoadExecutor-2334-thread-1-processing-n:127.0.0.1:46196_q) [n:127.0.0.1:46196_q c:collection1 x:collection1] o.a.s.c.c.ZkStateReader Load collection config from: [/collections/collection1]
[junit4] 2> 549661 INFO (coreLoadExecutor-2334-thread-1-processing-n:127.0.0.1:46196_q) [n:127.0.0.1:46196_q c:collection1 x:collection1] o.a.s.c.c.ZkStateReader path=[/collections/collection1] [configName]=[conf1] specified config exists in ZooKeeper
[junit4] 2> 549661 INFO (coreLoadExecutor-2334-thread-1-processing-n:127.0.0.1:46196_q) [n:127.0.0.1:46196_q c:collection1 x:collection1] o.a.s.c.SolrResourceLoader new SolrResourceLoader for directory: '/home/jenkins/workspace/Lucene-Solr-6.x-Linux/solr/build/solr-core/test/J0/temp/solr.cloud.BasicDistributedZkTest_2794DC7CF1ECBA58-001/shard-1-001/cores/collection1'
[junit4] 2> 549661 INFO (coreLoadExecutor-2334-thread-1-processing-n:127.0.0.1:46196_q) [n:127.0.0.1:46196_q c:collection1 x:collection1] o.a.s.c.SolrResourceLoader JNDI not configured for solr (NoInitialContextEx)
[junit4] 2> 549661 INFO (coreLoadExecutor-2334-thread-1-processing-n:127.0.0.1:46196_q) [n:127.0.0.1:46196_q c:collection1 x:collection1] o.a.s.c.SolrResourceLoader solr home defaulted to 'solr/' (could not find system property or JNDI)
[junit4] 2> 549662 INFO (coreLoadExecutor-2334-thread-1-processing-n:127.0.0.1:46196_q) [n:127.0.0.1:46196_q c:collection1 x:collection1] o.a.s.c.Config loaded config solrconfig.xml with version 0
[junit4] 2> 549665 INFO (coreLoadExecutor-2334-thread-1-processing-n:127.0.0.1:46196_q) [n:127.0.0.1:46196_q c:collection1 x:collection1] o.a.s.c.SolrConfig current version of requestparams : -1
[junit4] 2> 549668 WARN (coreLoadExecutor-2334-thread-1-processing-n:127.0.0.1:46196_q) [n:127.0.0.1:46196_q c:collection1 x:collection1] o.a.s.c.Config Beginning with Solr 5.5, <mergePolicy> is deprecated, use <mergePolicyFactory> instead.
[junit4] 2> 549668 INFO (coreLoadExecutor-2334-thread-1-processing-n:127.0.0.1:46196_q) [n:127.0.0.1:46196_q c:collection1 x:collection1] o.a.s.c.SolrConfig Using Lucene MatchVersion: 6.1.0
[junit4] 2> 549674 INFO (coreLoadExecutor-2334-thread-1-processing-n:127.0.0.1:46196_q) [n:127.0.0.1:46196_q c:collection1 x:collection1] o.a.s.c.SolrConfig Loaded SolrConfig: solrconfig.xml
[junit4] 2> 549678 INFO (coreLoadExecutor-2334-thread-1-processing-n:127.0.0.1:46196_q) [n:127.0.0.1:46196_q c:collection1 x:collection1] o.a.s.s.IndexSchema [collection1] Schema name=test
[junit4] 2> 549747 INFO (coreLoadExecutor-2334-thread-1-processing-n:127.0.0.1:46196_q) [n:127.0.0.1:46196_q c:collection1 x:collection1] o.a.s.s.OpenExchangeRatesOrgProvider Initialized with rates=open-exchange-rates.json, refreshInterval=1440.
[junit4] 2> 549751 INFO (coreLoadExecutor-2334-thread-1-processing-n:127.0.0.1:46196_q) [n:127.0.0.1:46196_q c:collection1 x:collection1] o.a.s.s.IndexSchema default search field in schema is text
[junit4] 2> 549751 INFO (coreLoadExecutor-2334-thread-1-processing-n:127.0.0.1:46196_q) [n:127.0.0.1:46196_q c:collection1 x:collection1] o.a.s.s.IndexSchema unique key field: id
[junit4] 2> 549755 INFO (coreLoadExecutor-2334-thread-1-processing-n:127.0.0.1:46196_q) [n:127.0.0.1:46196_q c:collection1 x:collection1] o.a.s.s.FileExchangeRateProvider Reloading exchange rates from file currency.xml
[junit4] 2> 549756 INFO (coreLoadExecutor-2334-thread-1-processing-n:127.0.0.1:46196_q) [n:127.0.0.1:46196_q c:collection1 x:collection1] o.a.s.s.FileExchangeRateProvider Reloading exchange rates from file currency.xml
[junit4] 2> 549757 INFO (coreLoadExecutor-2334-thread-1-processing-n:127.0.0.1:46196_q) [n:127.0.0.1:46196_q c:collection1 x:collection1] o.a.s.s.OpenExchangeRatesOrgProvider Reloading exchange rates from open-exchange-rates.json
[junit4] 2> 549757 INFO (coreLoadExecutor-2334-thread-1-processing-n:127.0.0.1:46196_q) [n:127.0.0.1:46196_q c:collection1 x:collection1] o.a.s.s.OpenExchangeRatesOrgProvider Reloading exchange rates from open-exchange-rates.json
[junit4] 2> 549758 INFO (coreLoadExecutor-2334-thread-1-processing-n:127.0.0.1:46196_q) [n:127.0.0.1:46196_q c:collection1 x:collection1] o.a.s.c.ConfigSetProperties Did not find ConfigSet properties, assuming default properties: Can't find resource 'configsetprops.json' in classpath or '/configs/conf1', cwd=/home/jenkins/workspace/Lucene-Solr-6.x-Linux/solr/build/solr-core/test/J0
[junit4] 2> 549758 INFO (coreLoadExecutor-2334-thread-1-processing-n:127.0.0.1:46196_q) [n:127.0.0.1:46196_q c:collection1 x:collection1] o.a.s.c.CoreContainer Creating SolrCore 'collection1' using configuration from collection collection1
[junit4] 2> 549758 INFO (coreLoadExecutor-2334-thread-1-processing-n:127.0.0.1:46196_q) [n:127.0.0.1:46196_q c:collection1 s:shard2 r:core_node1 x:collection1] o.a.s.c.SolrCore org.apache.solr.core.MockDirectoryFactory
[junit4] 2> 549758 INFO (coreLoadExecutor-2334-thread-1-processing-n:127.0.0.1:46196_q) [n:127.0.0.1:46196_q c:collection1 s:shard2 r:core_node1 x:collection1] o.a.s.c.SolrCore [[collection1] ] Opening new SolrCore at [/home/jenkins/workspace/Lucene-Solr-6.x-Linux/solr/build/solr-core/test/J0/temp/solr.cloud.BasicDistributedZkTest_2794DC7CF1ECBA58-001/shard-1-001/cores/collection1], dataDir=[/home/jenkins/workspace/Lucene-Solr-6.x-Linux/solr/build/solr-core/test/J0/../../../../../../../../../home/jenkins/workspace/Lucene-Solr-6.x-Linux/solr/build/solr-core/test/J0/temp/solr.cloud.BasicDistributedZkTest_2794DC7CF1ECBA58-001/shard-1-001/cores/collection1/data/]
[junit4] 2> 549758 INFO (coreLoadExecutor-2334-thread-1-processing-n:127.0.0.1:46196_q) [n:127.0.0.1:46196_q c:collection1 s:shard2 r:core_node1 x:collection1] o.a.s.c.JmxMonitoredMap JMX monitoring is enabled. Adding Solr mbeans to JMX Server: com.sun.jmx.mbeanserver.JmxMBeanServer@478d4c47
[junit4] 2> 549759 INFO (coreLoadExecutor-2334-thread-1-processing-n:127.0.0.1:46196_q) [n:127.0.0.1:46196_q c:collection1 s:shard2 r:core_node1 x:collection1] o.a.s.c.CachingDirectoryFactory return new directory for /home/jenkins/workspace/Lucene-Solr-6.x-Linux/solr/build/solr-core/test/J0/../../../../../../../../../home/jenkins/workspace/Lucene-Solr-6.x-Linux/solr/build/solr-core/test/J0/temp/solr.cloud.BasicDistributedZkTest_2794DC7CF1ECBA58-001/shard-1-001/cores/collection1/data
[junit4] 2> 549759 INFO (coreLoadExecutor-2334-thread-1-processing-n:127.0.0.1:46196_q) [n:127.0.0.1:46196_q c:collection1 s:shard2 r:core_node1 x:collection1] o.a.s.c.SolrCore New index directory detected:
[...truncated too long message...]
butedZkTest_2794DC7CF1ECBA58-001/shard-4-001/cores/collection1/data;done=false>>]
[junit4] 2> 617242 INFO (zkCallback-692-thread-1-processing-n:127.0.0.1:43078_q) [n:127.0.0.1:43078_q c:collection1 s:shard1 r:core_node4 x:collection1] o.a.s.c.CachingDirectoryFactory Closing directory, CoreContainer#isShutdown=true
[junit4] 2> 617242 INFO (zkCallback-692-thread-1-processing-n:127.0.0.1:43078_q) [n:127.0.0.1:43078_q c:collection1 s:shard1 r:core_node4 x:collection1] o.a.s.c.CachingDirectoryFactory Closing directory: /home/jenkins/workspace/Lucene-Solr-6.x-Linux/solr/build/solr-core/test/J0/temp/solr.cloud.BasicDistributedZkTest_2794DC7CF1ECBA58-001/shard-4-001/cores/collection1/data
[junit4] 2> 617243 INFO (TEST-BasicDistributedZkTest.test-seed#[2794DC7CF1ECBA58]) [ ] o.e.j.s.ServerConnector Stopped ServerConnector@1c35c66b{HTTP/1.1,[http/1.1]}{127.0.0.1:0}
[junit4] 2> 617243 INFO (TEST-BasicDistributedZkTest.test-seed#[2794DC7CF1ECBA58]) [ ] o.e.j.s.h.ContextHandler Stopped o.e.j.s.ServletContextHandler@5cde8ba{/q,null,UNAVAILABLE}
[junit4] 2> 617244 INFO (TEST-BasicDistributedZkTest.test-seed#[2794DC7CF1ECBA58]) [ ] o.a.s.c.ZkTestServer connecting to 127.0.0.1:33185 33185
[junit4] 2> 617250 INFO (Thread-1673) [ ] o.a.s.c.ZkTestServer connecting to 127.0.0.1:33185 33185
[junit4] 2> 617251 WARN (Thread-1673) [ ] o.a.s.c.ZkTestServer Watch limit violations:
[junit4] 2> Maximum concurrent create/delete watches above limit:
[junit4] 2>
[junit4] 2> 7 /solr/aliases.json
[junit4] 2> 5 /solr/security.json
[junit4] 2> 5 /solr/configs/conf1
[junit4] 2>
[junit4] 2> Maximum concurrent data watches above limit:
[junit4] 2>
[junit4] 2> 7 /solr/clusterstate.json
[junit4] 2>
[junit4] 2> Maximum concurrent children watches above limit:
[junit4] 2>
[junit4] 2> 7 /solr/live_nodes
[junit4] 2> 7 /solr/collections
[junit4] 2> 5 /solr/overseer/queue
[junit4] 2> 5 /solr/overseer/collection-queue-work
[junit4] 2>
[junit4] 2> NOTE: reproduce with: ant test -Dtestcase=BasicDistributedZkTest -Dtests.method=test -Dtests.seed=2794DC7CF1ECBA58 -Dtests.multiplier=3 -Dtests.slow=true -Dtests.locale=ar-DZ -Dtests.timezone=Europe/Amsterdam -Dtests.asserts=true -Dtests.file.encoding=ISO-8859-1
[junit4] ERROR 71.4s J0 | BasicDistributedZkTest.test <<<
[junit4] > Throwable #1: org.apache.solr.client.solrj.impl.HttpSolrClient$RemoteSolrException: Error from server at http://127.0.0.1:43078/q/collection1: Async exception during distributed update: Bad Request
[junit4] > request: http://127.0.0.1:46196/q/collection1/update?update.chain=distrib-dup-test-chain-explicit&update.distrib=TOLEADER&distrib.from=http%3A%2F%2F127.0.0.1%3A43078%2Fq%2Fcollection1%2F&wt=javabin&version=2
[junit4] > at __randomizedtesting.SeedInfo.seed([2794DC7CF1ECBA58:AFC0E3A65F10D7A0]:0)
[junit4] > at org.apache.solr.client.solrj.impl.HttpSolrClient.executeMethod(HttpSolrClient.java:577)
[junit4] > at org.apache.solr.client.solrj.impl.HttpSolrClient.request(HttpSolrClient.java:241)
[junit4] > at org.apache.solr.client.solrj.impl.HttpSolrClient.request(HttpSolrClient.java:230)
[junit4] > at org.apache.solr.client.solrj.SolrRequest.process(SolrRequest.java:149)
[junit4] > at org.apache.solr.client.solrj.SolrRequest.process(SolrRequest.java:166)
[junit4] > at org.apache.solr.BaseDistributedSearchTestCase.add(BaseDistributedSearchTestCase.java:514)
[junit4] > at org.apache.solr.cloud.BasicDistributedZkTest.testUpdateProcessorsRunOnlyOnce(BasicDistributedZkTest.java:669)
[junit4] > at org.apache.solr.cloud.BasicDistributedZkTest.test(BasicDistributedZkTest.java:365)
[junit4] > at org.apache.solr.BaseDistributedSearchTestCase$ShardsRepeatRule$ShardsFixedStatement.callStatement(BaseDistributedSearchTestCase.java:992)
[junit4] > at org.apache.solr.BaseDistributedSearchTestCase$ShardsRepeatRule$ShardsStatement.evaluate(BaseDistributedSearchTestCase.java:967)
[junit4] > at java.lang.Thread.run(Thread.java:745)
[junit4] 2> 617253 INFO (SUITE-BasicDistributedZkTest-seed#[2794DC7CF1ECBA58]-worker) [ ] o.a.s.SolrTestCaseJ4 ###deleteCore
[junit4] 2> NOTE: leaving temporary files on disk at: /home/jenkins/workspace/Lucene-Solr-6.x-Linux/solr/build/solr-core/test/J0/temp/solr.cloud.BasicDistributedZkTest_2794DC7CF1ECBA58-001
[junit4] 2> Apr 04, 2016 7:59:28 PM com.carrotsearch.randomizedtesting.ThreadLeakControl checkThreadLeaks
[junit4] 2> WARNING: Will linger awaiting termination of 1 leaked thread(s).
[junit4] 2> NOTE: test params are: codec=Asserting(Lucene60): {regex_dup_A_s=Lucene50(blocksize=128), other_tl1=FST50, regex_dup_B_s=FST50, range_facet_l_dv=TestBloomFilteredLucenePostings(BloomFilteringPostingsFormat(Lucene50(blocksize=128))), SubjectTerms_mfacet=FST50, n_l1=PostingsFormat(name=SimpleText), multiDefault=FST50, intDefault=FST50, genre_s=TestBloomFilteredLucenePostings(BloomFilteringPostingsFormat(Lucene50(blocksize=128))), n_td1=FST50, n_d1=PostingsFormat(name=SimpleText), range_facet_l=FST50, n_f1=FST50, series_t=FST50, n_tl1=FST50, oddField_s=TestBloomFilteredLucenePostings(BloomFilteringPostingsFormat(Lucene50(blocksize=128))), n_tf1=PostingsFormat(name=SimpleText), price=Lucene50(blocksize=128), a_t=PostingsFormat(name=SimpleText), cat=PostingsFormat(name=SimpleText), inStock=Lucene50(blocksize=128), sequence_i=TestBloomFilteredLucenePostings(BloomFilteringPostingsFormat(Lucene50(blocksize=128))), id=TestBloomFilteredLucenePostings(BloomFilteringPostingsFormat(Lucene50(blocksize=128))), text=Lucene50(blocksize=128), timestamp=FST50, foo_i=FST50, val_i=TestBloomFilteredLucenePostings(BloomFilteringPostingsFormat(Lucene50(blocksize=128))), n_dt1=FST50, author_t=FST50, a_i1=PostingsFormat(name=SimpleText), n_ti1=TestBloomFilteredLucenePostings(BloomFilteringPostingsFormat(Lucene50(blocksize=128))), rnd_b=TestBloomFilteredLucenePostings(BloomFilteringPostingsFormat(Lucene50(blocksize=128))), _version_=FST50, foo_b=Lucene50(blocksize=128), n_tdt1=FST50, name=TestBloomFilteredLucenePostings(BloomFilteringPostingsFormat(Lucene50(blocksize=128))), foo_d=TestBloomFilteredLucenePostings(BloomFilteringPostingsFormat(Lucene50(blocksize=128))), range_facet_i_dv=FST50, foo_f=Lucene50(blocksize=128)}, docValues:{range_facet_l_dv=DocValuesFormat(name=Lucene54), range_facet_i_dv=DocValuesFormat(name=Direct), timestamp=DocValuesFormat(name=Direct)}, maxPointsInLeafNode=1260, maxMBSortInHeap=5.360766537639824, sim=ClassicSimilarity, locale=ar-DZ, timezone=Europe/Amsterdam
[junit4] 2> NOTE: Linux 4.2.0-34-generic amd64/Oracle Corporation 1.8.0_72 (64-bit)/cpus=12,threads=1,free=298898928,total=529006592
[junit4] 2> NOTE: All tests run in this JVM: [TolerantUpdateProcessorTest, StandardRequestHandlerTest, CollectionTooManyReplicasTest, TestReRankQParserPlugin, ExternalFileFieldSortTest, TestLRUStatsCache, DisMaxRequestHandlerTest, DocumentAnalysisRequestHandlerTest, TestSolr4Spatial, TestHighlightDedupGrouping, TestCloudManagedSchema, TestManagedStopFilterFactory, TestRandomFaceting, DirectoryFactoryTest, TestDistribIDF, TestAnalyzedSuggestions, TestJoin, TestValueSourceCache, OverseerRolesTest, QueryResultKeyTest, BitVectorTest, SolrXmlInZkTest, CurrencyFieldOpenExchangeTest, CustomCollectionTest, TestExclusionRuleCollectionAccess, OutOfBoxZkACLAndCredentialsProvidersTest, ParsingFieldUpdateProcessorsTest, IndexSchemaTest, TestSolrConfigHandler, TestFieldTypeResource, BasicZkTest, TestDefaultSearchFieldResource, PreAnalyzedFieldTest, ActionThrottleTest, TestFoldingMultitermQuery, TestExpandComponent, CdcrVersionReplicationTest, TestCollationFieldDocValues, RuleEngineTest, TestStressLucene, HdfsRecoveryZkTest, SynonymTokenizerTest, CheckHdfsIndexTest, TestSolr4Spatial2, TestSha256AuthenticationProvider, TestPhraseSuggestions, ZkNodePropsTest, AddSchemaFieldsUpdateProcessorFactoryTest, RAMDirectoryFactoryTest, XsltUpdateRequestHandlerTest, SaslZkACLProviderTest, InfoHandlerTest, TestJsonFacets, TestConfigSetProperties, TestComponentsName, TestBulkSchemaAPI, QueryElevationComponentTest, TestConfig, TriLevelCompositeIdRoutingTest, LeaderInitiatedRecoveryOnShardRestartTest, PingRequestHandlerTest, TestMissingGroups, CursorPagingTest, CdcrUpdateLogTest, CloneFieldUpdateProcessorFactoryTest, TestIBSimilarityFactory, HdfsThreadLeakTest, TestIntervalFaceting, TestMiniSolrCloudClusterSSL, PathHierarchyTokenizerFactoryTest, TestAuthorizationFramework, IndexSchemaRuntimeFieldTest, BasicDistributedZkTest]
[junit4] Completed [219/585 (1!)] on J0 in 71.65s, 1 test, 1 error <<< FAILURES!
[...truncated 1190 lines...]
BUILD FAILED
/home/jenkins/workspace/Lucene-Solr-6.x-Linux/build.xml:740: The following error occurred while executing this line:
/home/jenkins/workspace/Lucene-Solr-6.x-Linux/build.xml:684: The following error occurred while executing this line:
/home/jenkins/workspace/Lucene-Solr-6.x-Linux/build.xml:59: The following error occurred while executing this line:
/home/jenkins/workspace/Lucene-Solr-6.x-Linux/solr/build.xml:233: The following error occurred while executing this line:
/home/jenkins/workspace/Lucene-Solr-6.x-Linux/solr/common-build.xml:529: The following error occurred while executing this line:
/home/jenkins/workspace/Lucene-Solr-6.x-Linux/lucene/common-build.xml:1457: The following error occurred while executing this line:
/home/jenkins/workspace/Lucene-Solr-6.x-Linux/lucene/common-build.xml:1014: There were test failures: 585 suites (10 ignored), 2360 tests, 1 error, 114 ignored (70 assumptions) [seed: 2794DC7CF1ECBA58]
Total time: 53 minutes 30 seconds
Build step 'Invoke Ant' marked build as failure
Archiving artifacts
[WARNINGS] Skipping publisher since build result is FAILURE
Recording test results
Email was triggered for: Failure - Any
Sending email for trigger: Failure - Any