You are viewing a plain text version of this content. The canonical link for it is here.
Posted to commits@tuscany.apache.org by Apache Hudson Server <hu...@hudson.apache.org> on 2010/11/24 15:22:38 UTC

Build failed in Hudson: Tuscany-2x #964

See <https://hudson.apache.org/hudson/job/Tuscany-2x/964/>

------------------------------------------
[...truncated 19190 lines...]
Nov 24, 2010 8:58:38 AM org.apache.tuscany.sca.endpoint.hazelcast.HazelcastEndpointRegistry addEndpoint
INFO: Add endpoint - (@31616322)Endpoint:  URI = TestServiceClient#service-binding(TestService/TestService)
Nov 24, 2010 8:58:38 AM org.apache.tuscany.sca.endpoint.hazelcast.HazelcastEndpointRegistry entryAdded
INFO:  Remote endpoint added: (@7544464)Endpoint:  URI = TestServiceClient#service-binding(TestService/TestService)
Nov 24, 2010 8:58:38 AM org.apache.tuscany.sca.node.impl.NodeImpl start
INFO: Starting node: http://tuscany.apache.org/sca/1.1/nodes/default2 domain: HazelcastBindingTestCase
Nov 24, 2010 8:58:38 AM com.hazelcast.system
INFO: [HazelcastBindingTestCase] Hazelcast 1.8.3 (20100407) starting at Address[127.0.0.1:14822]
Nov 24, 2010 8:58:38 AM com.hazelcast.system
INFO: [HazelcastBindingTestCase] Copyright (C) 2008-2010 Hazelcast.com
Nov 24, 2010 8:58:39 AM com.hazelcast.cluster.ClusterManager
INFO: [HazelcastBindingTestCase] 

Members [3] {
	Member [127.0.0.1:14820] this 
	Member [127.0.0.1:14821] 
	Member [127.0.0.1:14822] 
}

Nov 24, 2010 8:58:39 AM com.hazelcast.cluster.ClusterManager
INFO: [HazelcastBindingTestCase] 

Members [3] {
	Member [127.0.0.1:14820] 
	Member [127.0.0.1:14821] 
	Member [127.0.0.1:14822] this 
}

Nov 24, 2010 8:58:39 AM com.hazelcast.cluster.ClusterManager
INFO: [HazelcastBindingTestCase] 

Members [3] {
	Member [127.0.0.1:14820] 
	Member [127.0.0.1:14821] this 
	Member [127.0.0.1:14822] 
}

Nov 24, 2010 8:58:41 AM org.apache.tuscany.sca.node.impl.NodeFactoryImpl loadContributions
INFO: Loading contribution: <https://hudson.apache.org/hudson/job/Tuscany-2x/ws/sca-2x/modules/domain-hazelcast/target/test-classes/>
Nov 24, 2010 8:58:41 AM org.apache.tuscany.sca.endpoint.hazelcast.HazelcastEndpointRegistry entryAdded
INFO:  Remote endpoint added: (@26237506)Endpoint:  URI = TestServiceClient2#service-binding(TestService/TestService)
Nov 24, 2010 8:58:41 AM org.apache.tuscany.sca.endpoint.hazelcast.HazelcastEndpointRegistry entryAdded
INFO:  Remote endpoint added: (@18080625)Endpoint:  URI = TestServiceClient2#service-binding(TestService/TestService)
Nov 24, 2010 8:58:41 AM org.apache.tuscany.sca.endpoint.hazelcast.HazelcastEndpointRegistry addEndpoint
INFO: Add endpoint - (@1423192)Endpoint:  URI = TestServiceClient2#service-binding(TestService/TestService)
Nov 24, 2010 8:58:42 AM org.apache.tuscany.sca.node.impl.NodeImpl stop
INFO: Stopping node: http://tuscany.apache.org/sca/1.1/nodes/default2
Nov 24, 2010 8:58:42 AM org.apache.tuscany.sca.endpoint.hazelcast.HazelcastEndpointRegistry entryRemoved
INFO:  Remote endpoint removed: (@6395852)Endpoint:  URI = TestServiceClient2#service-binding(TestService/TestService)
Nov 24, 2010 8:58:42 AM org.apache.tuscany.sca.endpoint.hazelcast.HazelcastEndpointRegistry removeEndpoint
INFO: Removed endpoint - (@1423192)Endpoint:  URI = TestServiceClient2#service-binding(TestService/TestService)
Nov 24, 2010 8:58:42 AM org.apache.tuscany.sca.endpoint.hazelcast.HazelcastEndpointRegistry entryRemoved
INFO:  Remote endpoint removed: (@20238918)Endpoint:  URI = TestServiceClient2#service-binding(TestService/TestService)
Nov 24, 2010 8:58:42 AM org.apache.tuscany.sca.endpoint.hazelcast.HazelcastEndpointRegistry entryRemoved
INFO:  Remote endpoint removed: (@14218588)Endpoint:  URI = TestServiceClient2#service-binding(TestService/TestService)
Nov 24, 2010 8:58:43 AM com.hazelcast.impl.Node
INFO: [HazelcastBindingTestCase] Hazelcast Shutdown is completed in 1046 ms.
Nov 24, 2010 8:58:43 AM com.hazelcast.cluster.ClusterManager
INFO: [HazelcastBindingTestCase] 

Members [2] {
	Member [127.0.0.1:14820] 
	Member [127.0.0.1:14821] this 
}

Nov 24, 2010 8:58:43 AM com.hazelcast.cluster.ClusterManager
INFO: [HazelcastBindingTestCase] 

Members [2] {
	Member [127.0.0.1:14820] this 
	Member [127.0.0.1:14821] 
}

onewayString Petra
Nov 24, 2010 8:58:43 AM org.apache.tuscany.sca.node.impl.NodeImpl stop
INFO: Stopping node: http://tuscany.apache.org/sca/1.1/nodes/default1
Nov 24, 2010 8:58:43 AM org.apache.tuscany.sca.endpoint.hazelcast.HazelcastEndpointRegistry removeEndpoint
INFO: Removed endpoint - (@31616322)Endpoint:  URI = TestServiceClient#service-binding(TestService/TestService)
Nov 24, 2010 8:58:43 AM org.apache.tuscany.sca.endpoint.hazelcast.HazelcastEndpointRegistry entryRemoved
INFO:  Remote endpoint removed: (@10348594)Endpoint:  URI = TestServiceClient#service-binding(TestService/TestService)
Nov 24, 2010 8:58:43 AM org.apache.tuscany.sca.endpoint.hazelcast.HazelcastEndpointRegistry entryRemoved
INFO:  Remote endpoint removed: (@16199433)Endpoint:  URI = TestServiceClient#service-binding(TestService/TestService)
Nov 24, 2010 8:58:44 AM com.hazelcast.cluster.ClusterManager
INFO: [HazelcastBindingTestCase] 

Members [1] {
	Member [127.0.0.1:14820] this 
}

Nov 24, 2010 8:58:49 AM com.hazelcast.impl.Node
INFO: [HazelcastBindingTestCase] Hazelcast Shutdown is completed in 5864 ms.
Nov 24, 2010 8:58:49 AM org.apache.tuscany.sca.node.impl.NodeImpl stop
INFO: Stopping node: http://tuscany.apache.org/sca/1.1/nodes/default0
Nov 24, 2010 8:58:49 AM org.apache.tuscany.sca.endpoint.hazelcast.HazelcastEndpointRegistry removeEndpoint
INFO: Removed endpoint - (@22939192)Endpoint:  URI = TestService#service-binding(TestService/TestService)
Nov 24, 2010 8:58:49 AM org.apache.tuscany.sca.endpoint.hazelcast.HazelcastEndpointRegistry entryRemoved
INFO:  Remote endpoint removed: (@23533966)Endpoint:  URI = TestService#service-binding(TestService/TestService)
Nov 24, 2010 8:58:49 AM org.apache.tuscany.sca.extensibility.ContextClassLoaderServiceDiscoverer getServiceDeclarations
SEVERE: null
java.io.InterruptedIOException
	at java.io.FileInputStream.readBytes(Native Method)
	at java.io.FileInputStream.read(FileInputStream.java:199)
	at java.io.BufferedInputStream.read1(BufferedInputStream.java:256)
	at java.io.BufferedInputStream.read(BufferedInputStream.java:317)
	at sun.nio.cs.StreamDecoder.readBytes(StreamDecoder.java:264)
	at sun.nio.cs.StreamDecoder.implRead(StreamDecoder.java:306)
	at sun.nio.cs.StreamDecoder.read(StreamDecoder.java:158)
	at java.io.InputStreamReader.read(InputStreamReader.java:167)
	at java.io.BufferedReader.fill(BufferedReader.java:136)
	at java.io.BufferedReader.readLine(BufferedReader.java:299)
	at java.io.BufferedReader.readLine(BufferedReader.java:362)
	at org.apache.tuscany.sca.extensibility.ServiceDeclarationParser.load(ServiceDeclarationParser.java:352)
	at org.apache.tuscany.sca.extensibility.ContextClassLoaderServiceDiscoverer.getServiceDeclarations(ContextClassLoaderServiceDiscoverer.java:181)
	at org.apache.tuscany.sca.extensibility.ServiceDiscovery.getServiceDeclarations(ServiceDiscovery.java:106)
	at org.apache.tuscany.sca.extensibility.ServiceDiscovery.getServiceDeclarations(ServiceDiscovery.java:102)
	at org.apache.tuscany.sca.contribution.processor.DefaultStAXArtifactProcessorExtensionPoint.loadArtifactProcessors(DefaultStAXArtifactProcessorExtensionPoint.java:112)
	at org.apache.tuscany.sca.contribution.processor.DefaultStAXArtifactProcessorExtensionPoint.getProcessor(DefaultStAXArtifactProcessorExtensionPoint.java:92)
	at org.apache.tuscany.sca.core.assembly.impl.EndpointSerializerImpl.<init>(EndpointSerializerImpl.java:54)
	at sun.reflect.NativeConstructorAccessorImpl.newInstance0(Native Method)
	at sun.reflect.NativeConstructorAccessorImpl.newInstance(NativeConstructorAccessorImpl.java:39)
	at sun.reflect.DelegatingConstructorAccessorImpl.newInstance(DelegatingConstructorAccessorImpl.java:27)
	at java.lang.reflect.Constructor.newInstance(Constructor.java:513)
	at org.apache.tuscany.sca.extensibility.ServiceHelper.newInstance(ServiceHelper.java:89)
	at org.apache.tuscany.sca.extensibility.ServiceHelper.newInstance(ServiceHelper.java:131)
	at org.apache.tuscany.sca.core.DefaultUtilityExtensionPoint.getUtility(DefaultUtilityExtensionPoint.java:173)
	at org.apache.tuscany.sca.core.DefaultUtilityExtensionPoint.getUtility(DefaultUtilityExtensionPoint.java:94)
	at org.apache.tuscany.sca.core.assembly.impl.RuntimeEndpointImpl.bind(RuntimeEndpointImpl.java:188)
	at org.apache.tuscany.sca.runtime.BaseEndpointRegistry.endpointRemoved(BaseEndpointRegistry.java:78)
	at org.apache.tuscany.sca.endpoint.hazelcast.HazelcastEndpointRegistry.entryRemoved(HazelcastEndpointRegistry.java:310)
	at org.apache.tuscany.sca.endpoint.hazelcast.HazelcastEndpointRegistry.entryRemoved(HazelcastEndpointRegistry.java:290)
	at com.hazelcast.impl.ListenerManager.callListener(ListenerManager.java:331)
	at com.hazelcast.impl.ListenerManager.callListeners(ListenerManager.java:305)
	at com.hazelcast.impl.BaseManager$EventTask.run(BaseManager.java:1163)
	at com.hazelcast.impl.base.OrderedRunnablesQueue.run(OrderedRunnablesQueue.java:35)
	at java.util.concurrent.ThreadPoolExecutor$Worker.runTask(ThreadPoolExecutor.java:886)
	at java.util.concurrent.ThreadPoolExecutor$Worker.run(ThreadPoolExecutor.java:908)
	at java.lang.Thread.run(Thread.java:662)
Nov 24, 2010 8:58:55 AM com.hazelcast.impl.Node
INFO: [HazelcastBindingTestCase] Hazelcast Shutdown is completed in 6060 ms.
Tests run: 6, Failures: 0, Errors: 0, Skipped: 0, Time elapsed: 28.28 sec

Results :

Tests run: 9, Failures: 0, Errors: 0, Skipped: 1

[HUDSON] Recording test results
[INFO] [jar:jar {execution: default-jar}]
[INFO] Building jar: <https://hudson.apache.org/hudson/job/Tuscany-2x/ws/sca-2x/modules/domain-hazelcast/target/tuscany-domain-hazelcast-2.0-SNAPSHOT.jar>
[INFO] [source:jar-no-fork {execution: attach-sources}]
[INFO] Building jar: <https://hudson.apache.org/hudson/job/Tuscany-2x/ws/sca-2x/modules/domain-hazelcast/target/tuscany-domain-hazelcast-2.0-SNAPSHOT-sources.jar>
[INFO] [install:install {execution: default-install}]
[INFO] Installing <https://hudson.apache.org/hudson/job/Tuscany-2x/ws/sca-2x/modules/domain-hazelcast/target/tuscany-domain-hazelcast-2.0-SNAPSHOT.jar> to /export/home/hudson/.m2/repository/org/apache/tuscany/sca/tuscany-domain-hazelcast/2.0-SNAPSHOT/tuscany-domain-hazelcast-2.0-SNAPSHOT.jar
[INFO] Installing <https://hudson.apache.org/hudson/job/Tuscany-2x/ws/sca-2x/modules/domain-hazelcast/target/tuscany-domain-hazelcast-2.0-SNAPSHOT-sources.jar> to /export/home/hudson/.m2/repository/org/apache/tuscany/sca/tuscany-domain-hazelcast/2.0-SNAPSHOT/tuscany-domain-hazelcast-2.0-SNAPSHOT-sources.jar
[HUDSON] Archiving <https://hudson.apache.org/hudson/job/Tuscany-2x/ws/sca-2x/modules/domain-hazelcast/pom.xml> to /home/hudson/hudson/jobs/Tuscany-2x/modules/org.apache.tuscany.sca$tuscany-domain-hazelcast/builds/2010-11-24_08-19-47/archive/org.apache.tuscany.sca/tuscany-domain-hazelcast/2.0-SNAPSHOT/pom.xml
[HUDSON] Archiving <https://hudson.apache.org/hudson/job/Tuscany-2x/ws/sca-2x/modules/domain-hazelcast/target/tuscany-domain-hazelcast-2.0-SNAPSHOT.jar> to /home/hudson/hudson/jobs/Tuscany-2x/modules/org.apache.tuscany.sca$tuscany-domain-hazelcast/builds/2010-11-24_08-19-47/archive/org.apache.tuscany.sca/tuscany-domain-hazelcast/2.0-SNAPSHOT/tuscany-domain-hazelcast-2.0-SNAPSHOT.jar
[HUDSON] Archiving <https://hudson.apache.org/hudson/job/Tuscany-2x/ws/sca-2x/modules/domain-hazelcast/target/tuscany-domain-hazelcast-2.0-SNAPSHOT-sources.jar> to /home/hudson/hudson/jobs/Tuscany-2x/modules/org.apache.tuscany.sca$tuscany-domain-hazelcast/builds/2010-11-24_08-19-47/archive/org.apache.tuscany.sca/tuscany-domain-hazelcast/2.0-SNAPSHOT/tuscany-domain-hazelcast-2.0-SNAPSHOT-sources.jar
[INFO] ------------------------------------------------------------------------
[INFO] Building Apache Tuscany Maven Tuscany Plugin
[INFO]    task-segment: [clean, install]
[INFO] ------------------------------------------------------------------------
[INFO] [clean:clean {execution: default-clean}]
[INFO] [enforcer:enforce {execution: enforce-plugin-versions}]
[INFO] [plugin:descriptor {execution: default-descriptor}]
[INFO] Using 'UTF-8' encoding to read mojo metadata.
[INFO] Applying mojo extractor for language: java
[INFO] Mojo extractor for language: java found 2 mojo descriptors.
[INFO] Applying mojo extractor for language: bsh
[INFO] Mojo extractor for language: bsh found 0 mojo descriptors.
[INFO] [remote-resources:process {execution: default}]
[INFO] [resources:resources {execution: default-resources}]
[INFO] Using 'UTF-8' encoding to copy filtered resources.
[INFO] skip non existing resourceDirectory <https://hudson.apache.org/hudson/job/Tuscany-2x/ws/sca-2x/maven/maven-tuscany-plugin/src/main/resources>
[INFO] Copying 3 resources
[INFO] Copying 3 resources
[INFO] [compiler:compile {execution: default-compile}]
[INFO] Compiling 2 source files to <https://hudson.apache.org/hudson/job/Tuscany-2x/ws/sca-2x/maven/maven-tuscany-plugin/target/classes>
[INFO] [resources:testResources {execution: default-testResources}]
[INFO] Using 'UTF-8' encoding to copy filtered resources.
[INFO] skip non existing resourceDirectory <https://hudson.apache.org/hudson/job/Tuscany-2x/ws/sca-2x/maven/maven-tuscany-plugin/src/test/resources>
[INFO] Copying 3 resources
[INFO] [compiler:testCompile {execution: default-testCompile}]
[INFO] No sources to compile
[INFO] [surefire:test {execution: default-test}]
[INFO] Surefire report directory: <https://hudson.apache.org/hudson/job/Tuscany-2x/ws/sca-2x/maven/maven-tuscany-plugin/target/surefire-reports>

-------------------------------------------------------
 T E S T S
-------------------------------------------------------
There are no tests to run.

Results :

Tests run: 0, Failures: 0, Errors: 0, Skipped: 0

[HUDSON] Recording test results
[INFO] [jar:jar {execution: default-jar}]
[INFO] Building jar: <https://hudson.apache.org/hudson/job/Tuscany-2x/ws/sca-2x/maven/maven-tuscany-plugin/target/maven-tuscany-plugin-2.0-SNAPSHOT.jar>
[INFO] [plugin:addPluginArtifactMetadata {execution: default-addPluginArtifactMetadata}]
[INFO] [install:install {execution: default-install}]
[INFO] Installing <https://hudson.apache.org/hudson/job/Tuscany-2x/ws/sca-2x/maven/maven-tuscany-plugin/target/maven-tuscany-plugin-2.0-SNAPSHOT.jar> to /export/home/hudson/.m2/repository/org/apache/tuscany/maven/plugins/maven-tuscany-plugin/2.0-SNAPSHOT/maven-tuscany-plugin-2.0-SNAPSHOT.jar
Build timed out. Aborting
ERROR: Failed to parse POMs
hudson.remoting.ChannelClosedException: channel is already closed
	at hudson.remoting.Channel.send(Channel.java:467)
	at hudson.remoting.ProxyOutputStream._write(ProxyOutputStream.java:123)
	at hudson.remoting.ProxyOutputStream.write(ProxyOutputStream.java:103)
	at hudson.remoting.RemoteOutputStream.write(RemoteOutputStream.java:110)
	at java.io.BufferedOutputStream.flushBuffer(BufferedOutputStream.java:65)
	at java.io.BufferedOutputStream.flush(BufferedOutputStream.java:123)
	at java.io.BufferedOutputStream.flush(BufferedOutputStream.java:124)
	at java.io.ObjectOutputStream$BlockDataOutputStream.flush(ObjectOutputStream.java:1793)
	at java.io.ObjectOutputStream.flush(ObjectOutputStream.java:699)
	at hudson.remoting.Channel.send(Channel.java:473)
	at hudson.remoting.Request.call(Request.java:149)
	at hudson.remoting.Channel.call(Channel.java:630)
	at hudson.maven.ProcessCache$MavenProcess.call(ProcessCache.java:156)
	at hudson.maven.MavenModuleSetBuild$RunnerImpl.doRun(MavenModuleSetBuild.java:536)
	at hudson.model.AbstractBuild$AbstractRunner.run(AbstractBuild.java:416)
	at hudson.model.Run.run(Run.java:1324)
	at hudson.maven.MavenModuleSetBuild.run(MavenModuleSetBuild.java:349)
	at hudson.model.ResourceController.execute(ResourceController.java:88)
	at hudson.model.Executor.run(Executor.java:139)
Caused by: java.io.StreamCorruptedException: invalid type code: 00
	at java.io.ObjectInputStream.readObject0(ObjectInputStream.java:1355)
	at java.io.ObjectInputStream.defaultReadFields(ObjectInputStream.java:1946)
	at java.io.ObjectInputStream.readSerialData(ObjectInputStream.java:1870)
	at java.io.ObjectInputStream.readOrdinaryObject(ObjectInputStream.java:1752)
	at java.io.ObjectInputStream.readObject0(ObjectInputStream.java:1328)
	at java.io.ObjectInputStream.readObject(ObjectInputStream.java:350)
	at hudson.remoting.Channel$ReaderThread.run(Channel.java:948)
FATAL: channel is already closed
hudson.remoting.ChannelClosedException: channel is already closed
	at hudson.remoting.Channel.send(Channel.java:467)
	at hudson.remoting.Request.call(Request.java:105)
	at hudson.remoting.Channel.call(Channel.java:630)
	at hudson.Launcher$RemoteLauncher.kill(Launcher.java:744)
	at hudson.model.AbstractBuild$AbstractRunner.run(AbstractBuild.java:421)
	at hudson.model.Run.run(Run.java:1324)
	at hudson.maven.MavenModuleSetBuild.run(MavenModuleSetBuild.java:349)
	at hudson.model.ResourceController.execute(ResourceController.java:88)
	at hudson.model.Executor.run(Executor.java:139)
Caused by: java.io.StreamCorruptedException: invalid type code: 00
	at java.io.ObjectInputStream.readObject0(ObjectInputStream.java:1355)
	at java.io.ObjectInputStream.defaultReadFields(ObjectInputStream.java:1946)
	at java.io.ObjectInputStream.readSerialData(ObjectInputStream.java:1870)
	at java.io.ObjectInputStream.readOrdinaryObject(ObjectInputStream.java:1752)
	at java.io.ObjectInputStream.readObject0(ObjectInputStream.java:1328)
	at java.io.ObjectInputStream.readObject(ObjectInputStream.java:350)
	at hudson.remoting.Channel$ReaderThread.run(Channel.java:948)