You are viewing a plain text version of this content. The canonical link for it is here.
Posted to builds@lucene.apache.org by Apache Jenkins Server <je...@builds.apache.org> on 2026/08/19 15:01:58 UTC

[JENKINS] Lucene » Lucene-Coverage-main - Build # 1873 - Still Unstable!

Build: https://ci-builds.apache.org/job/Lucene/job/Lucene-Coverage-main/1873/

2 tests failed.
FAILED:  org.apache.lucene.expressions.js.TestJavascriptCompiler.testRecursionDepth1a()

Error Message:
java.lang.AssertionError: expected:<1024> but was:<-1>

Stack Trace:
java.lang.AssertionError: expected:<1024> but was:<-1>
	at __randomizedtesting.SeedChain.seed([5D639C569A59FC64:A7D34D765849A04A:29CFF71A776E7D21])
	at junit@4.13.2/org.junit.Assert.fail(Assert.java:89)
	at junit@4.13.2/org.junit.Assert.failNotEquals(Assert.java:835)
	at junit@4.13.2/org.junit.Assert.assertEquals(Assert.java:647)
	at junit@4.13.2/org.junit.Assert.assertEquals(Assert.java:633)
	at org.apache.lucene.expressions.js.TestJavascriptCompiler.testRecursionDepth1a(TestJavascriptCompiler.java:286)


FAILED:  org.apache.lucene.expressions.js.TestJavascriptCompiler.testRecursionDepth2()

Error Message:
java.lang.AssertionError: expected:<1024> but was:<-1>

Stack Trace:
java.lang.AssertionError: expected:<1024> but was:<-1>
	at __randomizedtesting.SeedChain.seed([5D639C569A59FC64:A7D34D765849A04A:5CB3CB29C99C0616])
	at junit@4.13.2/org.junit.Assert.fail(Assert.java:89)
	at junit@4.13.2/org.junit.Assert.failNotEquals(Assert.java:835)
	at junit@4.13.2/org.junit.Assert.assertEquals(Assert.java:647)
	at junit@4.13.2/org.junit.Assert.assertEquals(Assert.java:633)
	at org.apache.lucene.expressions.js.TestJavascriptCompiler.testRecursionDepth2(TestJavascriptCompiler.java:292)




Build Log:
[...truncated 1162 lines...]
ERROR: 2 tests have failed:

  - org.apache.lucene.expressions.js.TestJavascriptCompiler.testRecursionDepth2 (:lucene:expressions)
    Test output: /home/jenkins/jenkins-agent/workspace/Lucene/Lucene-Coverage-main/lucene/expressions/build/test-results/test/outputs/OUTPUT-org.apache.lucene.expressions.js.TestJavascriptCompiler.txt
    Reproduce with: gradlew :lucene:expressions:test --tests "org.apache.lucene.expressions.js.TestJavascriptCompiler.testRecursionDepth2" -Ptests.asserts=true -Ptests.coverage=true -Ptests.file.encoding=UTF-8 -Ptests.gui=true -Ptests.haltonfailure=false -Ptests.jvmargs= -Ptests.jvms=4 -Ptests.multiplier=2 -Ptests.seed=5D639C569A59FC64 -Ptests.vectorsize=default

  - org.apache.lucene.expressions.js.TestJavascriptCompiler.testRecursionDepth1a (:lucene:expressions)
    Test output: /home/jenkins/jenkins-agent/workspace/Lucene/Lucene-Coverage-main/lucene/expressions/build/test-results/test/outputs/OUTPUT-org.apache.lucene.expressions.js.TestJavascriptCompiler.txt
    Reproduce with: gradlew :lucene:expressions:test --tests "org.apache.lucene.expressions.js.TestJavascriptCompiler.testRecursionDepth1a" -Ptests.asserts=true -Ptests.coverage=true -Ptests.file.encoding=UTF-8 -Ptests.gui=true -Ptests.haltonfailure=false -Ptests.jvmargs= -Ptests.jvms=4 -Ptests.multiplier=2 -Ptests.seed=5D639C569A59FC64 -Ptests.vectorsize=default

The slowest tests during this run:
   9.66s TestNeverDelete.testIndexing (:lucene:core)
   9.45s TestDocValuesRewriteMethod.testRegexps (:lucene:core)
   7.08s TestRangeOnRangeFacetCounts.testRandomMultiDimLongs (:lucene:facet)
   6.57s TestRangeOnRangeFacetCounts.testRandomMultiDimDoubles (:lucene:facet)
   6.53s TestLucene90DocValuesFormatMergeInstance.testSparseDocValuesVsStoredFields (:lucene:core)
   4.83s TestCommonTermsQuery.testRandomIndex (:lucene:queries)
   4.73s TestUnifiedHighlighterRanking.testRanking (:lucene:highlighter)
   4.34s TestAssertingDocValuesFormat.testSortedNumericsSingleValuedVsStoredFields (:lucene:test-framework)
   4.31s TestSimpleTextNormsFormat.testThreads (:lucene:codecs)
   3.77s TestBooleanMinShouldMatch.testRandomQueries (:lucene:core)
The slowest suites during this run:
  26.95s TestLucene90DocValuesFormatMergeInstance (:lucene:core)
  25.46s TestBasicBackwardsCompatibility (:lucene:backward-codecs)
  24.74s TestLucene90DocValuesFormat (:lucene:core)
  20.48s TestAssertingDocValuesFormat (:lucene:test-framework)
  18.65s TestLucene90DocValuesFormatVariableSkipInterval (:lucene:core)
  18.33s TestSimpleTextDocValuesFormat (:lucene:codecs)
  15.90s TestAssertingNormsFormat (:lucene:test-framework)
  14.82s TestRangeOnRangeFacetCounts (:lucene:facet)
  14.08s TestIndexSortBackwardsCompatibility (:lucene:backward-codecs)
  14.04s TestPerFieldDocValuesFormat (:lucene:core)

[Incubating] Problems report is available at: file:///home/jenkins/jenkins-agent/workspace/Lucene/Lucene-Coverage-main/build/reports/problems/problems-report.html

Deprecated Gradle features were used in this build, making it incompatible with Gradle 10.

You can use '--warning-mode all' to show the individual deprecation warnings and determine if they come from your own scripts or plugins.

For more on this, please refer to https://docs.gradle.org/9.6.1/userguide/command_line_interface.html#sec:command_line_warnings in the Gradle documentation.

BUILD SUCCESSFUL in 13m 12s
373 actionable tasks: 293 executed, 80 up-to-date
Consider enabling configuration cache to speed up this build: https://docs.gradle.org/9.6.1/userguide/configuration_cache_enabling.html
Build step 'Invoke Gradle script' changed build result to SUCCESS
Archiving artifacts
‘**/build*/**/tests-cwd/*.hprof’ doesn’t match anything: ‘**’ exists but not ‘**/build*/**/tests-cwd/*.hprof’
No artifacts found that match the file pattern "**/build*/**/tests-cwd/*.hprof,**/*_pid*.log". Configuration error?
Recording test results
[Checks API] No suitable checks publisher found.
Build step 'Publish JUnit test result report' changed build result to UNSTABLE
Email was triggered for: Unstable (Test Failures)
Sending email for trigger: Unstable (Test Failures)

[JENKINS] Lucene » Lucene-Coverage-main - Build # 1878 - Still Unstable!

Posted by Apache Jenkins Server <je...@builds.apache.org>.
Build: https://ci-builds.apache.org/job/Lucene/job/Lucene-Coverage-main/1878/

3 tests failed.
FAILED:  org.apache.lucene.expressions.js.TestJavascriptCompiler.testRecursionDepth2()

Error Message:
java.lang.AssertionError: expected:<1024> but was:<-1>

Stack Trace:
java.lang.AssertionError: expected:<1024> but was:<-1>
	at __randomizedtesting.SeedChain.seed([ACE8F3B424CAAF51:56582294E6DAF37F:AD38A4CB770F5523])
	at junit@4.13.2/org.junit.Assert.fail(Assert.java:89)
	at junit@4.13.2/org.junit.Assert.failNotEquals(Assert.java:835)
	at junit@4.13.2/org.junit.Assert.assertEquals(Assert.java:647)
	at junit@4.13.2/org.junit.Assert.assertEquals(Assert.java:633)
	at org.apache.lucene.expressions.js.TestJavascriptCompiler.testRecursionDepth2(TestJavascriptCompiler.java:292)


FAILED:  org.apache.lucene.expressions.js.TestJavascriptCompiler.testRecursionDepth1()

Error Message:
java.lang.AssertionError: expected:<1024> but was:<-1>

Stack Trace:
java.lang.AssertionError: expected:<1024> but was:<-1>
	at __randomizedtesting.SeedChain.seed([ACE8F3B424CAAF51:56582294E6DAF37F:1D67637DCD30A88F])
	at junit@4.13.2/org.junit.Assert.fail(Assert.java:89)
	at junit@4.13.2/org.junit.Assert.failNotEquals(Assert.java:835)
	at junit@4.13.2/org.junit.Assert.assertEquals(Assert.java:647)
	at junit@4.13.2/org.junit.Assert.assertEquals(Assert.java:633)
	at org.apache.lucene.expressions.js.TestJavascriptCompiler.testRecursionDepth1(TestJavascriptCompiler.java:279)


FAILED:  org.apache.lucene.expressions.js.TestJavascriptCompiler.testRecursionDepth1a()

Error Message:
java.lang.AssertionError: expected:<1024> but was:<-1>

Stack Trace:
java.lang.AssertionError: expected:<1024> but was:<-1>
	at __randomizedtesting.SeedChain.seed([ACE8F3B424CAAF51:56582294E6DAF37F:D84498F8C9FD2E14])
	at junit@4.13.2/org.junit.Assert.fail(Assert.java:89)
	at junit@4.13.2/org.junit.Assert.failNotEquals(Assert.java:835)
	at junit@4.13.2/org.junit.Assert.assertEquals(Assert.java:647)
	at junit@4.13.2/org.junit.Assert.assertEquals(Assert.java:633)
	at org.apache.lucene.expressions.js.TestJavascriptCompiler.testRecursionDepth1a(TestJavascriptCompiler.java:286)




Build Log:
[...truncated 1176 lines...]
ERROR: 3 tests have failed:

  - org.apache.lucene.expressions.js.TestJavascriptCompiler.testRecursionDepth1a (:lucene:expressions)
    Test output: /home/jenkins/jenkins-agent/workspace/Lucene/Lucene-Coverage-main/lucene/expressions/build/test-results/test/outputs/OUTPUT-org.apache.lucene.expressions.js.TestJavascriptCompiler.txt
    Reproduce with: gradlew :lucene:expressions:test --tests "org.apache.lucene.expressions.js.TestJavascriptCompiler.testRecursionDepth1a" -Ptests.asserts=true -Ptests.coverage=true -Ptests.file.encoding=ISO-8859-1 -Ptests.gui=true -Ptests.haltonfailure=false -Ptests.jvmargs= -Ptests.jvms=4 -Ptests.multiplier=2 -Ptests.seed=ACE8F3B424CAAF51 -Ptests.vectorsize=128

  - org.apache.lucene.expressions.js.TestJavascriptCompiler.testRecursionDepth1 (:lucene:expressions)
    Test output: /home/jenkins/jenkins-agent/workspace/Lucene/Lucene-Coverage-main/lucene/expressions/build/test-results/test/outputs/OUTPUT-org.apache.lucene.expressions.js.TestJavascriptCompiler.txt
    Reproduce with: gradlew :lucene:expressions:test --tests "org.apache.lucene.expressions.js.TestJavascriptCompiler.testRecursionDepth1" -Ptests.asserts=true -Ptests.coverage=true -Ptests.file.encoding=ISO-8859-1 -Ptests.gui=true -Ptests.haltonfailure=false -Ptests.jvmargs= -Ptests.jvms=4 -Ptests.multiplier=2 -Ptests.seed=ACE8F3B424CAAF51 -Ptests.vectorsize=128

  - org.apache.lucene.expressions.js.TestJavascriptCompiler.testRecursionDepth2 (:lucene:expressions)
    Test output: /home/jenkins/jenkins-agent/workspace/Lucene/Lucene-Coverage-main/lucene/expressions/build/test-results/test/outputs/OUTPUT-org.apache.lucene.expressions.js.TestJavascriptCompiler.txt
    Reproduce with: gradlew :lucene:expressions:test --tests "org.apache.lucene.expressions.js.TestJavascriptCompiler.testRecursionDepth2" -Ptests.asserts=true -Ptests.coverage=true -Ptests.file.encoding=ISO-8859-1 -Ptests.gui=true -Ptests.haltonfailure=false -Ptests.jvmargs= -Ptests.jvms=4 -Ptests.multiplier=2 -Ptests.seed=ACE8F3B424CAAF51 -Ptests.vectorsize=128

The slowest tests during this run:
  12.58s TestSimpleTextNormsFormat.testThreads (:lucene:codecs)
   7.96s TestRangeFacetCounts.testRandomLongsMultiValued (:lucene:facet)
   6.03s TestIndexSorting.testRandom3 (:lucene:core)
   4.95s TestSimpleTextPointsFormat.testOneDimTwoValues (:lucene:codecs)
   4.85s TestFixedGapPostingsFormat.testDocsAndFreqsAndPositionsAndOffsetsAndPayloads (:lucene:codecs)
   4.72s TestVarGapFixedIntervalPostingsFormat.testDocsAndFreqsAndPositionsAndOffsetsAndPayloads (:lucene:codecs)
   4.49s TestSortedSetDocValuesFacets.testRandom (:lucene:facet)
   4.41s TestAssertingNormsFormat.testSparseShortRange (:lucene:test-framework)
   4.38s TestAssertingPostingsFormat.testDocsAndFreqsAndPositionsAndOffsetsAndPayloads (:lucene:test-framework)
   3.96s TestOrdsBlockTree.testDocsAndFreqsAndPositionsAndOffsetsAndPayloads (:lucene:codecs)
The slowest suites during this run:
  29.19s TestBasicBackwardsCompatibility (:lucene:backward-codecs)
  29.12s TestLucene90DocValuesFormat (:lucene:core)
  25.84s TestLucene90DocValuesFormatMergeInstance (:lucene:core)
  24.94s TestLucene90DocValuesFormatVariableSkipInterval (:lucene:core)
  22.31s TestSimpleTextNormsFormat (:lucene:codecs)
  21.68s TestAssertingDocValuesFormat (:lucene:test-framework)
  19.18s TestSimpleTextDocValuesFormat (:lucene:codecs)
  18.16s TestFixedGapPostingsFormat (:lucene:codecs)
  17.99s TestVarGapFixedIntervalPostingsFormat (:lucene:codecs)
  16.40s TestAssertingPostingsFormat (:lucene:test-framework)

[Incubating] Problems report is available at: file:///home/jenkins/jenkins-agent/workspace/Lucene/Lucene-Coverage-main/build/reports/problems/problems-report.html

Deprecated Gradle features were used in this build, making it incompatible with Gradle 10.

You can use '--warning-mode all' to show the individual deprecation warnings and determine if they come from your own scripts or plugins.

For more on this, please refer to https://docs.gradle.org/9.7.0/userguide/command_line_interface.html#sec:command_line_warnings in the Gradle documentation.

BUILD SUCCESSFUL in 13m 45s
373 actionable tasks: 293 executed, 80 up-to-date
Consider enabling configuration cache to speed up this build: https://docs.gradle.org/9.7.0/userguide/configuration_cache_enabling.html
Build step 'Invoke Gradle script' changed build result to SUCCESS
Archiving artifacts
‘**/build*/**/tests-cwd/*.hprof’ doesn’t match anything: ‘**’ exists but not ‘**/build*/**/tests-cwd/*.hprof’
No artifacts found that match the file pattern "**/build*/**/tests-cwd/*.hprof,**/*_pid*.log". Configuration error?
Recording test results
[Checks API] No suitable checks publisher found.
Build step 'Publish JUnit test result report' changed build result to UNSTABLE
Email was triggered for: Unstable (Test Failures)
Sending email for trigger: Unstable (Test Failures)

[JENKINS] Lucene » Lucene-Coverage-main - Build # 1877 - Still Unstable!

Posted by Apache Jenkins Server <je...@builds.apache.org>.
Build: https://ci-builds.apache.org/job/Lucene/job/Lucene-Coverage-main/1877/

2 tests failed.
FAILED:  org.apache.lucene.expressions.js.TestJavascriptCompiler.testRecursionDepth1()

Error Message:
java.lang.AssertionError: expected:<1024> but was:<-1>

Stack Trace:
java.lang.AssertionError: expected:<1024> but was:<-1>
	at __randomizedtesting.SeedChain.seed([15FB22174E972B51:EF4BF3378C87777F:A474B2DEA76D2C8F])
	at junit@4.13.2/org.junit.Assert.fail(Assert.java:89)
	at junit@4.13.2/org.junit.Assert.failNotEquals(Assert.java:835)
	at junit@4.13.2/org.junit.Assert.assertEquals(Assert.java:647)
	at junit@4.13.2/org.junit.Assert.assertEquals(Assert.java:633)
	at org.apache.lucene.expressions.js.TestJavascriptCompiler.testRecursionDepth1(TestJavascriptCompiler.java:279)


FAILED:  org.apache.lucene.expressions.js.TestJavascriptCompiler.testRecursionDepth1a()

Error Message:
java.lang.AssertionError: expected:<1024> but was:<-1>

Stack Trace:
java.lang.AssertionError: expected:<1024> but was:<-1>
	at __randomizedtesting.SeedChain.seed([15FB22174E972B51:EF4BF3378C87777F:6157495BA3A0AA14])
	at junit@4.13.2/org.junit.Assert.fail(Assert.java:89)
	at junit@4.13.2/org.junit.Assert.failNotEquals(Assert.java:835)
	at junit@4.13.2/org.junit.Assert.assertEquals(Assert.java:647)
	at junit@4.13.2/org.junit.Assert.assertEquals(Assert.java:633)
	at org.apache.lucene.expressions.js.TestJavascriptCompiler.testRecursionDepth1a(TestJavascriptCompiler.java:286)




Build Log:
[...truncated 1159 lines...]
ERROR: 2 tests have failed:

  - org.apache.lucene.expressions.js.TestJavascriptCompiler.testRecursionDepth1 (:lucene:expressions)
    Test output: /home/jenkins/jenkins-agent/workspace/Lucene/Lucene-Coverage-main/lucene/expressions/build/test-results/test/outputs/OUTPUT-org.apache.lucene.expressions.js.TestJavascriptCompiler.txt
    Reproduce with: gradlew :lucene:expressions:test --tests "org.apache.lucene.expressions.js.TestJavascriptCompiler.testRecursionDepth1" -Ptests.asserts=false -Ptests.coverage=true -Ptests.file.encoding=ISO-8859-1 -Ptests.gui=true -Ptests.haltonfailure=false -Ptests.jvmargs= -Ptests.jvms=4 -Ptests.multiplier=2 -Ptests.seed=15FB22174E972B51 -Ptests.vectorsize=128

  - org.apache.lucene.expressions.js.TestJavascriptCompiler.testRecursionDepth1a (:lucene:expressions)
    Test output: /home/jenkins/jenkins-agent/workspace/Lucene/Lucene-Coverage-main/lucene/expressions/build/test-results/test/outputs/OUTPUT-org.apache.lucene.expressions.js.TestJavascriptCompiler.txt
    Reproduce with: gradlew :lucene:expressions:test --tests "org.apache.lucene.expressions.js.TestJavascriptCompiler.testRecursionDepth1a" -Ptests.asserts=false -Ptests.coverage=true -Ptests.file.encoding=ISO-8859-1 -Ptests.gui=true -Ptests.haltonfailure=false -Ptests.jvmargs= -Ptests.jvms=4 -Ptests.multiplier=2 -Ptests.seed=15FB22174E972B51 -Ptests.vectorsize=128

The slowest tests during this run:
   7.49s TestAllGroupHeadsCollector.testRandom (:lucene:grouping)
   6.56s TestLatLonMultiPolygonShapeQueries.testRandomMedium (:lucene:core)
   6.53s TestLucene90DocValuesFormatMergeInstance.testSparseDocValuesVsStoredFields (:lucene:core)
   6.14s TestSimpleTextNormsFormat.testThreads (:lucene:codecs)
   5.68s TestAssertingNormsFormat.testSparseOutliers2 (:lucene:test-framework)
   5.53s TestAssertingDocValuesFormat.testLongNumericsVsStoredFields (:lucene:test-framework)
   4.83s TestRangeFacetCounts.testRandomLongsMultiValued (:lucene:facet)
   4.56s TestLongValueFacetCounts.testRandomMultiValued (:lucene:facet)
   4.27s TestBooleanOr.testBooleanScorerMax (:lucene:core)
   4.08s TestLongValueFacet.testRandomSingleValued (:lucene:sandbox)
The slowest suites during this run:
  29.68s TestLucene90DocValuesFormatMergeInstance (:lucene:core)
  27.37s TestLucene90DocValuesFormat (:lucene:core)
  26.16s TestBasicBackwardsCompatibility (:lucene:backward-codecs)
  22.81s TestLucene90DocValuesFormatVariableSkipInterval (:lucene:core)
  22.10s TestAssertingDocValuesFormat (:lucene:test-framework)
  18.92s TestSimpleTextDocValuesFormat (:lucene:codecs)
  17.05s TestAssertingNormsFormat (:lucene:test-framework)
  16.99s TestSimpleTextNormsFormat (:lucene:codecs)
  16.54s TestPerFieldDocValuesFormat (:lucene:core)
  15.50s TestFixedGapPostingsFormat (:lucene:codecs)

[Incubating] Problems report is available at: file:///home/jenkins/jenkins-agent/workspace/Lucene/Lucene-Coverage-main/build/reports/problems/problems-report.html

Deprecated Gradle features were used in this build, making it incompatible with Gradle 10.

You can use '--warning-mode all' to show the individual deprecation warnings and determine if they come from your own scripts or plugins.

For more on this, please refer to https://docs.gradle.org/9.7.0/userguide/command_line_interface.html#sec:command_line_warnings in the Gradle documentation.

BUILD SUCCESSFUL in 13m 29s
373 actionable tasks: 293 executed, 80 up-to-date
Consider enabling configuration cache to speed up this build: https://docs.gradle.org/9.7.0/userguide/configuration_cache_enabling.html
Build step 'Invoke Gradle script' changed build result to SUCCESS
Archiving artifacts
‘**/build*/**/tests-cwd/*.hprof’ doesn’t match anything: ‘**’ exists but not ‘**/build*/**/tests-cwd/*.hprof’
No artifacts found that match the file pattern "**/build*/**/tests-cwd/*.hprof,**/*_pid*.log". Configuration error?
Recording test results
[Checks API] No suitable checks publisher found.
Build step 'Publish JUnit test result report' changed build result to UNSTABLE
Email was triggered for: Unstable (Test Failures)
Sending email for trigger: Unstable (Test Failures)

[JENKINS] Lucene » Lucene-Coverage-main - Build # 1876 - Still Unstable!

Posted by Apache Jenkins Server <je...@builds.apache.org>.
Build: https://ci-builds.apache.org/job/Lucene/job/Lucene-Coverage-main/1876/

2 tests failed.
FAILED:  org.apache.lucene.expressions.js.TestJavascriptCompiler.testRecursionDepth1a()

Error Message:
java.lang.AssertionError: expected:<1024> but was:<-1>

Stack Trace:
java.lang.AssertionError: expected:<1024> but was:<-1>
	at __randomizedtesting.SeedChain.seed([4457E271F779388D:BEE73351356964A3:30FB893D1A4EB9C8])
	at junit@4.13.2/org.junit.Assert.fail(Assert.java:89)
	at junit@4.13.2/org.junit.Assert.failNotEquals(Assert.java:835)
	at junit@4.13.2/org.junit.Assert.assertEquals(Assert.java:647)
	at junit@4.13.2/org.junit.Assert.assertEquals(Assert.java:633)
	at org.apache.lucene.expressions.js.TestJavascriptCompiler.testRecursionDepth1a(TestJavascriptCompiler.java:286)


FAILED:  org.apache.lucene.expressions.js.TestJavascriptCompiler.testRecursionDepth2()

Error Message:
java.lang.AssertionError: expected:<1024> but was:<-1>

Stack Trace:
java.lang.AssertionError: expected:<1024> but was:<-1>
	at __randomizedtesting.SeedChain.seed([4457E271F779388D:BEE73351356964A3:4587B50EA4BCC2FF])
	at junit@4.13.2/org.junit.Assert.fail(Assert.java:89)
	at junit@4.13.2/org.junit.Assert.failNotEquals(Assert.java:835)
	at junit@4.13.2/org.junit.Assert.assertEquals(Assert.java:647)
	at junit@4.13.2/org.junit.Assert.assertEquals(Assert.java:633)
	at org.apache.lucene.expressions.js.TestJavascriptCompiler.testRecursionDepth2(TestJavascriptCompiler.java:292)




Build Log:
[...truncated 1159 lines...]
ERROR: 2 tests have failed:

  - org.apache.lucene.expressions.js.TestJavascriptCompiler.testRecursionDepth1a (:lucene:expressions)
    Test output: /home/jenkins/jenkins-agent/workspace/Lucene/Lucene-Coverage-main/lucene/expressions/build/test-results/test/outputs/OUTPUT-org.apache.lucene.expressions.js.TestJavascriptCompiler.txt
    Reproduce with: gradlew :lucene:expressions:test --tests "org.apache.lucene.expressions.js.TestJavascriptCompiler.testRecursionDepth1a" -Ptests.asserts=true -Ptests.coverage=true -Ptests.file.encoding=ISO-8859-1 -Ptests.gui=true -Ptests.haltonfailure=false -Ptests.jvmargs= -Ptests.jvms=4 -Ptests.multiplier=2 -Ptests.seed=4457E271F779388D -Ptests.vectorsize=512

  - org.apache.lucene.expressions.js.TestJavascriptCompiler.testRecursionDepth2 (:lucene:expressions)
    Test output: /home/jenkins/jenkins-agent/workspace/Lucene/Lucene-Coverage-main/lucene/expressions/build/test-results/test/outputs/OUTPUT-org.apache.lucene.expressions.js.TestJavascriptCompiler.txt
    Reproduce with: gradlew :lucene:expressions:test --tests "org.apache.lucene.expressions.js.TestJavascriptCompiler.testRecursionDepth2" -Ptests.asserts=true -Ptests.coverage=true -Ptests.file.encoding=ISO-8859-1 -Ptests.gui=true -Ptests.haltonfailure=false -Ptests.jvmargs= -Ptests.jvms=4 -Ptests.multiplier=2 -Ptests.seed=4457E271F779388D -Ptests.vectorsize=512

The slowest tests during this run:
  11.35s TestRangeOnRangeFacetCounts.testRandomMultiDimLongs (:lucene:facet)
   6.24s TestLongValueFacetCounts.testRandomMultiValued (:lucene:facet)
   6.22s TestBooleanOr.testBooleanScorerMax (:lucene:core)
   5.70s TestAllGroupHeadsCollector.testRandom (:lucene:grouping)
   4.71s TestLazyDocument.testLazy (:lucene:misc)
   4.39s TestCompressingTermVectorsFormat.testMergeStability (:lucene:core)
   4.38s TestAssertingNormsFormat.testFewLargeValues (:lucene:test-framework)
   4.29s TestSortedSetDocValuesFacets.testRandom (:lucene:facet)
   4.19s TestICUCollationDocValuesField.testRanges (:lucene:analysis:icu)
   4.14s TestTessellator.testComplexPolygon47 (:lucene:core)
The slowest suites during this run:
  26.90s TestBasicBackwardsCompatibility (:lucene:backward-codecs)
  26.42s TestLucene90DocValuesFormat (:lucene:core)
  24.52s TestLucene90DocValuesFormatMergeInstance (:lucene:core)
  21.75s TestLucene90DocValuesFormatVariableSkipInterval (:lucene:core)
  19.21s TestAssertingDocValuesFormat (:lucene:test-framework)
  17.62s TestRangeOnRangeFacetCounts (:lucene:facet)
  16.25s TestAssertingPostingsFormat (:lucene:test-framework)
  15.92s TestSimpleTextDocValuesFormat (:lucene:codecs)
  15.08s TestAssertingNormsFormat (:lucene:test-framework)
  14.22s TestPerFieldDocValuesFormat (:lucene:core)

[Incubating] Problems report is available at: file:///home/jenkins/jenkins-agent/workspace/Lucene/Lucene-Coverage-main/build/reports/problems/problems-report.html

Deprecated Gradle features were used in this build, making it incompatible with Gradle 10.

You can use '--warning-mode all' to show the individual deprecation warnings and determine if they come from your own scripts or plugins.

For more on this, please refer to https://docs.gradle.org/9.7.0/userguide/command_line_interface.html#sec:command_line_warnings in the Gradle documentation.

BUILD SUCCESSFUL in 13m 42s
373 actionable tasks: 293 executed, 80 up-to-date
Consider enabling configuration cache to speed up this build: https://docs.gradle.org/9.7.0/userguide/configuration_cache_enabling.html
Build step 'Invoke Gradle script' changed build result to SUCCESS
Archiving artifacts
‘**/build*/**/tests-cwd/*.hprof’ doesn’t match anything: ‘**’ exists but not ‘**/build*/**/tests-cwd/*.hprof’
No artifacts found that match the file pattern "**/build*/**/tests-cwd/*.hprof,**/*_pid*.log". Configuration error?
Recording test results
[Checks API] No suitable checks publisher found.
Build step 'Publish JUnit test result report' changed build result to UNSTABLE
Email was triggered for: Unstable (Test Failures)
Sending email for trigger: Unstable (Test Failures)

[JENKINS] Lucene » Lucene-Coverage-main - Build # 1875 - Still Unstable!

Posted by Apache Jenkins Server <je...@builds.apache.org>.
Build: https://ci-builds.apache.org/job/Lucene/job/Lucene-Coverage-main/1875/

2 tests failed.
FAILED:  org.apache.lucene.expressions.js.TestJavascriptCompiler.testRecursionDepth2()

Error Message:
java.lang.AssertionError: expected:<1024> but was:<-1>

Stack Trace:
java.lang.AssertionError: expected:<1024> but was:<-1>
	at __randomizedtesting.SeedChain.seed([C0A16E27B37E4AF9:3A11BF07716E16D7:C1713958E0BBB08B])
	at junit@4.13.2/org.junit.Assert.fail(Assert.java:89)
	at junit@4.13.2/org.junit.Assert.failNotEquals(Assert.java:835)
	at junit@4.13.2/org.junit.Assert.assertEquals(Assert.java:647)
	at junit@4.13.2/org.junit.Assert.assertEquals(Assert.java:633)
	at org.apache.lucene.expressions.js.TestJavascriptCompiler.testRecursionDepth2(TestJavascriptCompiler.java:292)


FAILED:  org.apache.lucene.expressions.js.TestJavascriptCompiler.testRecursionDepth1()

Error Message:
java.lang.AssertionError: expected:<1024> but was:<-1>

Stack Trace:
java.lang.AssertionError: expected:<1024> but was:<-1>
	at __randomizedtesting.SeedChain.seed([C0A16E27B37E4AF9:3A11BF07716E16D7:712EFEEE5A844D27])
	at junit@4.13.2/org.junit.Assert.fail(Assert.java:89)
	at junit@4.13.2/org.junit.Assert.failNotEquals(Assert.java:835)
	at junit@4.13.2/org.junit.Assert.assertEquals(Assert.java:647)
	at junit@4.13.2/org.junit.Assert.assertEquals(Assert.java:633)
	at org.apache.lucene.expressions.js.TestJavascriptCompiler.testRecursionDepth1(TestJavascriptCompiler.java:279)




Build Log:
[...truncated 1159 lines...]
ERROR: 2 tests have failed:

  - org.apache.lucene.expressions.js.TestJavascriptCompiler.testRecursionDepth2 (:lucene:expressions)
    Test output: /home/jenkins/jenkins-agent/workspace/Lucene/Lucene-Coverage-main/lucene/expressions/build/test-results/test/outputs/OUTPUT-org.apache.lucene.expressions.js.TestJavascriptCompiler.txt
    Reproduce with: gradlew :lucene:expressions:test --tests "org.apache.lucene.expressions.js.TestJavascriptCompiler.testRecursionDepth2" -Ptests.asserts=true -Ptests.coverage=true -Ptests.file.encoding=ISO-8859-1 -Ptests.gui=true -Ptests.haltonfailure=false -Ptests.jvmargs= -Ptests.jvms=4 -Ptests.multiplier=2 -Ptests.seed=C0A16E27B37E4AF9 -Ptests.vectorsize=512

  - org.apache.lucene.expressions.js.TestJavascriptCompiler.testRecursionDepth1 (:lucene:expressions)
    Test output: /home/jenkins/jenkins-agent/workspace/Lucene/Lucene-Coverage-main/lucene/expressions/build/test-results/test/outputs/OUTPUT-org.apache.lucene.expressions.js.TestJavascriptCompiler.txt
    Reproduce with: gradlew :lucene:expressions:test --tests "org.apache.lucene.expressions.js.TestJavascriptCompiler.testRecursionDepth1" -Ptests.asserts=true -Ptests.coverage=true -Ptests.file.encoding=ISO-8859-1 -Ptests.gui=true -Ptests.haltonfailure=false -Ptests.jvmargs= -Ptests.jvms=4 -Ptests.multiplier=2 -Ptests.seed=C0A16E27B37E4AF9 -Ptests.vectorsize=512

The slowest tests during this run:
  12.79s TestNeverDelete.testIndexing (:lucene:core)
   5.31s TestLucene90DocValuesFormat.testSparseDocValuesVsStoredFields (:lucene:core)
   5.26s TestSortOptimization.testSortOptimizationOnSortedNumericField (:lucene:core)
   5.13s TestLucene90DocValuesFormatMergeInstance.testSparseDocValuesVsStoredFields (:lucene:core)
   5.10s TestSimpleTextStoredFieldsFormat.testRandomStoredFieldsWithIndexSort (:lucene:codecs)
   4.95s TestTessellator.testComplexPolygon47 (:lucene:core)
   4.75s TestAssertingNormsFormat.testOutliers (:lucene:test-framework)
   4.45s TestRangeFacetCounts.testRandomLongsMultiValued (:lucene:facet)
   3.88s TestCommonTermsQuery.testRandomIndex (:lucene:queries)
   3.78s TestLatLonPolygonShapeQueries.testRandomMedium (:lucene:core)
The slowest suites during this run:
  30.21s TestBasicBackwardsCompatibility (:lucene:backward-codecs)
  27.78s TestLucene90DocValuesFormat (:lucene:core)
  24.95s TestLucene90DocValuesFormatMergeInstance (:lucene:core)
  20.44s TestAssertingDocValuesFormat (:lucene:test-framework)
  19.02s TestSimpleTextDocValuesFormat (:lucene:codecs)
  18.11s TestLucene90DocValuesFormatVariableSkipInterval (:lucene:core)
  16.36s TestPerFieldDocValuesFormat (:lucene:core)
  15.64s TestAssertingNormsFormat (:lucene:test-framework)
  14.58s TestDefaultCodecParallelizesIO (:lucene:core)
  14.45s TestFixedGapPostingsFormat (:lucene:codecs)

[Incubating] Problems report is available at: file:///home/jenkins/jenkins-agent/workspace/Lucene/Lucene-Coverage-main/build/reports/problems/problems-report.html

Deprecated Gradle features were used in this build, making it incompatible with Gradle 10.

You can use '--warning-mode all' to show the individual deprecation warnings and determine if they come from your own scripts or plugins.

For more on this, please refer to https://docs.gradle.org/9.7.0/userguide/command_line_interface.html#sec:command_line_warnings in the Gradle documentation.

BUILD SUCCESSFUL in 14m 34s
373 actionable tasks: 293 executed, 80 up-to-date
Consider enabling configuration cache to speed up this build: https://docs.gradle.org/9.7.0/userguide/configuration_cache_enabling.html
Build step 'Invoke Gradle script' changed build result to SUCCESS
Archiving artifacts
‘**/build*/**/tests-cwd/*.hprof’ doesn’t match anything: ‘**’ exists but not ‘**/build*/**/tests-cwd/*.hprof’
No artifacts found that match the file pattern "**/build*/**/tests-cwd/*.hprof,**/*_pid*.log". Configuration error?
Recording test results
[Checks API] No suitable checks publisher found.
Build step 'Publish JUnit test result report' changed build result to UNSTABLE
Email was triggered for: Unstable (Test Failures)
Sending email for trigger: Unstable (Test Failures)

[JENKINS] Lucene » Lucene-Coverage-main - Build # 1874 - Still Unstable!

Posted by Apache Jenkins Server <je...@builds.apache.org>.
Build: https://ci-builds.apache.org/job/Lucene/job/Lucene-Coverage-main/1874/

2 tests failed.
FAILED:  org.apache.lucene.expressions.js.TestJavascriptCompiler.testRecursionDepth1()

Error Message:
java.lang.AssertionError: expected:<1024> but was:<-1>

Stack Trace:
java.lang.AssertionError: expected:<1024> but was:<-1>
	at __randomizedtesting.SeedChain.seed([C9D6617253C24BC9:3366B05291D217E7:7859F1BBBA384C17])
	at junit@4.13.2/org.junit.Assert.fail(Assert.java:89)
	at junit@4.13.2/org.junit.Assert.failNotEquals(Assert.java:835)
	at junit@4.13.2/org.junit.Assert.assertEquals(Assert.java:647)
	at junit@4.13.2/org.junit.Assert.assertEquals(Assert.java:633)
	at org.apache.lucene.expressions.js.TestJavascriptCompiler.testRecursionDepth1(TestJavascriptCompiler.java:279)


FAILED:  org.apache.lucene.expressions.js.TestJavascriptCompiler.testRecursionDepth1a()

Error Message:
java.lang.AssertionError: expected:<1024> but was:<-1>

Stack Trace:
java.lang.AssertionError: expected:<1024> but was:<-1>
	at __randomizedtesting.SeedChain.seed([C9D6617253C24BC9:3366B05291D217E7:BD7A0A3EBEF5CA8C])
	at junit@4.13.2/org.junit.Assert.fail(Assert.java:89)
	at junit@4.13.2/org.junit.Assert.failNotEquals(Assert.java:835)
	at junit@4.13.2/org.junit.Assert.assertEquals(Assert.java:647)
	at junit@4.13.2/org.junit.Assert.assertEquals(Assert.java:633)
	at org.apache.lucene.expressions.js.TestJavascriptCompiler.testRecursionDepth1a(TestJavascriptCompiler.java:286)




Build Log:
[...truncated 1159 lines...]
ERROR: 2 tests have failed:

  - org.apache.lucene.expressions.js.TestJavascriptCompiler.testRecursionDepth1a (:lucene:expressions)
    Test output: /home/jenkins/jenkins-agent/workspace/Lucene/Lucene-Coverage-main/lucene/expressions/build/test-results/test/outputs/OUTPUT-org.apache.lucene.expressions.js.TestJavascriptCompiler.txt
    Reproduce with: gradlew :lucene:expressions:test --tests "org.apache.lucene.expressions.js.TestJavascriptCompiler.testRecursionDepth1a" -Ptests.asserts=true -Ptests.coverage=true -Ptests.file.encoding=UTF-8 -Ptests.gui=true -Ptests.haltonfailure=false -Ptests.jvmargs= -Ptests.jvms=4 -Ptests.multiplier=2 -Ptests.seed=C9D6617253C24BC9 -Ptests.vectorsize=128

  - org.apache.lucene.expressions.js.TestJavascriptCompiler.testRecursionDepth1 (:lucene:expressions)
    Test output: /home/jenkins/jenkins-agent/workspace/Lucene/Lucene-Coverage-main/lucene/expressions/build/test-results/test/outputs/OUTPUT-org.apache.lucene.expressions.js.TestJavascriptCompiler.txt
    Reproduce with: gradlew :lucene:expressions:test --tests "org.apache.lucene.expressions.js.TestJavascriptCompiler.testRecursionDepth1" -Ptests.asserts=true -Ptests.coverage=true -Ptests.file.encoding=UTF-8 -Ptests.gui=true -Ptests.haltonfailure=false -Ptests.jvmargs= -Ptests.jvms=4 -Ptests.multiplier=2 -Ptests.seed=C9D6617253C24BC9 -Ptests.vectorsize=128

The slowest tests during this run:
   6.90s TestBooleanOr.testBooleanScorerMax (:lucene:core)
   5.72s TestLucene90DocValuesFormat.testSparseDocValuesVsStoredFields (:lucene:core)
   5.65s TestDirectIODirectory.testRandomShort (:lucene:misc)
   4.83s TestSortOptimization.testSortOptimizationOnSortedNumericField (:lucene:core)
   4.66s TestAssertingNormsFormat.testMostZeros (:lucene:test-framework)
   4.57s TestRangeOnRangeFacetCounts.testRandomMultiDimDoubles (:lucene:facet)
   4.42s TestLucene90DocValuesFormatMergeInstance.testSparseDocValuesVsStoredFields (:lucene:core)
   4.17s TestDirectIODirectory.testRandomInt (:lucene:misc)
   3.86s TestAllGroupHeadsCollector.testRandom (:lucene:grouping)
   3.77s TestTessellator.testComplexPolygon47 (:lucene:core)
The slowest suites during this run:
  27.20s TestBasicBackwardsCompatibility (:lucene:backward-codecs)
  25.88s TestLucene90DocValuesFormat (:lucene:core)
  19.90s TestLucene90DocValuesFormatMergeInstance (:lucene:core)
  19.00s TestSimpleTextDocValuesFormat (:lucene:codecs)
  18.86s TestAssertingDocValuesFormat (:lucene:test-framework)
  18.35s TestLucene90DocValuesFormatVariableSkipInterval (:lucene:core)
  16.05s TestDirectIODirectory (:lucene:misc)
  14.84s TestAssertingNormsFormat (:lucene:test-framework)
  14.59s TestVarGapDocFreqIntervalPostingsFormat (:lucene:codecs)
  14.56s TestVarGapFixedIntervalPostingsFormat (:lucene:codecs)

[Incubating] Problems report is available at: file:///home/jenkins/jenkins-agent/workspace/Lucene/Lucene-Coverage-main/build/reports/problems/problems-report.html

Deprecated Gradle features were used in this build, making it incompatible with Gradle 10.

You can use '--warning-mode all' to show the individual deprecation warnings and determine if they come from your own scripts or plugins.

For more on this, please refer to https://docs.gradle.org/9.7.0/userguide/command_line_interface.html#sec:command_line_warnings in the Gradle documentation.

BUILD SUCCESSFUL in 14m 2s
373 actionable tasks: 293 executed, 80 up-to-date
Consider enabling configuration cache to speed up this build: https://docs.gradle.org/9.7.0/userguide/configuration_cache_enabling.html
Build step 'Invoke Gradle script' changed build result to SUCCESS
Archiving artifacts
‘**/build*/**/tests-cwd/*.hprof’ doesn’t match anything: ‘**’ exists but not ‘**/build*/**/tests-cwd/*.hprof’
No artifacts found that match the file pattern "**/build*/**/tests-cwd/*.hprof,**/*_pid*.log". Configuration error?
Recording test results
[Checks API] No suitable checks publisher found.
Build step 'Publish JUnit test result report' changed build result to UNSTABLE
Email was triggered for: Unstable (Test Failures)
Sending email for trigger: Unstable (Test Failures)