You are viewing a plain text version of this content. The canonical link for it is here.
Posted to builds@beam.apache.org by Apache Jenkins Server <je...@builds.apache.org> on 2023/05/15 00:36:34 UTC

Build failed in Jenkins: beam_Publish_Beam_SDK_Snapshots #5363

See <https://ci-beam.apache.org/job/beam_Publish_Beam_SDK_Snapshots/5363/display/redirect>

Changes:


------------------------------------------
[...truncated 2.45 MB...]
#16 1.804 google-apitools==0.5.31
#16 1.804 google-auth==2.17.1
#16 1.804 google-auth-httplib2==0.1.0
#16 1.804 google-auth-oauthlib==1.0.0
#16 1.804 google-cloud-bigquery==3.9.0
#16 1.804 google-cloud-bigquery-storage==2.19.1
#16 1.804 google-cloud-bigtable==2.17.0
#16 1.804 google-cloud-core==2.3.2
#16 1.804 google-cloud-datastore==2.15.1
#16 1.804 google-cloud-dlp==3.12.1
#16 1.804 google-cloud-language==2.9.1
#16 1.804 google-cloud-pubsub==2.15.2
#16 1.804 google-cloud-pubsublite==1.8.1
#16 1.804 google-cloud-recommendations-ai==0.10.3
#16 1.804 google-cloud-spanner==3.30.0
#16 1.804 google-cloud-videointelligence==2.11.1
#16 1.804 google-cloud-vision==3.4.1
#16 1.804 google-crc32c==1.5.0
#16 1.804 google-pasta==0.2.0
#16 1.804 google-resumable-media==2.4.1
#16 1.804 googleapis-common-protos==1.59.0
#16 1.804 greenlet==2.0.2
#16 1.804 grpc-google-iam-v1==0.12.6
#16 1.804 grpcio==1.53.0
#16 1.804 grpcio-status==1.53.0
#16 1.804 guppy3==3.1.2
#16 1.804 h5py==3.8.0
#16 1.804 hdfs==2.7.0
#16 1.804 httplib2==0.21.0
#16 1.804 hypothesis==6.70.2
#16 1.804 idna==3.4
#16 1.804 importlib-metadata==6.1.0
#16 1.804 iniconfig==2.0.0
#16 1.804 jax==0.4.8
#16 1.804 joblib==1.2.0
#16 1.804 keras==2.12.0
#16 1.804 libclang==16.0.0
#16 1.804 Markdown==3.4.3
#16 1.804 MarkupSafe==2.1.2
#16 1.804 ml-dtypes==0.0.4
#16 1.804 mmh3==3.1.0
#16 1.804 mock==5.0.1
#16 1.804 nltk==3.8.1
#16 1.804 nose==1.3.7
#16 1.804 numpy==1.23.5
#16 1.804 oauth2client==4.1.3
#16 1.804 oauthlib==3.2.2
#16 1.804 objsize==0.6.1
#16 1.804 opt-einsum==3.3.0
#16 1.804 orjson==3.8.9
#16 1.804 overrides==6.5.0
#16 1.804 packaging==23.0
#16 1.804 pandas==1.5.3
#16 1.804 parameterized==0.8.1
#16 1.804 pip==23.1.2
#16 1.804 pluggy==1.0.0
#16 1.804 proto-plus==1.22.2
#16 1.804 protobuf==4.22.1
#16 1.804 psycopg2-binary==2.9.6
#16 1.804 pyarrow==11.0.0
#16 1.804 pyasn1==0.4.8
#16 1.804 pyasn1-modules==0.2.8
#16 1.804 pycparser==2.21
#16 1.804 pydot==1.4.2
#16 1.804 PyHamcrest==1.10.1
#16 1.804 pymongo==4.3.3
#16 1.804 PyMySQL==1.0.3
#16 1.804 pyparsing==3.0.9
#16 1.804 pytest==7.2.2
#16 1.804 pytest-timeout==2.1.0
#16 1.804 pytest-xdist==3.2.1
#16 1.804 python-dateutil==2.8.2
#16 1.804 python-snappy==0.6.1
#16 1.804 pytz==2023.3
#16 1.804 PyYAML==6.0
#16 1.804 regex==2023.3.23
#16 1.804 requests==2.28.2
#16 1.804 requests-mock==1.10.0
#16 1.804 requests-oauthlib==1.3.1
#16 1.804 rsa==4.9
#16 1.804 scikit-learn==1.2.2
#16 1.804 scipy==1.10.1
#16 1.804 setuptools==67.7.2
#16 1.804 six==1.16.0
#16 1.804 sortedcontainers==2.4.0
#16 1.804 soupsieve==2.4
#16 1.804 SQLAlchemy==1.4.47
#16 1.804 sqlparse==0.4.3
#16 1.804 tenacity==8.2.2
#16 1.804 tensorboard==2.12.1
#16 1.804 tensorboard-data-server==0.7.0
#16 1.804 tensorboard-plugin-wit==1.8.1
#16 1.804 tensorflow==2.12.0
#16 1.804 tensorflow-estimator==2.12.0
#16 1.804 tensorflow-io-gcs-filesystem==0.32.0
#16 1.804 termcolor==2.2.0
#16 1.804 testcontainers==3.7.1
#16 1.804 threadpoolctl==3.1.0
#16 1.804 tomli==2.0.1
#16 1.804 tqdm==4.65.0
#16 1.804 typing_extensions==4.5.0
#16 1.804 urllib3==1.26.15
#16 1.804 websocket-client==1.5.1
#16 1.804 Werkzeug==2.2.3
#16 1.804 wheel==0.40.0
#16 1.804 wrapt==1.14.1
#16 1.804 zipp==3.15.0
#16 1.804 zstandard==0.20.0
#16 DONE 2.3s

#17 [beam 13/16] COPY target/LICENSE /opt/apache/beam/
#17 DONE 0.7s

#18 [beam 14/16] COPY target/LICENSE.python /opt/apache/beam/
#18 DONE 0.5s

#19 [beam 15/16] COPY target/NOTICE /opt/apache/beam/
#19 DONE 0.5s

#20 [beam 16/16] COPY target/launcher/linux_amd64/boot /opt/apache/beam/
#20 DONE 0.5s

#21 [third_party_licenses 1/4] COPY target/license_scripts /tmp/license_scripts/
#21 DONE 0.3s

#22 [third_party_licenses 2/4] COPY  target/go-licenses/* /opt/apache/beam/third_party_licenses/golang/
#22 DONE 0.2s

#23 [third_party_licenses 3/4] COPY target/license_scripts /tmp/license_scripts/
#23 DONE 0.2s

#24 [third_party_licenses 4/4] RUN if [ "true" = "true" ] ; then       pip install 'pip-licenses<5' pyyaml tenacity &&       python /tmp/license_scripts/pull_licenses_py.py ;     fi
#24 1.474 Collecting pip-licenses<5
#24 1.549   Downloading pip_licenses-4.3.1-py3-none-any.whl (19 kB)
#24 1.564 Requirement already satisfied: pyyaml in /usr/local/lib/python3.8/site-packages (6.0)
#24 1.565 Requirement already satisfied: tenacity in /usr/local/lib/python3.8/site-packages (8.2.2)
#24 1.651 Collecting prettytable>=2.3.0 (from pip-licenses<5)
#24 1.674   Downloading prettytable-3.7.0-py3-none-any.whl (27 kB)
#24 1.751 Collecting wcwidth (from prettytable>=2.3.0->pip-licenses<5)
#24 1.769   Downloading wcwidth-0.2.6-py2.py3-none-any.whl (29 kB)
#24 3.558 Installing collected packages: wcwidth, prettytable, pip-licenses
#24 3.828 Successfully installed pip-licenses-4.3.1 prettytable-3.7.0 wcwidth-0.2.6
#24 3.828 WARNING: Running pip as the 'root' user can result in broken permissions and conflicting behaviour with the system package manager. It is recommended to use a virtual environment instead: https://pip.pypa.io/warnings/venv
#24 11.48 INFO:root:Successfully pulled licenses for 133 dependencies
#24 11.48 Skip pulling license for  bs4
#24 DONE 12.0s

#25 [stage-2 1/2] COPY --from=third_party_licenses /opt/apache/beam/third_party_licenses /opt/apache/beam/third_party_licenses
#25 DONE 0.7s

#26 [stage-2 2/2] RUN if [ "true" != "true" ] ; then       rm -rf /opt/apache/beam/third_party_licenses ;     fi
#26 DONE 1.1s

#27 exporting to image
#27 exporting layers

> Task :sdks:python:container:py310:docker
#27 exporting layers 28.1s done
#27 writing image sha256:28d4115c69ffac6a7079480fe67f5e87532fb9fb5ee199fb9f90f9901429dca6
#27 writing image sha256:28d4115c69ffac6a7079480fe67f5e87532fb9fb5ee199fb9f90f9901429dca6 0.0s done
#27 naming to gcr.io/apache-beam-testing/beam-sdk/beam_python3.10_sdk:2.48.0.dev done
#27 DONE 28.1s

> Task :sdks:python:container:py310:dockerTag2.48.0-SNAPSHOT

> Task :sdks:python:container:py311:docker
#27 exporting layers 27.8s done
#27 writing image sha256:cf0ea1571496cceb12b990af8703d051b14e782ed8feb79352a35129f1ccab6b 0.0s done
#27 naming to gcr.io/apache-beam-testing/beam-sdk/beam_python3.11_sdk:2.48.0.dev done
#27 DONE 27.8s

> Task :sdks:python:container:py311:dockerTag2.48.0-SNAPSHOT

> Task :sdks:python:container:py39:docker
#27 exporting layers 23.8s done
#27 writing image sha256:f1d1d5fe59e1640423cf320620e4985754d3d97334ef01e97c28cc7612214647 done
#27 naming to gcr.io/apache-beam-testing/beam-sdk/beam_python3.9_sdk:2.48.0.dev done
#27 DONE 23.9s

> Task :sdks:python:container:py39:dockerTag2.48.0-SNAPSHOT

> Task :sdks:python:container:py38:docker
#27 exporting layers 22.5s done
#27 writing image sha256:c70cbc1a14edc0c96e7b18c2425858d6baabbe1e45142bd7f5b53d0ce88b2048
#27 writing image sha256:c70cbc1a14edc0c96e7b18c2425858d6baabbe1e45142bd7f5b53d0ce88b2048 done
#27 naming to gcr.io/apache-beam-testing/beam-sdk/beam_python3.8_sdk:2.48.0.dev done
#27 DONE 22.5s

> Task :sdks:python:container:py38:dockerTag2.48.0-SNAPSHOT
> Task :sdks:python:container:py37:dockerPush2.48.0-SNAPSHOT
> Task :sdks:python:container:py310:dockerPush2.48.0-SNAPSHOT
> Task :sdks:python:container:py311:dockerPush2.48.0-SNAPSHOT
> Task :sdks:python:container:py39:dockerPush2.48.0-SNAPSHOT
> Task :sdks:python:container:py38:dockerPush2.48.0-SNAPSHOT
> Task :sdks:python:container:py37:dockerTag6fedef1786688437b4ec53e5a78c4e76a26f714c
> Task :sdks:python:container:py37:dockerPush6fedef1786688437b4ec53e5a78c4e76a26f714c
> Task :sdks:python:container:py310:dockerTag6fedef1786688437b4ec53e5a78c4e76a26f714c
> Task :sdks:python:container:py37:dockerTagLatest
> Task :sdks:python:container:py310:dockerPush6fedef1786688437b4ec53e5a78c4e76a26f714c
> Task :sdks:python:container:py310:dockerTagLatest
> Task :sdks:python:container:py37:dockerPushLatest
> Task :sdks:python:container:py37:dockerTagsPush
> Task :sdks:python:container:py310:dockerPushLatest
> Task :sdks:python:container:py310:dockerTagsPush
> Task :sdks:python:container:py311:dockerTag6fedef1786688437b4ec53e5a78c4e76a26f714c
> Task :sdks:python:container:py311:dockerPush6fedef1786688437b4ec53e5a78c4e76a26f714c
> Task :sdks:python:container:py311:dockerTagLatest
> Task :sdks:python:container:py311:dockerPushLatest
> Task :sdks:python:container:py311:dockerTagsPush
> Task :sdks:python:container:py39:dockerTag6fedef1786688437b4ec53e5a78c4e76a26f714c
> Task :sdks:python:container:py39:dockerPush6fedef1786688437b4ec53e5a78c4e76a26f714c
> Task :sdks:python:container:py39:dockerTagLatest
> Task :sdks:python:container:py39:dockerPushLatest
> Task :sdks:python:container:py39:dockerTagsPush
> Task :sdks:python:container:py38:dockerTag6fedef1786688437b4ec53e5a78c4e76a26f714c
> Task :sdks:python:container:py38:dockerPush6fedef1786688437b4ec53e5a78c4e76a26f714c
> Task :sdks:python:container:py38:dockerTagLatest
> Task :sdks:python:container:py38:dockerPushLatest
> Task :sdks:python:container:py38:dockerTagsPush

FAILURE: Build failed with an exception.

* What went wrong:
Execution failed for task ':sdks:java:container:java8:docker'.
> Process 'command 'docker'' finished with non-zero exit value 1

* Try:
> Run with --stacktrace option to get the stack trace.
> Run with --info or --debug option to get more log output.

* Get more help at https://help.gradle.org

Deprecated Gradle features were used in this build, making it incompatible with Gradle 8.0.

You can use '--warning-mode all' to show the individual deprecation warnings and determine if they come from your own scripts or plugins.

See https://docs.gradle.org/7.5.1/userguide/command_line_interface.html#sec:command_line_warnings

Execution optimizations have been disabled for 3 invalid unit(s) of work during this build to ensure correctness.
Please consult deprecation warnings for more details.

BUILD FAILED in 23m 6s
200 actionable tasks: 188 executed, 12 up-to-date

Publishing build scan...
https://ge.apache.org/s/o3r2qhrsdowe6

Build step 'Invoke Gradle script' changed build result to FAILURE
Build step 'Invoke Gradle script' marked build as failure

---------------------------------------------------------------------
To unsubscribe, e-mail: builds-unsubscribe@beam.apache.org
For additional commands, e-mail: builds-help@beam.apache.org


Jenkins build is back to normal : beam_Publish_Beam_SDK_Snapshots #5366

Posted by Apache Jenkins Server <je...@builds.apache.org>.
See <https://ci-beam.apache.org/job/beam_Publish_Beam_SDK_Snapshots/5366/display/redirect>


---------------------------------------------------------------------
To unsubscribe, e-mail: builds-unsubscribe@beam.apache.org
For additional commands, e-mail: builds-help@beam.apache.org


Build failed in Jenkins: beam_Publish_Beam_SDK_Snapshots #5365

Posted by Apache Jenkins Server <je...@builds.apache.org>.
See <https://ci-beam.apache.org/job/beam_Publish_Beam_SDK_Snapshots/5365/display/redirect?page=changes>

Changes:

[noreply] Support configuration of maxCapacityPerShard when reading from Kinesis


------------------------------------------
[...truncated 53.49 KB...]
    return opener.open(url, data, timeout)
  File "/usr/lib/python3.8/urllib/request.py", line 531, in open
    response = meth(req, response)
  File "/usr/lib/python3.8/urllib/request.py", line 640, in http_response
    response = self.parent.error(
  File "/usr/lib/python3.8/urllib/request.py", line 569, in error
    return self._call_chain(*args)
  File "/usr/lib/python3.8/urllib/request.py", line 502, in _call_chain
    result = func(*args)
  File "/usr/lib/python3.8/urllib/request.py", line 649, in http_error_default
    raise HTTPError(req.full_url, code, msg, hdrs, fp)
urllib.error.HTTPError: HTTP Error 429: Too Many Requests
ERROR:root:Invalid url for re2j-1.6: https://golang.org/LICENSE. Retrying...
Traceback (most recent call last):
  File "<https://ci-beam.apache.org/job/beam_Publish_Beam_SDK_Snapshots/ws/src/sdks/java/container/license_scripts/pull_licenses_java.py",> line 62, in pull_from_url
    url_read = urlopen(Request(url, headers={
  File "/usr/lib/python3.8/urllib/request.py", line 222, in urlopen
    return opener.open(url, data, timeout)
  File "/usr/lib/python3.8/urllib/request.py", line 531, in open
    response = meth(req, response)
  File "/usr/lib/python3.8/urllib/request.py", line 640, in http_response
    response = self.parent.error(
  File "/usr/lib/python3.8/urllib/request.py", line 569, in error
    return self._call_chain(*args)
  File "/usr/lib/python3.8/urllib/request.py", line 502, in _call_chain
    result = func(*args)
  File "/usr/lib/python3.8/urllib/request.py", line 649, in http_error_default
    raise HTTPError(req.full_url, code, msg, hdrs, fp)
urllib.error.HTTPError: HTTP Error 429: Too Many Requests
ERROR:root:Invalid url for re2j-1.6: https://golang.org/LICENSE after 9 retries.
ERROR:root:['re2j-1.6']
ERROR:root:**************************************** Licenses were not able to be pulled automatically for some dependencies. Please search source code of the dependencies on the internet and add "license" and "notice" (if available) field to <https://ci-beam.apache.org/job/beam_Publish_Beam_SDK_Snapshots/ws/src/sdks/java/container/license_scripts/dep_urls_java.yaml> for each missing license. Dependency List: [re2j-1.6]
INFO:root:pull_licenses_java.py failed. It took 41.759381 seconds with 16 threads.
Traceback (most recent call last):
  File "<https://ci-beam.apache.org/job/beam_Publish_Beam_SDK_Snapshots/ws/src/sdks/java/container/license_scripts/pull_licenses_java.py",> line 330, in <module>
    raise RuntimeError('{n} error(s) occurred.'.format(n=len(error_msg)),
RuntimeError: ('1 error(s) occurred.', ['**************************************** Licenses were not able to be pulled automatically for some dependencies. Please search source code of the dependencies on the internet and add "license" and "notice" (if available) field to <https://ci-beam.apache.org/job/beam_Publish_Beam_SDK_Snapshots/ws/src/sdks/java/container/license_scripts/dep_urls_java.yaml> for each missing license. Dependency List: [re2j-1.6]'])

> Task :sdks:java:container:agent:compileJava
WARNING: An illegal reflective access operation has occurred
WARNING: Illegal reflective access by com.google.errorprone.util.ErrorProneTokens$CommentSavingTokenizer (file:/home/jenkins/.gradle/caches/modules-2/files-2.1/com.google.errorprone/error_prone_check_api/2.10.0/6203cac373051702c0cf8ca0bd36332fdc64903f/error_prone_check_api-2.10.0.jar) to field com.sun.tools.javac.parser.JavaTokenizer.reader
WARNING: Please consider reporting this to the maintainers of com.google.errorprone.util.ErrorProneTokens$CommentSavingTokenizer
WARNING: Use --illegal-access=warn to enable warnings of further illegal reflective access operations
WARNING: All illegal access operations will be denied in a future release

> Task :sdks:go:container:docker
#6 8.225 Selecting previously unselected package ca-certificates.
#6 8.225 Preparing to unpack .../ca-certificates_20210119_all.deb ...
#6 8.233 Unpacking ca-certificates (20210119) ...
#6 8.378 Setting up openssl (1.1.1n-0+deb11u4) ...
#6 8.420 Setting up ca-certificates (20210119) ...
#6 12.57 Updating certificates in /etc/ssl/certs...
#6 17.50 129 added, 0 removed; done.
#6 17.60 Processing triggers for ca-certificates (20210119) ...
#6 17.64 Updating certificates in /etc/ssl/certs...
#6 21.05 0 added, 0 removed; done.
#6 21.05 Running hooks in /etc/ca-certificates/update.d...
#6 21.09 done.
#6 DONE 25.2s

#7 [3/7] ADD target/linux_amd64/boot /opt/apache/beam/
#7 DONE 0.3s

#8 [4/7] COPY target/LICENSE /opt/apache/beam/
#8 DONE 0.1s

#9 [5/7] COPY target/NOTICE /opt/apache/beam/
#9 DONE 0.1s

#10 [6/7] COPY target/go-licenses/* /opt/apache/beam/third_party_licenses/golang/
#10 DONE 0.1s

#11 [7/7] RUN if [ "true" = "false" ] ; then     rm -rf /opt/apache/beam/third_party_licenses ;    fi
#11 DONE 0.9s

#12 exporting to image
#12 exporting layers
#12 exporting layers 0.4s done
#12 writing image sha256:d4f954a1ffbe8069fda1efe90ec21558db690e6e04180f8f46a682d50cbbed25 done
#12 naming to gcr.io/apache-beam-testing/beam-sdk/beam_go_sdk:latest done
#12 DONE 0.4s

> Task :release:go-licenses:java:dockerRun
+ rm -rf '/output/*'
+ go get github.com/apache/beam/sdks/v2/java/container
go: downloading github.com/apache/beam/sdks/v2 v2.47.0
go: downloading github.com/apache/beam v2.47.0+incompatible
go: downloading github.com/golang/protobuf v1.5.3
go: downloading google.golang.org/grpc v1.54.0
go: downloading google.golang.org/protobuf v1.30.0
go: downloading golang.org/x/sys v0.7.0
go: downloading golang.org/x/net v0.8.0
go: downloading google.golang.org/genproto v0.0.0-20230330154414-c0448cd141ea
go: downloading golang.org/x/text v0.8.0
go: added github.com/apache/beam/sdks/v2 v2.47.0
go: added github.com/golang/protobuf v1.5.3
go: added golang.org/x/net v0.8.0
go: added golang.org/x/sys v0.7.0
go: added golang.org/x/text v0.8.0
go: added google.golang.org/genproto v0.0.0-20230330154414-c0448cd141ea
go: added google.golang.org/grpc v1.54.0
go: added google.golang.org/protobuf v1.30.0
+ go-licenses save github.com/apache/beam/sdks/v2/java/container --save_path=/output/licenses
W0515 08:15:48.266747      32 library.go:101] "golang.org/x/sys/unix" contains non-Go code that can't be inspected for further dependencies:
/go/pkg/mod/golang.org/x/sys@v0.7.0/unix/asm_linux_amd64.s
+ go-licenses csv github.com/apache/beam/sdks/v2/java/container
+ tee /output/licenses/list.csv

> Task :sdks:go:container:dockerTag2.48.0-SNAPSHOT
> Task :sdks:java:container:agent:processResources NO-SOURCE
> Task :sdks:java:container:agent:classes
> Task :sdks:java:container:agent:jar

> Task :release:go-licenses:java:dockerRun
W0515 08:15:56.827434      74 library.go:101] "golang.org/x/sys/unix" contains non-Go code that can't be inspected for further dependencies:
/go/pkg/mod/golang.org/x/sys@v0.7.0/unix/asm_linux_amd64.s

> Task :sdks:go:container:dockerPush2.48.0-SNAPSHOT
> Task :sdks:go:container:dockerTag71af99f80f1f38dc0fa3b016ece27e5b45a17088
> Task :sdks:go:container:dockerPush71af99f80f1f38dc0fa3b016ece27e5b45a17088
> Task :sdks:go:container:dockerTagLatest
> Task :model:fn-execution:classes

> Task :sdks:go:container:dockerPushLatest
The push refers to repository [gcr.io/apache-beam-testing/beam-sdk/beam_go_sdk]
9c568c5bb005: Preparing
bba4eac4f73e: Preparing
d860521741e7: Preparing
a622631c40a9: Preparing
fa23e89557e8: Preparing
aec96ed20f42: Preparing
d925e0fae4e6: Preparing
aec96ed20f42: Waiting
d925e0fae4e6: Waiting
a622631c40a9: Layer already exists
fa23e89557e8: Layer already exists
9c568c5bb005: Layer already exists
bba4eac4f73e: Layer already exists
d925e0fae4e6: Layer already exists
aec96ed20f42: Layer already exists
d860521741e7: Layer already exists
latest: digest: sha256:a50ae7944a06206e9113b859d474bd04d91de44c5e8f428712a4fe26febe1a55 size: 1782

> Task :sdks:go:container:dockerTagsPush

> Task :release:go-licenses:java:dockerRun
W0515 08:16:02.162999      74 report.go:108] Error discovering license URL: getting file URL in library golang.org/x/net: source.ModuleInfo(ctx, "golang.org/x/net", "v0.8.0"): moduleInfoDynamic(ctx, client, "golang.org/x/net", "v0.8.0"): fetchMeta(ctx, client, "golang.org/x/net"): go-import and go-source meta tags not found: not found

> Task :model:fn-execution:shadowJar

> Task :release:go-licenses:java:dockerRun
github.com/apache/beam/sdks/v2/go,https://github.com/apache/beam/blob/sdks/v2.47.0/sdks/go/README.md,Apache-2.0
github.com/apache/beam/sdks/v2/java/container,https://github.com/apache/beam/blob/sdks/v2.47.0/sdks/LICENSE,Apache-2.0
github.com/golang/protobuf,https://github.com/golang/protobuf/blob/v1.5.3/LICENSE,BSD-3-Clause
golang.org/x/net,Unknown,BSD-3-Clause
golang.org/x/sys/unix,https://cs.opensource.google/go/x/sys/+/v0.7.0:LICENSE,BSD-3-Clause
golang.org/x/text,https://cs.opensource.google/go/x/text/+/v0.8.0:LICENSE,BSD-3-Clause
google.golang.org/genproto/googleapis/rpc/status,https://github.com/googleapis/go-genproto/blob/c0448cd141ea/LICENSE,Apache-2.0
google.golang.org/grpc,https://github.com/grpc/grpc-go/blob/v1.54.0/LICENSE,Apache-2.0
google.golang.org/protobuf,https://github.com/protocolbuffers/protobuf-go/blob/v1.30.0/LICENSE,BSD-3-Clause
+ chmod -R a+w /output/licenses

> Task :sdks:java:core:compileJava
> Task :release:go-licenses:java:createLicenses
> Task :sdks:java:container:java11:copyGolangLicenses
> Task :sdks:java:container:java8:copyGolangLicenses

> Task :sdks:java:core:compileJava
Note: Some input files use or override a deprecated API.
Note: Recompile with -Xlint:deprecation for details.
Note: Some input files use unchecked or unsafe operations.
Note: Recompile with -Xlint:unchecked for details.

> Task :sdks:java:core:classes
> Task :sdks:java:core:shadowJar

> Task :sdks:java:fn-execution:compileJava
Note: <https://ci-beam.apache.org/job/beam_Publish_Beam_SDK_Snapshots/ws/src/sdks/java/fn-execution/src/main/java/org/apache/beam/sdk/fn/data/BeamFnDataInboundObserver.java> uses or overrides a deprecated API.
Note: Recompile with -Xlint:deprecation for details.
Note: Some input files use unchecked or unsafe operations.
Note: Recompile with -Xlint:unchecked for details.

> Task :sdks:java:fn-execution:classes
> Task :sdks:java:fn-execution:jar
> Task :sdks:java:extensions:avro:compileJava
Note: Some input files use or override a deprecated API.
Note: Recompile with -Xlint:deprecation for details.
Note: Some input files use unchecked or unsafe operations.
Note: Recompile with -Xlint:unchecked for details.

> Task :sdks:java:extensions:avro:classes
> Task :sdks:java:extensions:avro:jar
> Task :runners:core-construction-java:compileJava
Note: Some input files use or override a deprecated API.
Note: Recompile with -Xlint:deprecation for details.
Note: Some input files use unchecked or unsafe operations.
Note: Recompile with -Xlint:unchecked for details.

> Task :runners:core-construction-java:classes
> Task :runners:core-construction-java:jar
> Task :runners:core-java:compileJava
Note: Some input files use or override a deprecated API.
Note: Recompile with -Xlint:deprecation for details.
Note: Some input files use unchecked or unsafe operations.
Note: Recompile with -Xlint:unchecked for details.

> Task :runners:core-java:classes
> Task :runners:core-java:jar

> Task :sdks:java:harness:compileJava
Note: Some input files use or override a deprecated API.
Note: Recompile with -Xlint:deprecation for details.
Note: Some input files use unchecked or unsafe operations.
Note: Recompile with -Xlint:unchecked for details.

> Task :sdks:java:harness:classes
> Task :sdks:java:harness:shadowJar
> Task :sdks:java:container:java8:copyDockerfileDependencies
> Task :sdks:java:container:java11:copyDockerfileDependencies

FAILURE: Build failed with an exception.

* What went wrong:
Execution failed for task ':sdks:java:container:pullLicenses'.
> Process 'command './license_scripts/license_script.sh'' finished with non-zero exit value 1

* Try:
> Run with --stacktrace option to get the stack trace.
> Run with --info or --debug option to get more log output.

* Get more help at https://help.gradle.org

Deprecated Gradle features were used in this build, making it incompatible with Gradle 8.0.

You can use '--warning-mode all' to show the individual deprecation warnings and determine if they come from your own scripts or plugins.

See https://docs.gradle.org/7.5.1/userguide/command_line_interface.html#sec:command_line_warnings

Execution optimizations have been disabled for 2 invalid unit(s) of work during this build to ensure correctness.
Please consult deprecation warnings for more details.

BUILD FAILED in 10m 55s
95 actionable tasks: 91 executed, 4 up-to-date

Publishing build scan...
https://ge.apache.org/s/jvy4bts3oejpw

Build step 'Invoke Gradle script' changed build result to FAILURE
Build step 'Invoke Gradle script' marked build as failure

---------------------------------------------------------------------
To unsubscribe, e-mail: builds-unsubscribe@beam.apache.org
For additional commands, e-mail: builds-help@beam.apache.org


Build failed in Jenkins: beam_Publish_Beam_SDK_Snapshots #5364

Posted by Apache Jenkins Server <je...@builds.apache.org>.
See <https://ci-beam.apache.org/job/beam_Publish_Beam_SDK_Snapshots/5364/display/redirect>

Changes:


------------------------------------------
[...truncated 2.45 MB...]
#16 2.508 six==1.16.0
#16 2.508 sortedcontainers==2.4.0
#16 2.508 soupsieve==2.4
#16 2.508 SQLAlchemy==1.4.47
#16 2.508 sqlparse==0.4.4
#16 2.508 tenacity==8.2.2
#16 2.508 tensorboard==2.12.1
#16 2.508 tensorboard-data-server==0.7.0
#16 2.508 tensorboard-plugin-wit==1.8.1
#16 2.508 tensorflow==2.12.0
#16 2.508 tensorflow-estimator==2.12.0
#16 2.508 tensorflow-io-gcs-filesystem==0.32.0
#16 2.508 termcolor==2.2.0
#16 2.508 testcontainers==3.7.1
#16 2.508 threadpoolctl==3.1.0
#16 2.508 tqdm==4.65.0
#16 2.508 typing_extensions==4.5.0
#16 2.508 urllib3==1.26.15
#16 2.508 websocket-client==1.5.1
#16 2.508 Werkzeug==2.2.3
#16 2.508 wheel==0.40.0
#16 2.508 wrapt==1.14.1
#16 2.508 zstandard==0.20.0
#16 DONE 2.8s

#17 [beam 13/16] COPY target/LICENSE /opt/apache/beam/
#17 DONE 0.2s

#18 [beam 14/16] COPY target/LICENSE.python /opt/apache/beam/
#18 DONE 0.3s

#19 [beam 15/16] COPY target/NOTICE /opt/apache/beam/
#19 DONE 0.3s

#20 [beam 16/16] COPY target/launcher/linux_amd64/boot /opt/apache/beam/
#20 DONE 0.4s

#21 [third_party_licenses 1/4] COPY target/license_scripts /tmp/license_scripts/
#21 DONE 0.3s

#22 [third_party_licenses 2/4] COPY  target/go-licenses/* /opt/apache/beam/third_party_licenses/golang/
#22 DONE 0.3s

#23 [third_party_licenses 3/4] COPY target/license_scripts /tmp/license_scripts/
#23 DONE 0.3s

#24 [third_party_licenses 4/4] RUN if [ "true" = "true" ] ; then       pip install 'pip-licenses<5' pyyaml tenacity &&       python /tmp/license_scripts/pull_licenses_py.py ;     fi
#24 2.038 Collecting pip-licenses<5
#24 2.144   Downloading pip_licenses-4.3.1-py3-none-any.whl (19 kB)
#24 2.160 Requirement already satisfied: pyyaml in /usr/local/lib/python3.11/site-packages (6.0)
#24 2.162 Requirement already satisfied: tenacity in /usr/local/lib/python3.11/site-packages (8.2.2)
#24 2.232 Collecting prettytable>=2.3.0 (from pip-licenses<5)
#24 2.253   Downloading prettytable-3.7.0-py3-none-any.whl (27 kB)
#24 2.337 Collecting wcwidth (from prettytable>=2.3.0->pip-licenses<5)
#24 2.353   Downloading wcwidth-0.2.6-py2.py3-none-any.whl (29 kB)
#24 4.040 Installing collected packages: wcwidth, prettytable, pip-licenses
#24 4.287 Successfully installed pip-licenses-4.3.1 prettytable-3.7.0 wcwidth-0.2.6
#24 4.288 WARNING: Running pip as the 'root' user can result in broken permissions and conflicting behaviour with the system package manager. It is recommended to use a virtual environment instead: https://pip.pypa.io/warnings/venv
#24 13.00 INFO:root:Successfully pulled licenses for 127 dependencies
#24 13.00 Skip pulling license for  bs4
#24 DONE 24.0s

#25 [stage-2 1/2] COPY --from=third_party_licenses /opt/apache/beam/third_party_licenses /opt/apache/beam/third_party_licenses
#25 DONE 0.9s

#26 [stage-2 2/2] RUN if [ "true" != "true" ] ; then       rm -rf /opt/apache/beam/third_party_licenses ;     fi
#26 DONE 1.6s

#27 exporting to image
#27 exporting layers

> Task :sdks:python:container:py39:docker
#18 DONE 0.5s

#19 [beam 15/16] COPY target/NOTICE /opt/apache/beam/
#19 DONE 0.3s

#20 [beam 16/16] COPY target/launcher/linux_amd64/boot /opt/apache/beam/
#20 DONE 0.5s

#21 [third_party_licenses 1/4] COPY target/license_scripts /tmp/license_scripts/
#21 DONE 0.2s

#22 [third_party_licenses 2/4] COPY  target/go-licenses/* /opt/apache/beam/third_party_licenses/golang/
#22 DONE 0.4s

#23 [third_party_licenses 3/4] COPY target/license_scripts /tmp/license_scripts/
#23 DONE 0.2s

#24 [third_party_licenses 4/4] RUN if [ "true" = "true" ] ; then       pip install 'pip-licenses<5' pyyaml tenacity &&       python /tmp/license_scripts/pull_licenses_py.py ;     fi
#24 2.022 Collecting pip-licenses<5
#24 2.094   Downloading pip_licenses-4.3.1-py3-none-any.whl (19 kB)
#24 2.110 Requirement already satisfied: pyyaml in /usr/local/lib/python3.9/site-packages (6.0)
#24 2.111 Requirement already satisfied: tenacity in /usr/local/lib/python3.9/site-packages (8.2.2)
#24 2.196 Collecting prettytable>=2.3.0 (from pip-licenses<5)
#24 2.217   Downloading prettytable-3.7.0-py3-none-any.whl (27 kB)
#24 2.322 Collecting wcwidth (from prettytable>=2.3.0->pip-licenses<5)
#24 2.342   Downloading wcwidth-0.2.6-py2.py3-none-any.whl (29 kB)
#24 4.264 Installing collected packages: wcwidth, prettytable, pip-licenses
#24 4.589 Successfully installed pip-licenses-4.3.1 prettytable-3.7.0 wcwidth-0.2.6
#24 4.590 WARNING: Running pip as the 'root' user can result in broken permissions and conflicting behaviour with the system package manager. It is recommended to use a virtual environment instead: https://pip.pypa.io/warnings/venv
#24 11.66 INFO:root:Successfully pulled licenses for 133 dependencies
#24 11.66 Skip pulling license for  bs4
#24 DONE 22.7s

#25 [stage-2 1/2] COPY --from=third_party_licenses /opt/apache/beam/third_party_licenses /opt/apache/beam/third_party_licenses
#25 DONE 1.2s

#26 [stage-2 2/2] RUN if [ "true" != "true" ] ; then       rm -rf /opt/apache/beam/third_party_licenses ;     fi
#26 DONE 1.2s

#27 exporting to image
#27 exporting layers

> Task :sdks:python:container:py38:docker
#24 DONE 23.1s

#25 [stage-2 1/2] COPY --from=third_party_licenses /opt/apache/beam/third_party_licenses /opt/apache/beam/third_party_licenses
#25 DONE 1.1s

#26 [stage-2 2/2] RUN if [ "true" != "true" ] ; then       rm -rf /opt/apache/beam/third_party_licenses ;     fi
#26 DONE 1.5s

#27 exporting to image
#27 exporting layers

> Task :sdks:python:container:py37:docker
#24 DONE 22.7s

#25 [stage-2 1/2] COPY --from=third_party_licenses /opt/apache/beam/third_party_licenses /opt/apache/beam/third_party_licenses
#25 DONE 1.3s

#26 [stage-2 2/2] RUN if [ "true" != "true" ] ; then       rm -rf /opt/apache/beam/third_party_licenses ;     fi
#26 DONE 2.5s

#27 exporting to image
#27 exporting layers
#27 exporting layers 21.2s done
#27 writing image sha256:cf1b46220f7fe5bb7078abc06dd9e446adc59f5a5dd8af9c2afae5f7190a6dbe
#27 writing image sha256:cf1b46220f7fe5bb7078abc06dd9e446adc59f5a5dd8af9c2afae5f7190a6dbe done
#27 naming to gcr.io/apache-beam-testing/beam-sdk/beam_python3.7_sdk:2.48.0.dev done
#27 DONE 21.2s

> Task :sdks:python:container:py310:docker

#25 [stage-2 1/2] COPY --from=third_party_licenses /opt/apache/beam/third_party_licenses /opt/apache/beam/third_party_licenses
#25 DONE 1.1s

#26 [stage-2 2/2] RUN if [ "true" != "true" ] ; then       rm -rf /opt/apache/beam/third_party_licenses ;     fi
#26 DONE 1.2s

#27 exporting to image
#27 exporting layers

> Task :sdks:python:container:py37:dockerTag2.48.0-SNAPSHOT

> Task :sdks:python:container:py39:docker
#27 exporting layers 28.5s done
#27 writing image sha256:8930d6f55be27398d49928b63defc9fb8493374f551e568d21acb3438dabc297 done
#27 naming to gcr.io/apache-beam-testing/beam-sdk/beam_python3.9_sdk:2.48.0.dev done
#27 DONE 28.6s

> Task :sdks:python:container:py39:dockerTag2.48.0-SNAPSHOT

> Task :sdks:python:container:py310:docker
#27 exporting layers 28.3s done
#27 writing image sha256:ef98a4382a88673944a35f88b289ebcc8e8147a764e437cceaddb239ba040fa2 0.0s done
#27 naming to gcr.io/apache-beam-testing/beam-sdk/beam_python3.10_sdk:2.48.0.dev done
#27 DONE 28.4s

> Task :sdks:python:container:py38:docker
#27 exporting layers 28.0s done

> Task :sdks:python:container:py310:dockerTag2.48.0-SNAPSHOT

> Task :sdks:python:container:py311:docker
#27 exporting layers 28.6s done
#27 writing image sha256:54ef6e2c02b26114bdb866fe54d69aa3b994ebbf8742032459a8afb5a8a199fc 0.0s done
#27 naming to gcr.io/apache-beam-testing/beam-sdk/beam_python3.11_sdk:2.48.0.dev done
#27 DONE 28.8s

> Task :sdks:python:container:py38:docker
#27 writing image sha256:b433ab90989f75c80797fb531674f2c2648a4570b822d8cd44bd1417370c7605 0.0s done
#27 naming to gcr.io/apache-beam-testing/beam-sdk/beam_python3.8_sdk:2.48.0.dev
#27 naming to gcr.io/apache-beam-testing/beam-sdk/beam_python3.8_sdk:2.48.0.dev done
#27 DONE 28.2s

> Task :sdks:python:container:py38:dockerTag2.48.0-SNAPSHOT
> Task :sdks:python:container:py311:dockerTag2.48.0-SNAPSHOT
> Task :sdks:python:container:py37:dockerPush2.48.0-SNAPSHOT
> Task :sdks:python:container:py39:dockerPush2.48.0-SNAPSHOT
> Task :sdks:python:container:py310:dockerPush2.48.0-SNAPSHOT
> Task :sdks:python:container:py38:dockerPush2.48.0-SNAPSHOT
> Task :sdks:python:container:py311:dockerPush2.48.0-SNAPSHOT
> Task :sdks:python:container:py37:dockerTag6fedef1786688437b4ec53e5a78c4e76a26f714c
> Task :sdks:python:container:py37:dockerPush6fedef1786688437b4ec53e5a78c4e76a26f714c
> Task :sdks:python:container:py39:dockerTag6fedef1786688437b4ec53e5a78c4e76a26f714c
> Task :sdks:python:container:py37:dockerTagLatest
> Task :sdks:python:container:py39:dockerPush6fedef1786688437b4ec53e5a78c4e76a26f714c
> Task :sdks:python:container:py39:dockerTagLatest
> Task :sdks:python:container:py37:dockerPushLatest
> Task :sdks:python:container:py37:dockerTagsPush
> Task :sdks:python:container:py39:dockerPushLatest
> Task :sdks:python:container:py39:dockerTagsPush
> Task :sdks:python:container:py310:dockerTag6fedef1786688437b4ec53e5a78c4e76a26f714c
> Task :sdks:python:container:py310:dockerPush6fedef1786688437b4ec53e5a78c4e76a26f714c
> Task :sdks:python:container:py310:dockerTagLatest
> Task :sdks:python:container:py310:dockerPushLatest
> Task :sdks:python:container:py310:dockerTagsPush
> Task :sdks:python:container:py38:dockerTag6fedef1786688437b4ec53e5a78c4e76a26f714c
> Task :sdks:python:container:py38:dockerPush6fedef1786688437b4ec53e5a78c4e76a26f714c
> Task :sdks:python:container:py38:dockerTagLatest
> Task :sdks:python:container:py38:dockerPushLatest
> Task :sdks:python:container:py38:dockerTagsPush
> Task :sdks:python:container:py311:dockerTag6fedef1786688437b4ec53e5a78c4e76a26f714c
> Task :sdks:python:container:py311:dockerPush6fedef1786688437b4ec53e5a78c4e76a26f714c
> Task :sdks:python:container:py311:dockerTagLatest
> Task :sdks:python:container:py311:dockerPushLatest
> Task :sdks:python:container:py311:dockerTagsPush

FAILURE: Build failed with an exception.

* What went wrong:
Execution failed for task ':sdks:java:container:java8:docker'.
> Process 'command 'docker'' finished with non-zero exit value 1

* Try:
> Run with --stacktrace option to get the stack trace.
> Run with --info or --debug option to get more log output.

* Get more help at https://help.gradle.org

Deprecated Gradle features were used in this build, making it incompatible with Gradle 8.0.

You can use '--warning-mode all' to show the individual deprecation warnings and determine if they come from your own scripts or plugins.

See https://docs.gradle.org/7.5.1/userguide/command_line_interface.html#sec:command_line_warnings

Execution optimizations have been disabled for 3 invalid unit(s) of work during this build to ensure correctness.
Please consult deprecation warnings for more details.

BUILD FAILED in 23m 3s
200 actionable tasks: 188 executed, 12 up-to-date

Publishing build scan...
https://ge.apache.org/s/5klykly2vsw3e

Build step 'Invoke Gradle script' changed build result to FAILURE
Build step 'Invoke Gradle script' marked build as failure

---------------------------------------------------------------------
To unsubscribe, e-mail: builds-unsubscribe@beam.apache.org
For additional commands, e-mail: builds-help@beam.apache.org