You are viewing a plain text version of this content. The canonical link for it is here.
Posted to server-dev@james.apache.org by Apache Hudson Server <hu...@hudson.apache.org> on 2011/02/16 23:38:53 UTC

Build failed in Hudson: mailbox-integration-tests #108

See <https://hudson.apache.org/hudson/job/mailbox-integration-tests/108/>

------------------------------------------
[...truncated 46 lines...]
[INFO] snapshot org.apache.james:apache-james-mailbox-memory:0.2-M2-SNAPSHOT: checking for updates from maven2-repository.dev.java.net
[INFO] snapshot org.apache.james:apache-james-mailbox-memory:0.2-M2-SNAPSHOT: checking for updates from apache.snapshots
[INFO] snapshot org.apache.james:apache-james-mailbox-torque:0.2-M2-SNAPSHOT: checking for updates from maven2-repository.dev.java.net
[INFO] snapshot org.apache.james:apache-james-mailbox-torque:0.2-M2-SNAPSHOT: checking for updates from apache.snapshots
Downloading: http://repository.apache.org/snapshots/org/apache/james/apache-james-mailbox-torque/0.2-M2-SNAPSHOT/apache-james-mailbox-torque-0.2-M2-20110216.202426-120.pom
3K downloaded  (apache-james-mailbox-torque-0.2-M2-20110216.202426-120.pom)
Downloading: http://repository.apache.org/snapshots/org/apache/james/apache-james-mailbox-store/0.2-M2-SNAPSHOT/apache-james-mailbox-store-0.2-M2-20110216.202426-202-tests.jar
37K downloaded  (apache-james-mailbox-store-0.2-M2-20110216.202426-202-tests.jar)
Downloading: http://repository.apache.org/snapshots/org/apache/james/apache-james-mailbox-torque/0.2-M2-SNAPSHOT/apache-james-mailbox-torque-0.2-M2-20110216.202426-120.jar
131K downloaded  (apache-james-mailbox-torque-0.2-M2-20110216.202426-120.jar)
[INFO] [resources:resources {execution: default-resources}]
[INFO] Using 'UTF-8' encoding to copy filtered resources.
[INFO] Copying 113 resources
[INFO] Copying 3 resources
[INFO] [compiler:compile {execution: default-compile}]
[INFO] Compiling 39 source files to <https://hudson.apache.org/hudson/job/mailbox-integration-tests/ws/target/classes>
[INFO] [bundle:manifest {execution: bundle-manifest}]
[WARNING] Embed-Dependency: clause "*;scope=runtime" did not match any dependencies
[INFO] [resources:testResources {execution: default-testResources}]
[INFO] Using 'UTF-8' encoding to copy filtered resources.
[INFO] Copying 4 resources
[INFO] Copying 3 resources
[INFO] [compiler:testCompile {execution: default-testCompile}]
[INFO] Compiling 105 source files to <https://hudson.apache.org/hudson/job/mailbox-integration-tests/ws/target/test-classes>
[INFO] [surefire:test {execution: default-test}]
[INFO] Surefire report directory: <https://hudson.apache.org/hudson/job/mailbox-integration-tests/ws/target/surefire-reports>

-------------------------------------------------------
 T E S T S
-------------------------------------------------------
Running org.apache.james.mailbox.torque.PartContentBuilderMultipartAlternativeTest
Tests run: 3, Failures: 0, Errors: 0, Skipped: 0, Time elapsed: 0.33 sec
Running org.apache.james.mailbox.inmemory.imap.FetchBodySectionTest
Tests run: 9, Failures: 0, Errors: 0, Skipped: 0, Time elapsed: 0.853 sec
Running org.apache.james.mailbox.inmemory.imap.FetchTest
Tests run: 24, Failures: 0, Errors: 0, Skipped: 0, Time elapsed: 1.074 sec
Running org.apache.james.mailbox.torque.MessageUtilsCountUnnormalLinesTest
Tests run: 5, Failures: 0, Errors: 0, Skipped: 0, Time elapsed: 0.026 sec
Running org.apache.james.mailbox.torque.imap.ConcurrentSessionsTest
Tests run: 21, Failures: 0, Errors: 0, Skipped: 0, Time elapsed: 5.758 sec
Running org.apache.james.mailbox.inmemory.imap.SelectedStateTest
Tests run: 30, Failures: 0, Errors: 0, Skipped: 0, Time elapsed: 0.916 sec
Running org.apache.james.mailbox.torque.imap.FetchBodyStructureTest
Tests run: 12, Failures: 0, Errors: 0, Skipped: 0, Time elapsed: 7.864 sec
Running org.apache.james.mailbox.inmemory.imap.SelectTest
Tests run: 3, Failures: 0, Errors: 0, Skipped: 0, Time elapsed: 0.55 sec
Running org.apache.james.mailbox.jpa.imap.FetchBodyStructureTest
Tests run: 12, Failures: 0, Errors: 0, Skipped: 0, Time elapsed: 7.342 sec
Running org.apache.james.mailbox.jcr.imap.SelectedInboxTest
Tests run: 42, Failures: 0, Errors: 42, Skipped: 0, Time elapsed: 2.473 sec <<< FAILURE!
Running org.apache.james.mailbox.torque.MessageRowUtilsTest
Tests run: 3, Failures: 0, Errors: 0, Skipped: 0, Time elapsed: 0.122 sec
Running org.apache.james.mailbox.jpa.imap.SecurityTest
Tests run: 21, Failures: 0, Errors: 0, Skipped: 0, Time elapsed: 1.819 sec
Running org.apache.james.mailbox.inmemory.imap.ConcurrentSessionsTest
Tests run: 21, Failures: 0, Errors: 0, Skipped: 0, Time elapsed: 0.77 sec
Running org.apache.james.mailbox.torque.imap.EventTest
Tests run: 3, Failures: 0, Errors: 0, Skipped: 0, Time elapsed: 3.164 sec
Running org.apache.james.mailbox.jpa.imap.ConcurrentSessionsTest
Tests run: 21, Failures: 0, Errors: 0, Skipped: 0, Time elapsed: 4.562 sec
Running org.apache.james.mailbox.maildir.imap.PartialFetchTest
Tests run: 12, Failures: 0, Errors: 0, Skipped: 0, Time elapsed: 1.19 sec
Running org.apache.james.mailbox.inmemory.imap.SecurityTest
Tests run: 21, Failures: 0, Errors: 0, Skipped: 0, Time elapsed: 0.292 sec
Running org.apache.james.mailbox.jcr.imap.SearchTest
Tests run: 6, Failures: 0, Errors: 6, Skipped: 0, Time elapsed: 0.93 sec <<< FAILURE!
Running org.apache.james.mailbox.inmemory.imap.EventTest
Tests run: 3, Failures: 0, Errors: 0, Skipped: 0, Time elapsed: 0.529 sec
Running org.apache.james.mailbox.torque.imap.FetchTest
Tests run: 24, Failures: 0, Errors: 0, Skipped: 0, Time elapsed: 6.997 sec
Running org.apache.james.mailbox.jcr.imap.FetchBodySectionTest
Tests run: 9, Failures: 0, Errors: 9, Skipped: 0, Time elapsed: 1.225 sec <<< FAILURE!
Running org.apache.james.mailbox.torque.SearchUtilsRFC822Test
Tests run: 6, Failures: 0, Errors: 0, Skipped: 0, Time elapsed: 0.376 sec
Running org.apache.james.mailbox.torque.imap.AuthenticatedStateTest
Tests run: 57, Failures: 0, Errors: 0, Skipped: 0, Time elapsed: 7.083 sec
Running org.apache.james.mailbox.maildir.imap.ConcurrentSessionsTest
Tests run: 21, Failures: 0, Errors: 0, Skipped: 0, Time elapsed: 1.084 sec
Running org.apache.james.mailbox.maildir.imap.FetchHeadersTest
Tests run: 6, Failures: 0, Errors: 0, Skipped: 0, Time elapsed: 1.038 sec
Running org.apache.james.mailbox.maildir.imap.SelectedInboxTest
Tests run: 42, Failures: 0, Errors: 0, Skipped: 0, Time elapsed: 1.18 sec
Running org.apache.james.mailbox.inmemory.imap.SelectedInboxTest
Tests run: 42, Failures: 0, Errors: 0, Skipped: 0, Time elapsed: 0.863 sec
Running org.apache.james.mailbox.maildir.imap.NonAuthenticatedStateTest
Tests run: 21, Failures: 0, Errors: 0, Skipped: 0, Time elapsed: 0.336 sec
Running org.apache.james.mailbox.maildir.imap.SelectedStateTest
Tests run: 30, Failures: 0, Errors: 0, Skipped: 0, Time elapsed: 1.442 sec
Running org.apache.james.mailbox.jpa.imap.SearchTest
Tests run: 6, Failures: 0, Errors: 0, Skipped: 0, Time elapsed: 11.337 sec
Running org.apache.james.mailbox.jpa.imap.ExpungeTest
Tests run: 3, Failures: 0, Errors: 0, Skipped: 0, Time elapsed: 3.706 sec
Running org.apache.james.mailbox.torque.imap.NonAuthenticatedStateTest
Tests run: 21, Failures: 0, Errors: 0, Skipped: 0, Time elapsed: 1.93 sec
Running org.apache.james.mailbox.jpa.imap.SelectedStateTest
Tests run: 30, Failures: 0, Errors: 0, Skipped: 0, Time elapsed: 6.254 sec
Running org.apache.james.mailbox.torque.imap.FetchHeadersTest
Tests run: 6, Failures: 0, Errors: 0, Skipped: 0, Time elapsed: 4.683 sec
Running org.apache.james.mailbox.jcr.imap.EventTest
Tests run: 3, Failures: 0, Errors: 3, Skipped: 0, Time elapsed: 0.833 sec <<< FAILURE!
Running org.apache.james.mailbox.jcr.imap.FetchTest
Tests run: 24, Failures: 0, Errors: 24, Skipped: 0, Time elapsed: 1.867 sec <<< FAILURE!
Running org.apache.james.mailbox.maildir.imap.AuthenticatedStateTest
Tests run: 57, Failures: 0, Errors: 0, Skipped: 0, Time elapsed: 1.237 sec
Running org.apache.james.mailbox.torque.SearchUtilsMultipartMixedTest
Tests run: 7, Failures: 0, Errors: 0, Skipped: 0, Time elapsed: 0.432 sec
Running org.apache.james.mailbox.torque.imap.PartialFetchTest
Tests run: 12, Failures: 0, Errors: 0, Skipped: 0, Time elapsed: 5.83 sec
Running org.apache.james.mailbox.jcr.imap.FetchHeadersTest
Tests run: 6, Failures: 0, Errors: 6, Skipped: 0, Time elapsed: 1.073 sec <<< FAILURE!
Running org.apache.james.mailbox.torque.imap.SecurityTest
Tests run: 21, Failures: 0, Errors: 0, Skipped: 0, Time elapsed: 1.817 sec
Running org.apache.james.mailbox.torque.imap.ListingTest
Tests run: 6, Failures: 0, Errors: 0, Skipped: 0, Time elapsed: 2.638 sec
Running org.apache.james.mailbox.maildir.imap.EventTest
Tests run: 3, Failures: 0, Errors: 0, Skipped: 0, Time elapsed: 0.684 sec
Running org.apache.james.mailbox.inmemory.imap.ExpungeTest
Tests run: 3, Failures: 0, Errors: 0, Skipped: 0, Time elapsed: 0.658 sec
Running org.apache.james.mailbox.torque.imap.SelectedStateTest
Tests run: 30, Failures: 0, Errors: 0, Skipped: 0, Time elapsed: 7.513 sec
Running org.apache.james.mailbox.torque.imap.SelectedInboxTest
Tests run: 42, Failures: 0, Errors: 0, Skipped: 0, Time elapsed: 7.039 sec
Running org.apache.james.mailbox.jpa.imap.RenameTest
Tests run: 9, Failures: 0, Errors: 0, Skipped: 0, Time elapsed: 6.657 sec
Running org.apache.james.mailbox.torque.imap.FetchBodySectionTest
Tests run: 9, Failures: 0, Errors: 0, Skipped: 0, Time elapsed: 5.108 sec
Running org.apache.james.mailbox.jpa.imap.FetchHeadersTest
Tests run: 6, Failures: 0, Errors: 0, Skipped: 0, Time elapsed: 4.346 sec
Running org.apache.james.mailbox.torque.SearchUtilsTest
Tests run: 40, Failures: 0, Errors: 0, Skipped: 0, Time elapsed: 0.219 sec
Running org.apache.james.mailbox.jpa.imap.UidSearchTest
Tests run: 6, Failures: 0, Errors: 0, Skipped: 0, Time elapsed: 12.453 sec
Running org.apache.james.mailbox.jpa.imap.AuthenticatedStateTest
Tests run: 57, Failures: 0, Errors: 0, Skipped: 0, Time elapsed: 4.667 sec
Running org.apache.james.mailbox.jpa.imap.SelectedInboxTest
Tests run: 42, Failures: 0, Errors: 0, Skipped: 0, Time elapsed: 4.341 sec
Running org.apache.james.mailbox.torque.imap.ExpungeTest
Tests run: 3, Failures: 0, Errors: 0, Skipped: 0, Time elapsed: 3.748 sec
Running org.apache.james.mailbox.maildir.imap.FetchTest
Tests run: 24, Failures: 0, Errors: 0, Skipped: 0, Time elapsed: 1.446 sec
Running org.apache.james.mailbox.torque.MessageUtilsNormalisedWriteToTest
Tests run: 8, Failures: 0, Errors: 0, Skipped: 0, Time elapsed: 0.029 sec
Running org.apache.james.mailbox.torque.imap.SelectTest
Tests run: 3, Failures: 0, Errors: 0, Skipped: 0, Time elapsed: 2.983 sec
Running org.apache.james.mailbox.maildir.imap.ListingTest
Tests run: 6, Failures: 0, Errors: 0, Skipped: 0, Time elapsed: 0.509 sec
Running org.apache.james.mailbox.jcr.imap.SelectedStateTest
Tests run: 30, Failures: 0, Errors: 30, Skipped: 0, Time elapsed: 2.073 sec <<< FAILURE!
Running org.apache.james.mailbox.maildir.imap.RenameTest
Tests run: 9, Failures: 0, Errors: 0, Skipped: 0, Time elapsed: 1.682 sec
Running org.apache.james.mailbox.inmemory.imap.RenameTest
Tests run: 9, Failures: 0, Errors: 0, Skipped: 0, Time elapsed: 0.903 sec
Running org.apache.james.mailbox.jcr.imap.NonAuthenticatedStateTest
Tests run: 21, Failures: 0, Errors: 21, Skipped: 0, Time elapsed: 1.763 sec <<< FAILURE!
Running org.apache.james.mailbox.maildir.imap.ExpungeTest
Tests run: 3, Failures: 0, Errors: 0, Skipped: 0, Time elapsed: 0.755 sec
Running org.apache.james.mailbox.jcr.imap.AuthenticatedStateTest
Tests run: 57, Failures: 0, Errors: 57, Skipped: 0, Time elapsed: 2.955 sec <<< FAILURE!
Running org.apache.james.mailbox.jcr.imap.ListingTest
Tests run: 6, Failures: 0, Errors: 6, Skipped: 0, Time elapsed: 1.016 sec <<< FAILURE!
Running org.apache.james.mailbox.inmemory.imap.ListingTest
Tests run: 6, Failures: 0, Errors: 0, Skipped: 0, Time elapsed: 0.345 sec
Running org.apache.james.mailbox.jpa.imap.SelectTest
Tests run: 3, Failures: 0, Errors: 0, Skipped: 0, Time elapsed: 2.558 sec
Running org.apache.james.mailbox.inmemory.imap.UidSearchTest
Tests run: 6, Failures: 0, Errors: 0, Skipped: 0, Time elapsed: 1.808 sec
Running org.apache.james.mailbox.jcr.imap.UidSearchTest
Tests run: 6, Failures: 0, Errors: 6, Skipped: 0, Time elapsed: 1.062 sec <<< FAILURE!
Running org.apache.james.mailbox.torque.imap.RenameTest
Tests run: 9, Failures: 0, Errors: 0, Skipped: 0, Time elapsed: 8.591 sec
Running org.apache.james.mailbox.inmemory.imap.PartialFetchTest
Tests run: 12, Failures: 0, Errors: 0, Skipped: 0, Time elapsed: 0.846 sec
Running org.apache.james.mailbox.jpa.imap.PartialFetchTest
Tests run: 12, Failures: 0, Errors: 0, Skipped: 0, Time elapsed: 5.162 sec
Running org.apache.james.mailbox.jcr.imap.SecurityTest
Tests run: 21, Failures: 0, Errors: 21, Skipped: 0, Time elapsed: 1.778 sec <<< FAILURE!
Running org.apache.james.mailbox.jcr.imap.FetchBodyStructureTest
Tests run: 12, Failures: 0, Errors: 12, Skipped: 0, Time elapsed: 1.379 sec <<< FAILURE!
Running org.apache.james.mailbox.jpa.imap.ListingTest
Tests run: 6, Failures: 0, Errors: 0, Skipped: 0, Time elapsed: 2.469 sec
Running org.apache.james.mailbox.inmemory.imap.SearchTest
Tests run: 6, Failures: 0, Errors: 0, Skipped: 0, Time elapsed: 1.834 sec
Running org.apache.james.mailbox.maildir.imap.SelectTest
Tests run: 3, Failures: 0, Errors: 0, Skipped: 0, Time elapsed: 0.632 sec
Running org.apache.james.mailbox.maildir.imap.FetchBodyStructureTest
Tests run: 12, Failures: 0, Errors: 0, Skipped: 0, Time elapsed: 2.179 sec
Running org.apache.james.mailbox.inmemory.imap.FetchBodyStructureTest
Tests run: 12, Failures: 0, Errors: 0, Skipped: 0, Time elapsed: 1.583 sec
Running org.apache.james.mailbox.inmemory.imap.NonAuthenticatedStateTest
Tests run: 21, Failures: 0, Errors: 0, Skipped: 0, Time elapsed: 0.313 sec
Running org.apache.james.mailbox.torque.PartContentBuilderComplexMultipartTest
Tests run: 8, Failures: 0, Errors: 0, Skipped: 0, Time elapsed: 0.379 sec
Running org.apache.james.mailbox.inmemory.imap.FetchHeadersTest
Tests run: 6, Failures: 0, Errors: 0, Skipped: 0, Time elapsed: 0.764 sec
Running org.apache.james.mailbox.maildir.imap.SecurityTest
Tests run: 21, Failures: 0, Errors: 0, Skipped: 0, Time elapsed: 0.279 sec
Running org.apache.james.mailbox.jpa.imap.NonAuthenticatedStateTest
Tests run: 21, Failures: 0, Errors: 0, Skipped: 0, Time elapsed: 1.98 sec
Running org.apache.james.mailbox.maildir.imap.FetchBodySectionTest
Tests run: 9, Failures: 0, Errors: 0, Skipped: 0, Time elapsed: 1.036 sec
Running org.apache.james.mailbox.torque.imap.SearchTest
Tests run: 6, Failures: 0, Errors: 0, Skipped: 0, Time elapsed: 11.191 sec
Running org.apache.james.mailbox.jpa.imap.FetchBodySectionTest
Tests run: 9, Failures: 0, Errors: 0, Skipped: 0, Time elapsed: 4.344 sec
Running org.apache.james.mailbox.jpa.imap.FetchTest
Tests run: 24, Failures: 0, Errors: 0, Skipped: 0, Time elapsed: 5.605 sec
Running org.apache.james.mailbox.maildir.imap.UidSearchTest
Tests run: 6, Failures: 0, Errors: 0, Skipped: 0, Time elapsed: 3.244 sec
Running org.apache.james.mailbox.torque.imap.UidSearchTest
Tests run: 6, Failures: 0, Errors: 0, Skipped: 0, Time elapsed: 13.167 sec
Running org.apache.james.mailbox.jcr.imap.ExpungeTest
Tests run: 3, Failures: 0, Errors: 3, Skipped: 0, Time elapsed: 0.808 sec <<< FAILURE!
Running org.apache.james.mailbox.jcr.imap.PartialFetchTest
Tests run: 12, Failures: 0, Errors: 12, Skipped: 0, Time elapsed: 1.313 sec <<< FAILURE!
Running org.apache.james.mailbox.jcr.imap.SelectTest
Tests run: 3, Failures: 0, Errors: 3, Skipped: 0, Time elapsed: 0.75 sec <<< FAILURE!
Running org.apache.james.mailbox.jpa.imap.EventTest
Tests run: 3, Failures: 0, Errors: 0, Skipped: 0, Time elapsed: 2.837 sec
Running org.apache.james.mailbox.jcr.imap.RenameTest
Tests run: 9, Failures: 0, Errors: 9, Skipped: 0, Time elapsed: 1.104 sec <<< FAILURE!
Running org.apache.james.mailbox.jcr.imap.ConcurrentSessionsTest
Tests run: 21, Failures: 0, Errors: 21, Skipped: 0, Time elapsed: 1.614 sec <<< FAILURE!
Running org.apache.james.mailbox.inmemory.imap.AuthenticatedStateTest
Tests run: 57, Failures: 0, Errors: 0, Skipped: 0, Time elapsed: 0.892 sec

Results :

Tests in error: 

Tests run: 1529, Failures: 0, Errors: 291, Skipped: 0

[HUDSON] Recording test results
[HUDSON] Archiving <https://hudson.apache.org/hudson/job/mailbox-integration-tests/ws/pom.xml> to /home/hudson/hudson/jobs/mailbox-integration-tests/modules/org.apache.james$apache-james-mailbox-integration-tester/builds/2011-02-16_22-32-20/archive/org.apache.james/apache-james-mailbox-integration-tester/0.2-M2-SNAPSHOT/pom.xml
[INFO] ------------------------------------------------------------------------
[ERROR] BUILD FAILURE
[INFO] ------------------------------------------------------------------------
[INFO] There are test failures.

Please refer to <https://hudson.apache.org/hudson/job/mailbox-integration-tests/ws/target/surefire-reports> for the individual test results.
[INFO] ------------------------------------------------------------------------
[INFO] For more information, run Maven with the -e switch
[INFO] ------------------------------------------------------------------------
[INFO] Total time: 6 minutes 3 seconds
[INFO] Finished at: Wed Feb 16 14:38:50 GMT-08:00 2011
[INFO] Final Memory: 36M/204M
[INFO] ------------------------------------------------------------------------
Maven failed with error.
Sending e-mails to: server-dev@james.apache.org
channel stopped


---------------------------------------------------------------------
To unsubscribe, e-mail: server-dev-unsubscribe@james.apache.org
For additional commands, e-mail: server-dev-help@james.apache.org


Hudson build is back to normal : mailbox-integration-tests #111

Posted by Apache Hudson Server <hu...@hudson.apache.org>.
See <https://hudson.apache.org/hudson/job/mailbox-integration-tests/111/changes>



---------------------------------------------------------------------
To unsubscribe, e-mail: server-dev-unsubscribe@james.apache.org
For additional commands, e-mail: server-dev-help@james.apache.org


Build failed in Hudson: mailbox-integration-tests #110

Posted by Apache Hudson Server <hu...@hudson.apache.org>.
See <https://hudson.apache.org/hudson/job/mailbox-integration-tests/110/>

------------------------------------------
[...truncated 42 lines...]
[INFO] snapshot org.apache.james:apache-james-mailbox-maildir:0.2-M2-SNAPSHOT: checking for updates from maven2-repository.dev.java.net
[INFO] snapshot org.apache.james:apache-james-mailbox-maildir:0.2-M2-SNAPSHOT: checking for updates from apache.snapshots
[INFO] snapshot org.apache.james:apache-james-mailbox-memory:0.2-M2-SNAPSHOT: checking for updates from maven2-repository.dev.java.net
[INFO] snapshot org.apache.james:apache-james-mailbox-memory:0.2-M2-SNAPSHOT: checking for updates from apache.snapshots
[INFO] snapshot org.apache.james:apache-james-mailbox-torque:0.2-M2-SNAPSHOT: checking for updates from maven2-repository.dev.java.net
[INFO] snapshot org.apache.james:apache-james-mailbox-torque:0.2-M2-SNAPSHOT: checking for updates from apache.snapshots
Downloading: http://repository.apache.org/snapshots/org/apache/james/apache-james-mailbox-torque/0.2-M2-SNAPSHOT/apache-james-mailbox-torque-0.2-M2-20110217.040413-121.pom
3K downloaded  (apache-james-mailbox-torque-0.2-M2-20110217.040413-121.pom)
Downloading: http://repository.apache.org/snapshots/org/apache/james/apache-james-mailbox-torque/0.2-M2-SNAPSHOT/apache-james-mailbox-torque-0.2-M2-20110217.040413-121.jar
131K downloaded  (apache-james-mailbox-torque-0.2-M2-20110217.040413-121.jar)
[INFO] [resources:resources {execution: default-resources}]
[INFO] Using 'UTF-8' encoding to copy filtered resources.
[INFO] Copying 113 resources
[INFO] Copying 3 resources
[INFO] [compiler:compile {execution: default-compile}]
[INFO] Compiling 39 source files to <https://hudson.apache.org/hudson/job/mailbox-integration-tests/ws/target/classes>
[INFO] [bundle:manifest {execution: bundle-manifest}]
[WARNING] Embed-Dependency: clause "*;scope=runtime" did not match any dependencies
[INFO] [resources:testResources {execution: default-testResources}]
[INFO] Using 'UTF-8' encoding to copy filtered resources.
[INFO] Copying 4 resources
[INFO] Copying 3 resources
[INFO] [compiler:testCompile {execution: default-testCompile}]
[INFO] Compiling 105 source files to <https://hudson.apache.org/hudson/job/mailbox-integration-tests/ws/target/test-classes>
[INFO] [surefire:test {execution: default-test}]
[INFO] Surefire report directory: <https://hudson.apache.org/hudson/job/mailbox-integration-tests/ws/target/surefire-reports>

-------------------------------------------------------
 T E S T S
-------------------------------------------------------
Running org.apache.james.mailbox.torque.PartContentBuilderMultipartAlternativeTest
Tests run: 3, Failures: 0, Errors: 0, Skipped: 0, Time elapsed: 0.327 sec
Running org.apache.james.mailbox.inmemory.imap.FetchBodySectionTest
Tests run: 9, Failures: 0, Errors: 0, Skipped: 0, Time elapsed: 0.817 sec
Running org.apache.james.mailbox.inmemory.imap.FetchTest
Tests run: 24, Failures: 0, Errors: 0, Skipped: 0, Time elapsed: 1.082 sec
Running org.apache.james.mailbox.torque.MessageUtilsCountUnnormalLinesTest
Tests run: 5, Failures: 0, Errors: 0, Skipped: 0, Time elapsed: 0.025 sec
Running org.apache.james.mailbox.torque.imap.ConcurrentSessionsTest
Tests run: 21, Failures: 0, Errors: 0, Skipped: 0, Time elapsed: 5.757 sec
Running org.apache.james.mailbox.inmemory.imap.SelectedStateTest
Tests run: 30, Failures: 0, Errors: 0, Skipped: 0, Time elapsed: 0.94 sec
Running org.apache.james.mailbox.torque.imap.FetchBodyStructureTest
Tests run: 12, Failures: 0, Errors: 0, Skipped: 0, Time elapsed: 8.134 sec
Running org.apache.james.mailbox.inmemory.imap.SelectTest
Tests run: 3, Failures: 0, Errors: 0, Skipped: 0, Time elapsed: 0.547 sec
Running org.apache.james.mailbox.jpa.imap.FetchBodyStructureTest
Tests run: 12, Failures: 0, Errors: 0, Skipped: 0, Time elapsed: 7.455 sec
Running org.apache.james.mailbox.jcr.imap.SelectedInboxTest
Tests run: 42, Failures: 0, Errors: 42, Skipped: 0, Time elapsed: 2.698 sec <<< FAILURE!
Running org.apache.james.mailbox.torque.MessageRowUtilsTest
Tests run: 3, Failures: 0, Errors: 0, Skipped: 0, Time elapsed: 0.118 sec
Running org.apache.james.mailbox.jpa.imap.SecurityTest
Tests run: 21, Failures: 0, Errors: 0, Skipped: 0, Time elapsed: 1.837 sec
Running org.apache.james.mailbox.inmemory.imap.ConcurrentSessionsTest
Tests run: 21, Failures: 0, Errors: 0, Skipped: 0, Time elapsed: 0.77 sec
Running org.apache.james.mailbox.torque.imap.EventTest
Tests run: 3, Failures: 0, Errors: 0, Skipped: 0, Time elapsed: 3.145 sec
Running org.apache.james.mailbox.jpa.imap.ConcurrentSessionsTest
Tests run: 21, Failures: 0, Errors: 0, Skipped: 0, Time elapsed: 4.319 sec
Running org.apache.james.mailbox.maildir.imap.PartialFetchTest
Tests run: 12, Failures: 0, Errors: 0, Skipped: 0, Time elapsed: 1.286 sec
Running org.apache.james.mailbox.inmemory.imap.SecurityTest
Tests run: 21, Failures: 0, Errors: 0, Skipped: 0, Time elapsed: 0.274 sec
Running org.apache.james.mailbox.jcr.imap.SearchTest
Tests run: 6, Failures: 0, Errors: 6, Skipped: 0, Time elapsed: 0.944 sec <<< FAILURE!
Running org.apache.james.mailbox.inmemory.imap.EventTest
Tests run: 3, Failures: 0, Errors: 0, Skipped: 0, Time elapsed: 0.533 sec
Running org.apache.james.mailbox.torque.imap.FetchTest
Tests run: 24, Failures: 0, Errors: 0, Skipped: 0, Time elapsed: 6.895 sec
Running org.apache.james.mailbox.jcr.imap.FetchBodySectionTest
Tests run: 9, Failures: 0, Errors: 9, Skipped: 0, Time elapsed: 1.236 sec <<< FAILURE!
Running org.apache.james.mailbox.torque.SearchUtilsRFC822Test
Tests run: 6, Failures: 0, Errors: 0, Skipped: 0, Time elapsed: 0.373 sec
Running org.apache.james.mailbox.torque.imap.AuthenticatedStateTest
Tests run: 57, Failures: 0, Errors: 0, Skipped: 0, Time elapsed: 7.161 sec
Running org.apache.james.mailbox.maildir.imap.ConcurrentSessionsTest
Tests run: 21, Failures: 0, Errors: 0, Skipped: 0, Time elapsed: 1.057 sec
Running org.apache.james.mailbox.maildir.imap.FetchHeadersTest
Tests run: 6, Failures: 0, Errors: 0, Skipped: 0, Time elapsed: 1.019 sec
Running org.apache.james.mailbox.maildir.imap.SelectedInboxTest
Tests run: 42, Failures: 0, Errors: 0, Skipped: 0, Time elapsed: 1.203 sec
Running org.apache.james.mailbox.inmemory.imap.SelectedInboxTest
Tests run: 42, Failures: 0, Errors: 0, Skipped: 0, Time elapsed: 0.842 sec
Running org.apache.james.mailbox.maildir.imap.NonAuthenticatedStateTest
Tests run: 21, Failures: 0, Errors: 0, Skipped: 0, Time elapsed: 0.34 sec
Running org.apache.james.mailbox.maildir.imap.SelectedStateTest
Tests run: 30, Failures: 0, Errors: 0, Skipped: 0, Time elapsed: 1.503 sec
Running org.apache.james.mailbox.jpa.imap.SearchTest
Tests run: 6, Failures: 0, Errors: 0, Skipped: 0, Time elapsed: 11.411 sec
Running org.apache.james.mailbox.jpa.imap.ExpungeTest
Tests run: 3, Failures: 0, Errors: 0, Skipped: 0, Time elapsed: 3.643 sec
Running org.apache.james.mailbox.torque.imap.NonAuthenticatedStateTest
Tests run: 21, Failures: 0, Errors: 0, Skipped: 0, Time elapsed: 1.926 sec
Running org.apache.james.mailbox.jpa.imap.SelectedStateTest
Tests run: 30, Failures: 0, Errors: 0, Skipped: 0, Time elapsed: 6.117 sec
Running org.apache.james.mailbox.torque.imap.FetchHeadersTest
Tests run: 6, Failures: 0, Errors: 0, Skipped: 0, Time elapsed: 4.674 sec
Running org.apache.james.mailbox.jcr.imap.EventTest
Tests run: 3, Failures: 0, Errors: 3, Skipped: 0, Time elapsed: 0.818 sec <<< FAILURE!
Running org.apache.james.mailbox.jcr.imap.FetchTest
Tests run: 24, Failures: 0, Errors: 24, Skipped: 0, Time elapsed: 1.862 sec <<< FAILURE!
Running org.apache.james.mailbox.maildir.imap.AuthenticatedStateTest
Tests run: 57, Failures: 0, Errors: 0, Skipped: 0, Time elapsed: 1.257 sec
Running org.apache.james.mailbox.torque.SearchUtilsMultipartMixedTest
Tests run: 7, Failures: 0, Errors: 0, Skipped: 0, Time elapsed: 0.459 sec
Running org.apache.james.mailbox.torque.imap.PartialFetchTest
Tests run: 12, Failures: 0, Errors: 0, Skipped: 0, Time elapsed: 5.807 sec
Running org.apache.james.mailbox.jcr.imap.FetchHeadersTest
Tests run: 6, Failures: 0, Errors: 6, Skipped: 0, Time elapsed: 1.038 sec <<< FAILURE!
Running org.apache.james.mailbox.torque.imap.SecurityTest
Tests run: 21, Failures: 0, Errors: 0, Skipped: 0, Time elapsed: 1.804 sec
Running org.apache.james.mailbox.torque.imap.ListingTest
Tests run: 6, Failures: 0, Errors: 0, Skipped: 0, Time elapsed: 2.579 sec
Running org.apache.james.mailbox.maildir.imap.EventTest
Tests run: 3, Failures: 0, Errors: 0, Skipped: 0, Time elapsed: 0.686 sec
Running org.apache.james.mailbox.inmemory.imap.ExpungeTest
Tests run: 3, Failures: 0, Errors: 0, Skipped: 0, Time elapsed: 0.67 sec
Running org.apache.james.mailbox.torque.imap.SelectedStateTest
Tests run: 30, Failures: 0, Errors: 0, Skipped: 0, Time elapsed: 7.47 sec
Running org.apache.james.mailbox.torque.imap.SelectedInboxTest
Tests run: 42, Failures: 0, Errors: 0, Skipped: 0, Time elapsed: 7.07 sec
Running org.apache.james.mailbox.jpa.imap.RenameTest
Tests run: 9, Failures: 0, Errors: 0, Skipped: 0, Time elapsed: 6.692 sec
Running org.apache.james.mailbox.torque.imap.FetchBodySectionTest
Tests run: 9, Failures: 0, Errors: 0, Skipped: 0, Time elapsed: 5.012 sec
Running org.apache.james.mailbox.jpa.imap.FetchHeadersTest
Tests run: 6, Failures: 0, Errors: 0, Skipped: 0, Time elapsed: 4.375 sec
Running org.apache.james.mailbox.torque.SearchUtilsTest
Tests run: 40, Failures: 0, Errors: 0, Skipped: 0, Time elapsed: 0.218 sec
Running org.apache.james.mailbox.jpa.imap.UidSearchTest
Tests run: 6, Failures: 0, Errors: 0, Skipped: 0, Time elapsed: 12.304 sec
Running org.apache.james.mailbox.jpa.imap.AuthenticatedStateTest
Tests run: 57, Failures: 0, Errors: 0, Skipped: 0, Time elapsed: 4.874 sec
Running org.apache.james.mailbox.jpa.imap.SelectedInboxTest
Tests run: 42, Failures: 0, Errors: 0, Skipped: 0, Time elapsed: 4.342 sec
Running org.apache.james.mailbox.torque.imap.ExpungeTest
Tests run: 3, Failures: 0, Errors: 0, Skipped: 0, Time elapsed: 3.754 sec
Running org.apache.james.mailbox.maildir.imap.FetchTest
Tests run: 24, Failures: 0, Errors: 0, Skipped: 0, Time elapsed: 1.403 sec
Running org.apache.james.mailbox.torque.MessageUtilsNormalisedWriteToTest
Tests run: 8, Failures: 0, Errors: 0, Skipped: 0, Time elapsed: 0.029 sec
Running org.apache.james.mailbox.torque.imap.SelectTest
Tests run: 3, Failures: 0, Errors: 0, Skipped: 0, Time elapsed: 2.966 sec
Running org.apache.james.mailbox.maildir.imap.ListingTest
Tests run: 6, Failures: 0, Errors: 0, Skipped: 0, Time elapsed: 0.492 sec
Running org.apache.james.mailbox.jcr.imap.SelectedStateTest
Tests run: 30, Failures: 0, Errors: 30, Skipped: 0, Time elapsed: 2.109 sec <<< FAILURE!
Running org.apache.james.mailbox.maildir.imap.RenameTest
Tests run: 9, Failures: 0, Errors: 0, Skipped: 0, Time elapsed: 1.679 sec
Running org.apache.james.mailbox.inmemory.imap.RenameTest
Tests run: 9, Failures: 0, Errors: 0, Skipped: 0, Time elapsed: 1.036 sec
Running org.apache.james.mailbox.jcr.imap.NonAuthenticatedStateTest
Tests run: 21, Failures: 0, Errors: 21, Skipped: 0, Time elapsed: 1.812 sec <<< FAILURE!
Running org.apache.james.mailbox.maildir.imap.ExpungeTest
Tests run: 3, Failures: 0, Errors: 0, Skipped: 0, Time elapsed: 0.794 sec
Running org.apache.james.mailbox.jcr.imap.AuthenticatedStateTest
Tests run: 57, Failures: 0, Errors: 57, Skipped: 0, Time elapsed: 2.932 sec <<< FAILURE!
Running org.apache.james.mailbox.jcr.imap.ListingTest
Tests run: 6, Failures: 0, Errors: 6, Skipped: 0, Time elapsed: 0.924 sec <<< FAILURE!
Running org.apache.james.mailbox.inmemory.imap.ListingTest
Tests run: 6, Failures: 0, Errors: 0, Skipped: 0, Time elapsed: 0.319 sec
Running org.apache.james.mailbox.jpa.imap.SelectTest
Tests run: 3, Failures: 0, Errors: 0, Skipped: 0, Time elapsed: 2.527 sec
Running org.apache.james.mailbox.inmemory.imap.UidSearchTest
Tests run: 6, Failures: 0, Errors: 0, Skipped: 0, Time elapsed: 1.864 sec
Running org.apache.james.mailbox.jcr.imap.UidSearchTest
Tests run: 6, Failures: 0, Errors: 6, Skipped: 0, Time elapsed: 1.063 sec <<< FAILURE!
Running org.apache.james.mailbox.torque.imap.RenameTest
Tests run: 9, Failures: 0, Errors: 0, Skipped: 0, Time elapsed: 8.582 sec
Running org.apache.james.mailbox.inmemory.imap.PartialFetchTest
Tests run: 12, Failures: 0, Errors: 0, Skipped: 0, Time elapsed: 0.86 sec
Running org.apache.james.mailbox.jpa.imap.PartialFetchTest
Tests run: 12, Failures: 0, Errors: 0, Skipped: 0, Time elapsed: 5.217 sec
Running org.apache.james.mailbox.jcr.imap.SecurityTest
Tests run: 21, Failures: 0, Errors: 21, Skipped: 0, Time elapsed: 1.676 sec <<< FAILURE!
Running org.apache.james.mailbox.jcr.imap.FetchBodyStructureTest
Tests run: 12, Failures: 0, Errors: 12, Skipped: 0, Time elapsed: 1.228 sec <<< FAILURE!
Running org.apache.james.mailbox.jpa.imap.ListingTest
Tests run: 6, Failures: 0, Errors: 0, Skipped: 0, Time elapsed: 2.5 sec
Running org.apache.james.mailbox.inmemory.imap.SearchTest
Tests run: 6, Failures: 0, Errors: 0, Skipped: 0, Time elapsed: 1.833 sec
Running org.apache.james.mailbox.maildir.imap.SelectTest
Tests run: 3, Failures: 0, Errors: 0, Skipped: 0, Time elapsed: 0.617 sec
Running org.apache.james.mailbox.maildir.imap.FetchBodyStructureTest
Tests run: 12, Failures: 0, Errors: 0, Skipped: 0, Time elapsed: 2.061 sec
Running org.apache.james.mailbox.inmemory.imap.FetchBodyStructureTest
Tests run: 12, Failures: 0, Errors: 0, Skipped: 0, Time elapsed: 1.359 sec
Running org.apache.james.mailbox.inmemory.imap.NonAuthenticatedStateTest
Tests run: 21, Failures: 0, Errors: 0, Skipped: 0, Time elapsed: 0.331 sec
Running org.apache.james.mailbox.torque.PartContentBuilderComplexMultipartTest
Tests run: 8, Failures: 0, Errors: 0, Skipped: 0, Time elapsed: 0.349 sec
Running org.apache.james.mailbox.inmemory.imap.FetchHeadersTest
Tests run: 6, Failures: 0, Errors: 0, Skipped: 0, Time elapsed: 0.753 sec
Running org.apache.james.mailbox.maildir.imap.SecurityTest
Tests run: 21, Failures: 0, Errors: 0, Skipped: 0, Time elapsed: 0.276 sec
Running org.apache.james.mailbox.jpa.imap.NonAuthenticatedStateTest
Tests run: 21, Failures: 0, Errors: 0, Skipped: 0, Time elapsed: 1.998 sec
Running org.apache.james.mailbox.maildir.imap.FetchBodySectionTest
Tests run: 9, Failures: 0, Errors: 0, Skipped: 0, Time elapsed: 1.041 sec
Running org.apache.james.mailbox.torque.imap.SearchTest
Tests run: 6, Failures: 0, Errors: 0, Skipped: 0, Time elapsed: 11.506 sec
Running org.apache.james.mailbox.jpa.imap.FetchBodySectionTest
Tests run: 9, Failures: 0, Errors: 0, Skipped: 0, Time elapsed: 4.153 sec
Running org.apache.james.mailbox.jpa.imap.FetchTest
Tests run: 24, Failures: 0, Errors: 0, Skipped: 0, Time elapsed: 6.287 sec
Running org.apache.james.mailbox.maildir.imap.UidSearchTest
Tests run: 6, Failures: 0, Errors: 0, Skipped: 0, Time elapsed: 3.268 sec
Running org.apache.james.mailbox.torque.imap.UidSearchTest
Tests run: 6, Failures: 0, Errors: 0, Skipped: 0, Time elapsed: 13.754 sec
Running org.apache.james.mailbox.jcr.imap.ExpungeTest
Tests run: 3, Failures: 0, Errors: 3, Skipped: 0, Time elapsed: 0.758 sec <<< FAILURE!
Running org.apache.james.mailbox.jcr.imap.PartialFetchTest
Tests run: 12, Failures: 0, Errors: 12, Skipped: 0, Time elapsed: 1.282 sec <<< FAILURE!
Running org.apache.james.mailbox.jcr.imap.SelectTest
Tests run: 3, Failures: 0, Errors: 3, Skipped: 0, Time elapsed: 0.753 sec <<< FAILURE!
Running org.apache.james.mailbox.jpa.imap.EventTest
Tests run: 3, Failures: 0, Errors: 0, Skipped: 0, Time elapsed: 2.844 sec
Running org.apache.james.mailbox.jcr.imap.RenameTest
Tests run: 9, Failures: 0, Errors: 9, Skipped: 0, Time elapsed: 1.119 sec <<< FAILURE!
Running org.apache.james.mailbox.jcr.imap.ConcurrentSessionsTest
Tests run: 21, Failures: 0, Errors: 21, Skipped: 0, Time elapsed: 1.666 sec <<< FAILURE!
Running org.apache.james.mailbox.inmemory.imap.AuthenticatedStateTest
Tests run: 57, Failures: 0, Errors: 0, Skipped: 0, Time elapsed: 0.802 sec

Results :

Tests in error: 

Tests run: 1529, Failures: 0, Errors: 291, Skipped: 0

[HUDSON] Recording test results
[HUDSON] Archiving <https://hudson.apache.org/hudson/job/mailbox-integration-tests/ws/pom.xml> to /home/hudson/hudson/jobs/mailbox-integration-tests/modules/org.apache.james$apache-james-mailbox-integration-tester/builds/2011-02-17_06-42-30/archive/org.apache.james/apache-james-mailbox-integration-tester/0.2-M2-SNAPSHOT/pom.xml
[INFO] ------------------------------------------------------------------------
[ERROR] BUILD FAILURE
[INFO] ------------------------------------------------------------------------
[INFO] There are test failures.

Please refer to <https://hudson.apache.org/hudson/job/mailbox-integration-tests/ws/target/surefire-reports> for the individual test results.
[INFO] ------------------------------------------------------------------------
[INFO] For more information, run Maven with the -e switch
[INFO] ------------------------------------------------------------------------
[INFO] Total time: 6 minutes 3 seconds
[INFO] Finished at: Wed Feb 16 22:49:01 GMT-08:00 2011
[INFO] Final Memory: 36M/203M
[INFO] ------------------------------------------------------------------------
Maven failed with error.
Sending e-mails to: server-dev@james.apache.org
channel stopped


---------------------------------------------------------------------
To unsubscribe, e-mail: server-dev-unsubscribe@james.apache.org
For additional commands, e-mail: server-dev-help@james.apache.org


Build failed in Hudson: mailbox-integration-tests #109

Posted by Apache Hudson Server <hu...@hudson.apache.org>.
See <https://hudson.apache.org/hudson/job/mailbox-integration-tests/109/>

------------------------------------------
[...truncated 70 lines...]
Downloading: http://repository.apache.org/snapshots/org/apache/james/apache-james-imap-processor/0.2-M2-SNAPSHOT/apache-james-imap-processor-0.2-M2-20110217.001733-228.jar
116K downloaded  (apache-james-imap-processor-0.2-M2-20110217.001733-228.jar)
Downloading: http://repository.apache.org/snapshots/org/apache/james/apache-james-mailbox-store/0.2-M2-SNAPSHOT/apache-james-mailbox-store-0.2-M2-20110217.040413-203-tests.jar
37K downloaded  (apache-james-mailbox-store-0.2-M2-20110217.040413-203-tests.jar)
Downloading: http://repository.apache.org/snapshots/org/apache/james/apache-james-mailbox-store/0.2-M2-SNAPSHOT/apache-james-mailbox-store-0.2-M2-20110217.040413-203.jar
119K downloaded  (apache-james-mailbox-store-0.2-M2-20110217.040413-203.jar)
Downloading: http://repository.apache.org/snapshots/org/apache/james/apache-james-mailbox-jpa/0.2-M2-SNAPSHOT/apache-james-mailbox-jpa-0.2-M2-20110217.040413-179.jar
71K downloaded  (apache-james-mailbox-jpa-0.2-M2-20110217.040413-179.jar)
Downloading: http://repository.apache.org/snapshots/org/apache/james/apache-james-mailbox-memory/0.2-M2-SNAPSHOT/apache-james-mailbox-memory-0.2-M2-20110217.040413-182.jar
28K downloaded  (apache-james-mailbox-memory-0.2-M2-20110217.040413-182.jar)
[INFO] [resources:resources {execution: default-resources}]
[INFO] Using 'UTF-8' encoding to copy filtered resources.
[INFO] Copying 113 resources
[INFO] Copying 3 resources
[INFO] [compiler:compile {execution: default-compile}]
[INFO] Compiling 39 source files to <https://hudson.apache.org/hudson/job/mailbox-integration-tests/ws/target/classes>
[INFO] [bundle:manifest {execution: bundle-manifest}]
[WARNING] Embed-Dependency: clause "*;scope=runtime" did not match any dependencies
[INFO] [resources:testResources {execution: default-testResources}]
[INFO] Using 'UTF-8' encoding to copy filtered resources.
[INFO] Copying 4 resources
[INFO] Copying 3 resources
[INFO] [compiler:testCompile {execution: default-testCompile}]
[INFO] Compiling 105 source files to <https://hudson.apache.org/hudson/job/mailbox-integration-tests/ws/target/test-classes>
[INFO] [surefire:test {execution: default-test}]
[INFO] Surefire report directory: <https://hudson.apache.org/hudson/job/mailbox-integration-tests/ws/target/surefire-reports>

-------------------------------------------------------
 T E S T S
-------------------------------------------------------
Running org.apache.james.mailbox.torque.PartContentBuilderMultipartAlternativeTest
Tests run: 3, Failures: 0, Errors: 0, Skipped: 0, Time elapsed: 0.348 sec
Running org.apache.james.mailbox.inmemory.imap.FetchBodySectionTest
Tests run: 9, Failures: 0, Errors: 0, Skipped: 0, Time elapsed: 0.851 sec
Running org.apache.james.mailbox.inmemory.imap.FetchTest
Tests run: 24, Failures: 0, Errors: 0, Skipped: 0, Time elapsed: 1.082 sec
Running org.apache.james.mailbox.torque.MessageUtilsCountUnnormalLinesTest
Tests run: 5, Failures: 0, Errors: 0, Skipped: 0, Time elapsed: 0.025 sec
Running org.apache.james.mailbox.torque.imap.ConcurrentSessionsTest
Tests run: 21, Failures: 0, Errors: 0, Skipped: 0, Time elapsed: 5.943 sec
Running org.apache.james.mailbox.inmemory.imap.SelectedStateTest
Tests run: 30, Failures: 0, Errors: 0, Skipped: 0, Time elapsed: 0.94 sec
Running org.apache.james.mailbox.torque.imap.FetchBodyStructureTest
Tests run: 12, Failures: 0, Errors: 0, Skipped: 0, Time elapsed: 7.854 sec
Running org.apache.james.mailbox.inmemory.imap.SelectTest
Tests run: 3, Failures: 0, Errors: 0, Skipped: 0, Time elapsed: 0.559 sec
Running org.apache.james.mailbox.jpa.imap.FetchBodyStructureTest
Tests run: 12, Failures: 0, Errors: 0, Skipped: 0, Time elapsed: 7.266 sec
Running org.apache.james.mailbox.jcr.imap.SelectedInboxTest
Tests run: 42, Failures: 0, Errors: 42, Skipped: 0, Time elapsed: 2.705 sec <<< FAILURE!
Running org.apache.james.mailbox.torque.MessageRowUtilsTest
Tests run: 3, Failures: 0, Errors: 0, Skipped: 0, Time elapsed: 0.12 sec
Running org.apache.james.mailbox.jpa.imap.SecurityTest
Tests run: 21, Failures: 0, Errors: 0, Skipped: 0, Time elapsed: 1.809 sec
Running org.apache.james.mailbox.inmemory.imap.ConcurrentSessionsTest
Tests run: 21, Failures: 0, Errors: 0, Skipped: 0, Time elapsed: 0.76 sec
Running org.apache.james.mailbox.torque.imap.EventTest
Tests run: 3, Failures: 0, Errors: 0, Skipped: 0, Time elapsed: 3.128 sec
Running org.apache.james.mailbox.jpa.imap.ConcurrentSessionsTest
Tests run: 21, Failures: 0, Errors: 0, Skipped: 0, Time elapsed: 4.229 sec
Running org.apache.james.mailbox.maildir.imap.PartialFetchTest
Tests run: 12, Failures: 0, Errors: 0, Skipped: 0, Time elapsed: 1.239 sec
Running org.apache.james.mailbox.inmemory.imap.SecurityTest
Tests run: 21, Failures: 0, Errors: 0, Skipped: 0, Time elapsed: 0.278 sec
Running org.apache.james.mailbox.jcr.imap.SearchTest
Tests run: 6, Failures: 0, Errors: 6, Skipped: 0, Time elapsed: 1.075 sec <<< FAILURE!
Running org.apache.james.mailbox.inmemory.imap.EventTest
Tests run: 3, Failures: 0, Errors: 0, Skipped: 0, Time elapsed: 0.552 sec
Running org.apache.james.mailbox.torque.imap.FetchTest
Tests run: 24, Failures: 0, Errors: 0, Skipped: 0, Time elapsed: 7.032 sec
Running org.apache.james.mailbox.jcr.imap.FetchBodySectionTest
Tests run: 9, Failures: 0, Errors: 9, Skipped: 0, Time elapsed: 1.288 sec <<< FAILURE!
Running org.apache.james.mailbox.torque.SearchUtilsRFC822Test
Tests run: 6, Failures: 0, Errors: 0, Skipped: 0, Time elapsed: 0.361 sec
Running org.apache.james.mailbox.torque.imap.AuthenticatedStateTest
Tests run: 57, Failures: 0, Errors: 0, Skipped: 0, Time elapsed: 7.144 sec
Running org.apache.james.mailbox.maildir.imap.ConcurrentSessionsTest
Tests run: 21, Failures: 0, Errors: 0, Skipped: 0, Time elapsed: 1.094 sec
Running org.apache.james.mailbox.maildir.imap.FetchHeadersTest
Tests run: 6, Failures: 0, Errors: 0, Skipped: 0, Time elapsed: 1.041 sec
Running org.apache.james.mailbox.maildir.imap.SelectedInboxTest
Tests run: 42, Failures: 0, Errors: 0, Skipped: 0, Time elapsed: 1.102 sec
Running org.apache.james.mailbox.inmemory.imap.SelectedInboxTest
Tests run: 42, Failures: 0, Errors: 0, Skipped: 0, Time elapsed: 0.859 sec
Running org.apache.james.mailbox.maildir.imap.NonAuthenticatedStateTest
Tests run: 21, Failures: 0, Errors: 0, Skipped: 0, Time elapsed: 0.343 sec
Running org.apache.james.mailbox.maildir.imap.SelectedStateTest
Tests run: 30, Failures: 0, Errors: 0, Skipped: 0, Time elapsed: 1.469 sec
Running org.apache.james.mailbox.jpa.imap.SearchTest
Tests run: 6, Failures: 0, Errors: 0, Skipped: 0, Time elapsed: 11.362 sec
Running org.apache.james.mailbox.jpa.imap.ExpungeTest
Tests run: 3, Failures: 0, Errors: 0, Skipped: 0, Time elapsed: 3.576 sec
Running org.apache.james.mailbox.torque.imap.NonAuthenticatedStateTest
Tests run: 21, Failures: 0, Errors: 0, Skipped: 0, Time elapsed: 1.918 sec
Running org.apache.james.mailbox.jpa.imap.SelectedStateTest
Tests run: 30, Failures: 0, Errors: 0, Skipped: 0, Time elapsed: 6.551 sec
Running org.apache.james.mailbox.torque.imap.FetchHeadersTest
Tests run: 6, Failures: 0, Errors: 0, Skipped: 0, Time elapsed: 4.671 sec
Running org.apache.james.mailbox.jcr.imap.EventTest
Tests run: 3, Failures: 0, Errors: 3, Skipped: 0, Time elapsed: 0.824 sec <<< FAILURE!
Running org.apache.james.mailbox.jcr.imap.FetchTest
Tests run: 24, Failures: 0, Errors: 24, Skipped: 0, Time elapsed: 1.872 sec <<< FAILURE!
Running org.apache.james.mailbox.maildir.imap.AuthenticatedStateTest
Tests run: 57, Failures: 0, Errors: 0, Skipped: 0, Time elapsed: 1.244 sec
Running org.apache.james.mailbox.torque.SearchUtilsMultipartMixedTest
Tests run: 7, Failures: 0, Errors: 0, Skipped: 0, Time elapsed: 0.429 sec
Running org.apache.james.mailbox.torque.imap.PartialFetchTest
Tests run: 12, Failures: 0, Errors: 0, Skipped: 0, Time elapsed: 6.081 sec
Running org.apache.james.mailbox.jcr.imap.FetchHeadersTest
Tests run: 6, Failures: 0, Errors: 6, Skipped: 0, Time elapsed: 1.071 sec <<< FAILURE!
Running org.apache.james.mailbox.torque.imap.SecurityTest
Tests run: 21, Failures: 0, Errors: 0, Skipped: 0, Time elapsed: 1.812 sec
Running org.apache.james.mailbox.torque.imap.ListingTest
Tests run: 6, Failures: 0, Errors: 0, Skipped: 0, Time elapsed: 2.597 sec
Running org.apache.james.mailbox.maildir.imap.EventTest
Tests run: 3, Failures: 0, Errors: 0, Skipped: 0, Time elapsed: 0.639 sec
Running org.apache.james.mailbox.inmemory.imap.ExpungeTest
Tests run: 3, Failures: 0, Errors: 0, Skipped: 0, Time elapsed: 0.626 sec
Running org.apache.james.mailbox.torque.imap.SelectedStateTest
Tests run: 30, Failures: 0, Errors: 0, Skipped: 0, Time elapsed: 7.536 sec
Running org.apache.james.mailbox.torque.imap.SelectedInboxTest
Tests run: 42, Failures: 0, Errors: 0, Skipped: 0, Time elapsed: 7.131 sec
Running org.apache.james.mailbox.jpa.imap.RenameTest
Tests run: 9, Failures: 0, Errors: 0, Skipped: 0, Time elapsed: 6.702 sec
Running org.apache.james.mailbox.torque.imap.FetchBodySectionTest
Tests run: 9, Failures: 0, Errors: 0, Skipped: 0, Time elapsed: 4.974 sec
Running org.apache.james.mailbox.jpa.imap.FetchHeadersTest
Tests run: 6, Failures: 0, Errors: 0, Skipped: 0, Time elapsed: 4.284 sec
Running org.apache.james.mailbox.torque.SearchUtilsTest
Tests run: 40, Failures: 0, Errors: 0, Skipped: 0, Time elapsed: 0.227 sec
Running org.apache.james.mailbox.jpa.imap.UidSearchTest
Tests run: 6, Failures: 0, Errors: 0, Skipped: 0, Time elapsed: 12.344 sec
Running org.apache.james.mailbox.jpa.imap.AuthenticatedStateTest
Tests run: 57, Failures: 0, Errors: 0, Skipped: 0, Time elapsed: 4.621 sec
Running org.apache.james.mailbox.jpa.imap.SelectedInboxTest
Tests run: 42, Failures: 0, Errors: 0, Skipped: 0, Time elapsed: 4.482 sec
Running org.apache.james.mailbox.torque.imap.ExpungeTest
Tests run: 3, Failures: 0, Errors: 0, Skipped: 0, Time elapsed: 3.736 sec
Running org.apache.james.mailbox.maildir.imap.FetchTest
Tests run: 24, Failures: 0, Errors: 0, Skipped: 0, Time elapsed: 1.393 sec
Running org.apache.james.mailbox.torque.MessageUtilsNormalisedWriteToTest
Tests run: 8, Failures: 0, Errors: 0, Skipped: 0, Time elapsed: 0.029 sec
Running org.apache.james.mailbox.torque.imap.SelectTest
Tests run: 3, Failures: 0, Errors: 0, Skipped: 0, Time elapsed: 2.906 sec
Running org.apache.james.mailbox.maildir.imap.ListingTest
Tests run: 6, Failures: 0, Errors: 0, Skipped: 0, Time elapsed: 0.516 sec
Running org.apache.james.mailbox.jcr.imap.SelectedStateTest
Tests run: 30, Failures: 0, Errors: 30, Skipped: 0, Time elapsed: 2.142 sec <<< FAILURE!
Running org.apache.james.mailbox.maildir.imap.RenameTest
Tests run: 9, Failures: 0, Errors: 0, Skipped: 0, Time elapsed: 1.678 sec
Running org.apache.james.mailbox.inmemory.imap.RenameTest
Tests run: 9, Failures: 0, Errors: 0, Skipped: 0, Time elapsed: 0.906 sec
Running org.apache.james.mailbox.jcr.imap.NonAuthenticatedStateTest
Tests run: 21, Failures: 0, Errors: 21, Skipped: 0, Time elapsed: 1.704 sec <<< FAILURE!
Running org.apache.james.mailbox.maildir.imap.ExpungeTest
Tests run: 3, Failures: 0, Errors: 0, Skipped: 0, Time elapsed: 0.759 sec
Running org.apache.james.mailbox.jcr.imap.AuthenticatedStateTest
Tests run: 57, Failures: 0, Errors: 57, Skipped: 0, Time elapsed: 2.982 sec <<< FAILURE!
Running org.apache.james.mailbox.jcr.imap.ListingTest
Tests run: 6, Failures: 0, Errors: 6, Skipped: 0, Time elapsed: 0.93 sec <<< FAILURE!
Running org.apache.james.mailbox.inmemory.imap.ListingTest
Tests run: 6, Failures: 0, Errors: 0, Skipped: 0, Time elapsed: 0.318 sec
Running org.apache.james.mailbox.jpa.imap.SelectTest
Tests run: 3, Failures: 0, Errors: 0, Skipped: 0, Time elapsed: 2.53 sec
Running org.apache.james.mailbox.inmemory.imap.UidSearchTest
Tests run: 6, Failures: 0, Errors: 0, Skipped: 0, Time elapsed: 1.835 sec
Running org.apache.james.mailbox.jcr.imap.UidSearchTest
Tests run: 6, Failures: 0, Errors: 6, Skipped: 0, Time elapsed: 0.941 sec <<< FAILURE!
Running org.apache.james.mailbox.torque.imap.RenameTest
Tests run: 9, Failures: 0, Errors: 0, Skipped: 0, Time elapsed: 8.548 sec
Running org.apache.james.mailbox.inmemory.imap.PartialFetchTest
Tests run: 12, Failures: 0, Errors: 0, Skipped: 0, Time elapsed: 0.823 sec
Running org.apache.james.mailbox.jpa.imap.PartialFetchTest
Tests run: 12, Failures: 0, Errors: 0, Skipped: 0, Time elapsed: 4.982 sec
Running org.apache.james.mailbox.jcr.imap.SecurityTest
Tests run: 21, Failures: 0, Errors: 21, Skipped: 0, Time elapsed: 1.652 sec <<< FAILURE!
Running org.apache.james.mailbox.jcr.imap.FetchBodyStructureTest
Tests run: 12, Failures: 0, Errors: 12, Skipped: 0, Time elapsed: 1.376 sec <<< FAILURE!
Running org.apache.james.mailbox.jpa.imap.ListingTest
Tests run: 6, Failures: 0, Errors: 0, Skipped: 0, Time elapsed: 2.561 sec
Running org.apache.james.mailbox.inmemory.imap.SearchTest
Tests run: 6, Failures: 0, Errors: 0, Skipped: 0, Time elapsed: 1.754 sec
Running org.apache.james.mailbox.maildir.imap.SelectTest
Tests run: 3, Failures: 0, Errors: 0, Skipped: 0, Time elapsed: 0.617 sec
Running org.apache.james.mailbox.maildir.imap.FetchBodyStructureTest
Tests run: 12, Failures: 0, Errors: 0, Skipped: 0, Time elapsed: 2.149 sec
Running org.apache.james.mailbox.inmemory.imap.FetchBodyStructureTest
Tests run: 12, Failures: 0, Errors: 0, Skipped: 0, Time elapsed: 1.608 sec
Running org.apache.james.mailbox.inmemory.imap.NonAuthenticatedStateTest
Tests run: 21, Failures: 0, Errors: 0, Skipped: 0, Time elapsed: 0.31 sec
Running org.apache.james.mailbox.torque.PartContentBuilderComplexMultipartTest
Tests run: 8, Failures: 0, Errors: 0, Skipped: 0, Time elapsed: 0.347 sec
Running org.apache.james.mailbox.inmemory.imap.FetchHeadersTest
Tests run: 6, Failures: 0, Errors: 0, Skipped: 0, Time elapsed: 0.766 sec
Running org.apache.james.mailbox.maildir.imap.SecurityTest
Tests run: 21, Failures: 0, Errors: 0, Skipped: 0, Time elapsed: 0.279 sec
Running org.apache.james.mailbox.jpa.imap.NonAuthenticatedStateTest
Tests run: 21, Failures: 0, Errors: 0, Skipped: 0, Time elapsed: 1.924 sec
Running org.apache.james.mailbox.maildir.imap.FetchBodySectionTest
Tests run: 9, Failures: 0, Errors: 0, Skipped: 0, Time elapsed: 1.096 sec
Running org.apache.james.mailbox.torque.imap.SearchTest
Tests run: 6, Failures: 0, Errors: 0, Skipped: 0, Time elapsed: 11.12 sec
Running org.apache.james.mailbox.jpa.imap.FetchBodySectionTest
Tests run: 9, Failures: 0, Errors: 0, Skipped: 0, Time elapsed: 4.386 sec
Running org.apache.james.mailbox.jpa.imap.FetchTest
Tests run: 24, Failures: 0, Errors: 0, Skipped: 0, Time elapsed: 5.545 sec
Running org.apache.james.mailbox.maildir.imap.UidSearchTest
Tests run: 6, Failures: 0, Errors: 0, Skipped: 0, Time elapsed: 3.305 sec
Running org.apache.james.mailbox.torque.imap.UidSearchTest
Tests run: 6, Failures: 0, Errors: 0, Skipped: 0, Time elapsed: 13.187 sec
Running org.apache.james.mailbox.jcr.imap.ExpungeTest
Tests run: 3, Failures: 0, Errors: 3, Skipped: 0, Time elapsed: 0.815 sec <<< FAILURE!
Running org.apache.james.mailbox.jcr.imap.PartialFetchTest
Tests run: 12, Failures: 0, Errors: 12, Skipped: 0, Time elapsed: 1.338 sec <<< FAILURE!
Running org.apache.james.mailbox.jcr.imap.SelectTest
Tests run: 3, Failures: 0, Errors: 3, Skipped: 0, Time elapsed: 0.754 sec <<< FAILURE!
Running org.apache.james.mailbox.jpa.imap.EventTest
Tests run: 3, Failures: 0, Errors: 0, Skipped: 0, Time elapsed: 2.888 sec
Running org.apache.james.mailbox.jcr.imap.RenameTest
Tests run: 9, Failures: 0, Errors: 9, Skipped: 0, Time elapsed: 1.222 sec <<< FAILURE!
Running org.apache.james.mailbox.jcr.imap.ConcurrentSessionsTest
Tests run: 21, Failures: 0, Errors: 21, Skipped: 0, Time elapsed: 1.78 sec <<< FAILURE!
Running org.apache.james.mailbox.inmemory.imap.AuthenticatedStateTest
Tests run: 57, Failures: 0, Errors: 0, Skipped: 0, Time elapsed: 0.822 sec

Results :

Tests in error: 

Tests run: 1529, Failures: 0, Errors: 291, Skipped: 0

[HUDSON] Recording test results
[HUDSON] Archiving <https://hudson.apache.org/hudson/job/mailbox-integration-tests/ws/pom.xml> to /home/hudson/hudson/jobs/mailbox-integration-tests/modules/org.apache.james$apache-james-mailbox-integration-tester/builds/2011-02-17_04-08-31/archive/org.apache.james/apache-james-mailbox-integration-tester/0.2-M2-SNAPSHOT/pom.xml
[INFO] ------------------------------------------------------------------------
[ERROR] BUILD FAILURE
[INFO] ------------------------------------------------------------------------
[INFO] There are test failures.

Please refer to <https://hudson.apache.org/hudson/job/mailbox-integration-tests/ws/target/surefire-reports> for the individual test results.
[INFO] ------------------------------------------------------------------------
[INFO] For more information, run Maven with the -e switch
[INFO] ------------------------------------------------------------------------
[INFO] Total time: 6 minutes 13 seconds
[INFO] Finished at: Wed Feb 16 20:15:12 GMT-08:00 2011
[INFO] Final Memory: 36M/190M
[INFO] ------------------------------------------------------------------------
Maven failed with error.
Sending e-mails to: server-dev@james.apache.org
channel stopped


---------------------------------------------------------------------
To unsubscribe, e-mail: server-dev-unsubscribe@james.apache.org
For additional commands, e-mail: server-dev-help@james.apache.org