You are viewing a plain text version of this content. The canonical link for it is here.
Posted to dev@kafka.apache.org by Apache Jenkins Server <je...@builds.apache.org> on 2019/09/23 18:23:14 UTC

Build failed in Jenkins: kafka-trunk-jdk8 #3917

See <https://builds.apache.org/job/kafka-trunk-jdk8/3917/display/redirect?page=changes>

Changes:

[bbejeck] KAFKA-8859: Refactor cache-level metrics (#7367)

------------------------------------------
[...truncated 2.64 MB...]
org.apache.kafka.streams.scala.kstream.ConsumedTest > Create a Consumed with timestampExtractor should create a Consumed with Serdes and timestampExtractor STARTED

org.apache.kafka.streams.scala.kstream.ConsumedTest > Create a Consumed with timestampExtractor should create a Consumed with Serdes and timestampExtractor PASSED

org.apache.kafka.streams.scala.kstream.ConsumedTest > Create a Consumed with resetPolicy should create a Consumed with Serdes and resetPolicy STARTED

org.apache.kafka.streams.scala.kstream.ConsumedTest > Create a Consumed with resetPolicy should create a Consumed with Serdes and resetPolicy PASSED

org.apache.kafka.streams.scala.kstream.KStreamTest > filter a KStream should filter records satisfying the predicate STARTED

org.apache.kafka.streams.scala.kstream.KStreamTest > filter a KStream should filter records satisfying the predicate PASSED

org.apache.kafka.streams.scala.kstream.KStreamTest > filterNot a KStream should filter records not satisfying the predicate STARTED

org.apache.kafka.streams.scala.kstream.KStreamTest > filterNot a KStream should filter records not satisfying the predicate PASSED

org.apache.kafka.streams.scala.kstream.KStreamTest > foreach a KStream should run foreach actions on records STARTED

org.apache.kafka.streams.scala.kstream.KStreamTest > foreach a KStream should run foreach actions on records PASSED

org.apache.kafka.streams.scala.kstream.KStreamTest > peek a KStream should run peek actions on records STARTED

org.apache.kafka.streams.scala.kstream.KStreamTest > peek a KStream should run peek actions on records PASSED

org.apache.kafka.streams.scala.kstream.KStreamTest > selectKey a KStream should select a new key STARTED

org.apache.kafka.streams.scala.kstream.KStreamTest > selectKey a KStream should select a new key PASSED

org.apache.kafka.streams.scala.kstream.KStreamTest > join 2 KStreams should join correctly records STARTED

org.apache.kafka.streams.scala.kstream.KStreamTest > join 2 KStreams should join correctly records PASSED

org.apache.kafka.streams.scala.kstream.JoinedTest > Create a Joined should create a Joined with Serdes STARTED

org.apache.kafka.streams.scala.kstream.JoinedTest > Create a Joined should create a Joined with Serdes PASSED

org.apache.kafka.streams.scala.kstream.JoinedTest > Create a Joined should create a Joined with Serdes and repartition topic name STARTED

org.apache.kafka.streams.scala.kstream.JoinedTest > Create a Joined should create a Joined with Serdes and repartition topic name PASSED

org.apache.kafka.streams.scala.kstream.ProducedTest > Create a Produced should create a Produced with Serdes STARTED

org.apache.kafka.streams.scala.kstream.ProducedTest > Create a Produced should create a Produced with Serdes PASSED

org.apache.kafka.streams.scala.kstream.ProducedTest > Create a Produced with timestampExtractor and resetPolicy should create a Consumed with Serdes, timestampExtractor and resetPolicy STARTED

org.apache.kafka.streams.scala.kstream.ProducedTest > Create a Produced with timestampExtractor and resetPolicy should create a Consumed with Serdes, timestampExtractor and resetPolicy PASSED

org.apache.kafka.streams.scala.kstream.GroupedTest > Create a Grouped should create a Grouped with Serdes STARTED

org.apache.kafka.streams.scala.kstream.GroupedTest > Create a Grouped should create a Grouped with Serdes PASSED

org.apache.kafka.streams.scala.kstream.GroupedTest > Create a Grouped with repartition topic name should create a Grouped with Serdes, and repartition topic name STARTED

org.apache.kafka.streams.scala.kstream.GroupedTest > Create a Grouped with repartition topic name should create a Grouped with Serdes, and repartition topic name PASSED

org.apache.kafka.streams.scala.kstream.SuppressedTest > Suppressed.untilWindowCloses should produce the correct suppression STARTED

org.apache.kafka.streams.scala.kstream.SuppressedTest > Suppressed.untilWindowCloses should produce the correct suppression PASSED

org.apache.kafka.streams.scala.kstream.SuppressedTest > Suppressed.untilTimeLimit should produce the correct suppression STARTED

org.apache.kafka.streams.scala.kstream.SuppressedTest > Suppressed.untilTimeLimit should produce the correct suppression PASSED

org.apache.kafka.streams.scala.kstream.SuppressedTest > BufferConfig.maxRecords should produce the correct buffer config STARTED

org.apache.kafka.streams.scala.kstream.SuppressedTest > BufferConfig.maxRecords should produce the correct buffer config PASSED

org.apache.kafka.streams.scala.kstream.SuppressedTest > BufferConfig.maxBytes should produce the correct buffer config STARTED

org.apache.kafka.streams.scala.kstream.SuppressedTest > BufferConfig.maxBytes should produce the correct buffer config PASSED

org.apache.kafka.streams.scala.kstream.SuppressedTest > BufferConfig.unbounded should produce the correct buffer config STARTED

org.apache.kafka.streams.scala.kstream.SuppressedTest > BufferConfig.unbounded should produce the correct buffer config PASSED

org.apache.kafka.streams.scala.kstream.SuppressedTest > BufferConfig should support very long chains of factory methods STARTED

org.apache.kafka.streams.scala.kstream.SuppressedTest > BufferConfig should support very long chains of factory methods PASSED

org.apache.kafka.streams.scala.kstream.MaterializedTest > Create a Materialized should create a Materialized with Serdes STARTED

org.apache.kafka.streams.scala.kstream.MaterializedTest > Create a Materialized should create a Materialized with Serdes PASSED

org.apache.kafka.streams.scala.kstream.MaterializedTest > Create a Materialize with a store name should create a Materialized with Serdes and a store name STARTED

org.apache.kafka.streams.scala.kstream.MaterializedTest > Create a Materialize with a store name should create a Materialized with Serdes and a store name PASSED

org.apache.kafka.streams.scala.kstream.MaterializedTest > Create a Materialize with a window store supplier should create a Materialized with Serdes and a store supplier STARTED

org.apache.kafka.streams.scala.kstream.MaterializedTest > Create a Materialize with a window store supplier should create a Materialized with Serdes and a store supplier PASSED

org.apache.kafka.streams.scala.kstream.MaterializedTest > Create a Materialize with a key value store supplier should create a Materialized with Serdes and a store supplier STARTED

org.apache.kafka.streams.scala.kstream.MaterializedTest > Create a Materialize with a key value store supplier should create a Materialized with Serdes and a store supplier PASSED

org.apache.kafka.streams.scala.kstream.MaterializedTest > Create a Materialize with a session store supplier should create a Materialized with Serdes and a store supplier STARTED

org.apache.kafka.streams.scala.kstream.MaterializedTest > Create a Materialize with a session store supplier should create a Materialized with Serdes and a store supplier PASSED

org.apache.kafka.streams.scala.WordCountTest > testShouldCountWordsMaterialized STARTED

org.apache.kafka.streams.scala.WordCountTest > testShouldCountWordsMaterialized PASSED

org.apache.kafka.streams.scala.WordCountTest > testShouldCountWordsJava STARTED

org.apache.kafka.streams.scala.WordCountTest > testShouldCountWordsJava PASSED

org.apache.kafka.streams.scala.WordCountTest > testShouldCountWords STARTED

org.apache.kafka.streams.scala.WordCountTest > testShouldCountWords PASSED

org.apache.kafka.streams.scala.StreamToTableJoinScalaIntegrationTestImplicitSerdes > testShouldCountClicksPerRegionWithNamedRepartitionTopic STARTED

org.apache.kafka.streams.scala.StreamToTableJoinScalaIntegrationTestImplicitSerdes > testShouldCountClicksPerRegionWithNamedRepartitionTopic PASSED

org.apache.kafka.streams.scala.StreamToTableJoinScalaIntegrationTestImplicitSerdes > testShouldCountClicksPerRegionJava STARTED

org.apache.kafka.streams.scala.StreamToTableJoinScalaIntegrationTestImplicitSerdes > testShouldCountClicksPerRegionJava PASSED

org.apache.kafka.streams.scala.StreamToTableJoinScalaIntegrationTestImplicitSerdes > testShouldCountClicksPerRegion STARTED

org.apache.kafka.streams.scala.StreamToTableJoinScalaIntegrationTestImplicitSerdes > testShouldCountClicksPerRegion PASSED

org.apache.kafka.streams.scala.TopologyTest > shouldBuildIdenticalTopologyInJavaNScalaJoin STARTED

org.apache.kafka.streams.scala.TopologyTest > shouldBuildIdenticalTopologyInJavaNScalaJoin PASSED

org.apache.kafka.streams.scala.TopologyTest > shouldBuildIdenticalTopologyInJavaNScalaSimple STARTED

org.apache.kafka.streams.scala.TopologyTest > shouldBuildIdenticalTopologyInJavaNScalaSimple PASSED

org.apache.kafka.streams.scala.TopologyTest > shouldBuildIdenticalTopologyInJavaNScalaAggregate STARTED

org.apache.kafka.streams.scala.TopologyTest > shouldBuildIdenticalTopologyInJavaNScalaAggregate PASSED

org.apache.kafka.streams.scala.TopologyTest > shouldBuildIdenticalTopologyInJavaNScalaProperties STARTED

org.apache.kafka.streams.scala.TopologyTest > shouldBuildIdenticalTopologyInJavaNScalaProperties PASSED

org.apache.kafka.streams.scala.TopologyTest > shouldBuildIdenticalTopologyInJavaNScalaTransform STARTED

org.apache.kafka.streams.scala.TopologyTest > shouldBuildIdenticalTopologyInJavaNScalaTransform PASSED

> Task :streams:upgrade-system-tests-10:processTestResources NO-SOURCE
> Task :streams:upgrade-system-tests-10:testClasses
> Task :streams:upgrade-system-tests-10:checkstyleTest
> Task :streams:upgrade-system-tests-10:spotbugsMain NO-SOURCE
> Task :streams:upgrade-system-tests-10:test
> Task :streams:upgrade-system-tests-11:compileJava NO-SOURCE
> Task :streams:upgrade-system-tests-11:processResources NO-SOURCE
> Task :streams:upgrade-system-tests-11:classes UP-TO-DATE
> Task :streams:upgrade-system-tests-11:checkstyleMain NO-SOURCE
> Task :streams:upgrade-system-tests-11:compileTestJava
> Task :streams:upgrade-system-tests-11:processTestResources NO-SOURCE
> Task :streams:upgrade-system-tests-11:testClasses
> Task :streams:upgrade-system-tests-11:checkstyleTest
> Task :streams:upgrade-system-tests-11:spotbugsMain NO-SOURCE
> Task :streams:upgrade-system-tests-11:test
> Task :streams:upgrade-system-tests-20:compileJava NO-SOURCE
> Task :streams:upgrade-system-tests-20:processResources NO-SOURCE
> Task :streams:upgrade-system-tests-20:classes UP-TO-DATE
> Task :streams:upgrade-system-tests-20:checkstyleMain NO-SOURCE
> Task :streams:upgrade-system-tests-20:compileTestJava
> Task :streams:upgrade-system-tests-20:processTestResources NO-SOURCE
> Task :streams:upgrade-system-tests-20:testClasses
> Task :streams:upgrade-system-tests-20:checkstyleTest
> Task :streams:upgrade-system-tests-20:spotbugsMain NO-SOURCE
> Task :streams:upgrade-system-tests-20:test
> Task :streams:upgrade-system-tests-21:compileJava NO-SOURCE
> Task :streams:upgrade-system-tests-21:processResources NO-SOURCE
> Task :streams:upgrade-system-tests-21:classes UP-TO-DATE
> Task :streams:upgrade-system-tests-21:checkstyleMain NO-SOURCE
> Task :streams:upgrade-system-tests-21:compileTestJava
> Task :streams:upgrade-system-tests-21:processTestResources NO-SOURCE
> Task :streams:upgrade-system-tests-21:testClasses
> Task :streams:upgrade-system-tests-21:checkstyleTest
> Task :streams:upgrade-system-tests-21:spotbugsMain NO-SOURCE
> Task :streams:upgrade-system-tests-21:test
> Task :streams:upgrade-system-tests-22:compileJava NO-SOURCE
> Task :streams:upgrade-system-tests-22:processResources NO-SOURCE
> Task :streams:upgrade-system-tests-22:classes UP-TO-DATE
> Task :streams:upgrade-system-tests-22:checkstyleMain NO-SOURCE
> Task :streams:upgrade-system-tests-22:compileTestJava
> Task :streams:upgrade-system-tests-22:processTestResources NO-SOURCE
> Task :streams:upgrade-system-tests-22:testClasses
> Task :streams:upgrade-system-tests-22:checkstyleTest
> Task :streams:upgrade-system-tests-22:spotbugsMain NO-SOURCE
> Task :streams:upgrade-system-tests-22:test
> Task :streams:upgrade-system-tests-23:compileJava NO-SOURCE
> Task :streams:upgrade-system-tests-23:processResources NO-SOURCE
> Task :streams:upgrade-system-tests-23:classes UP-TO-DATE
> Task :streams:upgrade-system-tests-23:checkstyleMain NO-SOURCE
> Task :streams:upgrade-system-tests-23:compileTestJava
> Task :streams:upgrade-system-tests-23:processTestResources NO-SOURCE
> Task :streams:upgrade-system-tests-23:testClasses
> Task :streams:upgrade-system-tests-23:checkstyleTest
> Task :streams:upgrade-system-tests-23:spotbugsMain NO-SOURCE
> Task :streams:upgrade-system-tests-23:test

FAILURE: Build failed with an exception.

* What went wrong:
Execution failed for task ':core:test'.
> There were failing tests. See the report at: file://<https://builds.apache.org/job/kafka-trunk-jdk8/ws/core/build/reports/tests/test/index.html>

* Try:
Run with --stacktrace option to get the stack trace. Run with --info or --debug option to get more log output. Run with --scan to get full insights.

* Get more help at https://help.gradle.org

Deprecated Gradle features were used in this build, making it incompatible with Gradle 6.0.
Use '--warning-mode all' to show the individual deprecation warnings.
See https://docs.gradle.org/5.6.2/userguide/command_line_interface.html#sec:command_line_warnings

BUILD FAILED in 3h 10m 5s
183 actionable tasks: 156 executed, 27 up-to-date
Build step 'Execute shell' marked build as failure
[FINDBUGS] Collecting findbugs analysis files...
Setting GRADLE_4_10_3_HOME=/home/jenkins/tools/gradle/4.10.3
[FINDBUGS] Searching for all files in <https://builds.apache.org/job/kafka-trunk-jdk8/ws/> that match the pattern **/build/reports/*bugs/*.xml
[FINDBUGS] Parsing 17 files in <https://builds.apache.org/job/kafka-trunk-jdk8/ws/>
[FINDBUGS] Successfully parsed file <https://builds.apache.org/job/kafka-trunk-jdk8/ws/clients/build/reports/spotbugs/main.xml> with 0 unique warnings and 0 duplicates.
[FINDBUGS] Successfully parsed file <https://builds.apache.org/job/kafka-trunk-jdk8/ws/connect/api/build/reports/spotbugs/main.xml> with 0 unique warnings and 0 duplicates.
[FINDBUGS] Successfully parsed file <https://builds.apache.org/job/kafka-trunk-jdk8/ws/connect/basic-auth-extension/build/reports/spotbugs/main.xml> with 0 unique warnings and 0 duplicates.
[FINDBUGS] Successfully parsed file <https://builds.apache.org/job/kafka-trunk-jdk8/ws/connect/file/build/reports/spotbugs/main.xml> with 0 unique warnings and 0 duplicates.
[FINDBUGS] Successfully parsed file <https://builds.apache.org/job/kafka-trunk-jdk8/ws/connect/json/build/reports/spotbugs/main.xml> with 0 unique warnings and 0 duplicates.
[FINDBUGS] Successfully parsed file <https://builds.apache.org/job/kafka-trunk-jdk8/ws/connect/runtime/build/reports/spotbugs/main.xml> with 0 unique warnings and 0 duplicates.
[FINDBUGS] Successfully parsed file <https://builds.apache.org/job/kafka-trunk-jdk8/ws/connect/transforms/build/reports/spotbugs/main.xml> with 0 unique warnings and 0 duplicates.
[FINDBUGS] Successfully parsed file <https://builds.apache.org/job/kafka-trunk-jdk8/ws/core/build/reports/spotbugs/main.xml> with 0 unique warnings and 0 duplicates.
[FINDBUGS] Successfully parsed file <https://builds.apache.org/job/kafka-trunk-jdk8/ws/examples/build/reports/spotbugs/main.xml> with 0 unique warnings and 0 duplicates.
[FINDBUGS] Successfully parsed file <https://builds.apache.org/job/kafka-trunk-jdk8/ws/generator/build/reports/spotbugs/main.xml> with 0 unique warnings and 0 duplicates.
[FINDBUGS] Successfully parsed file <https://builds.apache.org/job/kafka-trunk-jdk8/ws/jmh-benchmarks/build/reports/spotbugs/main.xml> with 0 unique warnings and 0 duplicates.
[FINDBUGS] Successfully parsed file <https://builds.apache.org/job/kafka-trunk-jdk8/ws/log4j-appender/build/reports/spotbugs/main.xml> with 0 unique warnings and 0 duplicates.
[FINDBUGS] Successfully parsed file <https://builds.apache.org/job/kafka-trunk-jdk8/ws/streams/build/reports/spotbugs/main.xml> with 0 unique warnings and 0 duplicates.
[FINDBUGS] Successfully parsed file <https://builds.apache.org/job/kafka-trunk-jdk8/ws/streams/examples/build/reports/spotbugs/main.xml> with 0 unique warnings and 0 duplicates.
[FINDBUGS] Successfully parsed file <https://builds.apache.org/job/kafka-trunk-jdk8/ws/streams/streams-scala/build/reports/spotbugs/main.xml> with 0 unique warnings and 0 duplicates.
[FINDBUGS] Successfully parsed file <https://builds.apache.org/job/kafka-trunk-jdk8/ws/streams/test-utils/build/reports/spotbugs/main.xml> with 0 unique warnings and 0 duplicates.
[FINDBUGS] Successfully parsed file <https://builds.apache.org/job/kafka-trunk-jdk8/ws/tools/build/reports/spotbugs/main.xml> with 0 unique warnings and 0 duplicates.
Setting GRADLE_4_10_3_HOME=/home/jenkins/tools/gradle/4.10.3
No credentials specified
Setting GRADLE_4_10_3_HOME=/home/jenkins/tools/gradle/4.10.3
<Git Blamer> Using GitBlamer to create author and commit information for all warnings.
<Git Blamer> GIT_COMMIT=e98e239a0c7fd9a500de606b7a05582f1a384da4, workspace=<https://builds.apache.org/job/kafka-trunk-jdk8/ws/>
[FINDBUGS] Computing warning deltas based on reference build #3914
Recording test results
Setting GRADLE_4_10_3_HOME=/home/jenkins/tools/gradle/4.10.3
Setting GRADLE_4_10_3_HOME=/home/jenkins/tools/gradle/4.10.3
Not sending mail to unregistered user noreply@github.com

Jenkins build is back to normal : kafka-trunk-jdk8 #3926

Posted by Apache Jenkins Server <je...@builds.apache.org>.
See <https://builds.apache.org/job/kafka-trunk-jdk8/3926/display/redirect?page=changes>


Build failed in Jenkins: kafka-trunk-jdk8 #3925

Posted by Apache Jenkins Server <je...@builds.apache.org>.
See <https://builds.apache.org/job/kafka-trunk-jdk8/3925/display/redirect>

------------------------------------------
[...truncated 4.15 KB...]
	at hudson.Proc$LocalProc.<init>(Proc.java:218)
	at hudson.Launcher$LocalLauncher.launch(Launcher.java:936)
	at hudson.Launcher$ProcStarter.start(Launcher.java:455)
	at org.jenkinsci.plugins.gitclient.CliGitAPIImpl.launchCommandIn(CliGitAPIImpl.java:2038)
	... 15 more
Caused by: java.io.IOException: error=11, Resource temporarily unavailable
	at java.lang.UNIXProcess.forkAndExec(Native Method)
	at java.lang.UNIXProcess.<init>(UNIXProcess.java:247)
	at java.lang.ProcessImpl.start(ProcessImpl.java:134)
	at java.lang.ProcessBuilder.start(ProcessBuilder.java:1029)
	... 20 more
ERROR: Error cloning remote repo 'origin'
Retrying after 10 seconds
No credentials specified
Cloning the remote Git repository
Cloning repository https://github.com/apache/kafka.git
 > git init <https://builds.apache.org/job/kafka-trunk-jdk8/ws/> # timeout=10
ERROR: Error cloning remote repo 'origin'
hudson.plugins.git.GitException: Could not init <https://builds.apache.org/job/kafka-trunk-jdk8/ws/>
	at org.jenkinsci.plugins.gitclient.CliGitAPIImpl$5.execute(CliGitAPIImpl.java:813)
	at org.jenkinsci.plugins.gitclient.CliGitAPIImpl$2.execute(CliGitAPIImpl.java:605)
	at org.jenkinsci.plugins.gitclient.RemoteGitImpl$CommandInvocationHandler$1.call(RemoteGitImpl.java:153)
	at org.jenkinsci.plugins.gitclient.RemoteGitImpl$CommandInvocationHandler$1.call(RemoteGitImpl.java:146)
	at hudson.remoting.UserRequest.perform(UserRequest.java:212)
	at hudson.remoting.UserRequest.perform(UserRequest.java:54)
	at hudson.remoting.Request$2.run(Request.java:369)
	at hudson.remoting.InterceptingExecutorService$1.call(InterceptingExecutorService.java:72)
	at java.util.concurrent.FutureTask.run(FutureTask.java:266)
	at java.util.concurrent.ThreadPoolExecutor.runWorker(ThreadPoolExecutor.java:1142)
	at java.util.concurrent.ThreadPoolExecutor$Worker.run(ThreadPoolExecutor.java:617)
	at java.lang.Thread.run(Thread.java:748)
	Suppressed: hudson.remoting.Channel$CallSiteStackTrace: Remote call to H40
		at hudson.remoting.Channel.attachCallSiteStackTrace(Channel.java:1741)
		at hudson.remoting.UserRequest$ExceptionResponse.retrieve(UserRequest.java:357)
		at hudson.remoting.Channel.call(Channel.java:955)
		at org.jenkinsci.plugins.gitclient.RemoteGitImpl$CommandInvocationHandler.execute(RemoteGitImpl.java:146)
		at sun.reflect.GeneratedMethodAccessor1084.invoke(Unknown Source)
		at sun.reflect.DelegatingMethodAccessorImpl.invoke(DelegatingMethodAccessorImpl.java:43)
		at java.lang.reflect.Method.invoke(Method.java:498)
		at org.jenkinsci.plugins.gitclient.RemoteGitImpl$CommandInvocationHandler.invoke(RemoteGitImpl.java:132)
		at com.sun.proxy.$Proxy135.execute(Unknown Source)
		at hudson.plugins.git.GitSCM.retrieveChanges(GitSCM.java:1152)
		at hudson.plugins.git.GitSCM.checkout(GitSCM.java:1192)
		at hudson.scm.SCM.checkout(SCM.java:504)
		at hudson.model.AbstractProject.checkout(AbstractProject.java:1208)
		at hudson.model.AbstractBuild$AbstractBuildExecution.defaultCheckout(AbstractBuild.java:574)
		at jenkins.scm.SCMCheckoutStrategy.checkout(SCMCheckoutStrategy.java:86)
		at hudson.model.AbstractBuild$AbstractBuildExecution.run(AbstractBuild.java:499)
		at hudson.model.Run.execute(Run.java:1810)
		at hudson.model.FreeStyleBuild.run(FreeStyleBuild.java:43)
		at hudson.model.ResourceController.execute(ResourceController.java:97)
		at hudson.model.Executor.run(Executor.java:429)
Caused by: hudson.plugins.git.GitException: Error performing command: git init <https://builds.apache.org/job/kafka-trunk-jdk8/ws/>
	at org.jenkinsci.plugins.gitclient.CliGitAPIImpl.launchCommandIn(CliGitAPIImpl.java:2049)
	at org.jenkinsci.plugins.gitclient.CliGitAPIImpl.launchCommandIn(CliGitAPIImpl.java:2010)
	at org.jenkinsci.plugins.gitclient.CliGitAPIImpl.launchCommandIn(CliGitAPIImpl.java:2006)
	at org.jenkinsci.plugins.gitclient.CliGitAPIImpl.launchCommand(CliGitAPIImpl.java:1638)
	at org.jenkinsci.plugins.gitclient.CliGitAPIImpl$5.execute(CliGitAPIImpl.java:811)
	... 11 more
Caused by: java.io.IOException: Cannot run program "git" (in directory "<https://builds.apache.org/job/kafka-trunk-jdk8/ws/")>: error=11, Resource temporarily unavailable
	at java.lang.ProcessBuilder.start(ProcessBuilder.java:1048)
	at hudson.Proc$LocalProc.<init>(Proc.java:249)
	at hudson.Proc$LocalProc.<init>(Proc.java:218)
	at hudson.Launcher$LocalLauncher.launch(Launcher.java:936)
	at hudson.Launcher$ProcStarter.start(Launcher.java:455)
	at org.jenkinsci.plugins.gitclient.CliGitAPIImpl.launchCommandIn(CliGitAPIImpl.java:2038)
	... 15 more
Caused by: java.io.IOException: error=11, Resource temporarily unavailable
	at java.lang.UNIXProcess.forkAndExec(Native Method)
	at java.lang.UNIXProcess.<init>(UNIXProcess.java:247)
	at java.lang.ProcessImpl.start(ProcessImpl.java:134)
	at java.lang.ProcessBuilder.start(ProcessBuilder.java:1029)
	... 20 more
ERROR: Error cloning remote repo 'origin'
Retrying after 10 seconds
No credentials specified
Cloning the remote Git repository
Cloning repository https://github.com/apache/kafka.git
 > git init <https://builds.apache.org/job/kafka-trunk-jdk8/ws/> # timeout=10
ERROR: Error cloning remote repo 'origin'
hudson.plugins.git.GitException: Could not init <https://builds.apache.org/job/kafka-trunk-jdk8/ws/>
	at org.jenkinsci.plugins.gitclient.CliGitAPIImpl$5.execute(CliGitAPIImpl.java:813)
	at org.jenkinsci.plugins.gitclient.CliGitAPIImpl$2.execute(CliGitAPIImpl.java:605)
	at org.jenkinsci.plugins.gitclient.RemoteGitImpl$CommandInvocationHandler$1.call(RemoteGitImpl.java:153)
	at org.jenkinsci.plugins.gitclient.RemoteGitImpl$CommandInvocationHandler$1.call(RemoteGitImpl.java:146)
	at hudson.remoting.UserRequest.perform(UserRequest.java:212)
	at hudson.remoting.UserRequest.perform(UserRequest.java:54)
	at hudson.remoting.Request$2.run(Request.java:369)
	at hudson.remoting.InterceptingExecutorService$1.call(InterceptingExecutorService.java:72)
	at java.util.concurrent.FutureTask.run(FutureTask.java:266)
	at java.util.concurrent.ThreadPoolExecutor.runWorker(ThreadPoolExecutor.java:1142)
	at java.util.concurrent.ThreadPoolExecutor$Worker.run(ThreadPoolExecutor.java:617)
	at java.lang.Thread.run(Thread.java:748)
	Suppressed: hudson.remoting.Channel$CallSiteStackTrace: Remote call to H40
		at hudson.remoting.Channel.attachCallSiteStackTrace(Channel.java:1741)
		at hudson.remoting.UserRequest$ExceptionResponse.retrieve(UserRequest.java:357)
		at hudson.remoting.Channel.call(Channel.java:955)
		at org.jenkinsci.plugins.gitclient.RemoteGitImpl$CommandInvocationHandler.execute(RemoteGitImpl.java:146)
		at sun.reflect.GeneratedMethodAccessor1084.invoke(Unknown Source)
		at sun.reflect.DelegatingMethodAccessorImpl.invoke(DelegatingMethodAccessorImpl.java:43)
		at java.lang.reflect.Method.invoke(Method.java:498)
		at org.jenkinsci.plugins.gitclient.RemoteGitImpl$CommandInvocationHandler.invoke(RemoteGitImpl.java:132)
		at com.sun.proxy.$Proxy135.execute(Unknown Source)
		at hudson.plugins.git.GitSCM.retrieveChanges(GitSCM.java:1152)
		at hudson.plugins.git.GitSCM.checkout(GitSCM.java:1192)
		at hudson.scm.SCM.checkout(SCM.java:504)
		at hudson.model.AbstractProject.checkout(AbstractProject.java:1208)
		at hudson.model.AbstractBuild$AbstractBuildExecution.defaultCheckout(AbstractBuild.java:574)
		at jenkins.scm.SCMCheckoutStrategy.checkout(SCMCheckoutStrategy.java:86)
		at hudson.model.AbstractBuild$AbstractBuildExecution.run(AbstractBuild.java:499)
		at hudson.model.Run.execute(Run.java:1810)
		at hudson.model.FreeStyleBuild.run(FreeStyleBuild.java:43)
		at hudson.model.ResourceController.execute(ResourceController.java:97)
		at hudson.model.Executor.run(Executor.java:429)
Caused by: hudson.plugins.git.GitException: Error performing command: git init <https://builds.apache.org/job/kafka-trunk-jdk8/ws/>
	at org.jenkinsci.plugins.gitclient.CliGitAPIImpl.launchCommandIn(CliGitAPIImpl.java:2049)
	at org.jenkinsci.plugins.gitclient.CliGitAPIImpl.launchCommandIn(CliGitAPIImpl.java:2010)
	at org.jenkinsci.plugins.gitclient.CliGitAPIImpl.launchCommandIn(CliGitAPIImpl.java:2006)
	at org.jenkinsci.plugins.gitclient.CliGitAPIImpl.launchCommand(CliGitAPIImpl.java:1638)
	at org.jenkinsci.plugins.gitclient.CliGitAPIImpl$5.execute(CliGitAPIImpl.java:811)
	... 11 more
Caused by: java.io.IOException: Cannot run program "git" (in directory "<https://builds.apache.org/job/kafka-trunk-jdk8/ws/")>: error=11, Resource temporarily unavailable
	at java.lang.ProcessBuilder.start(ProcessBuilder.java:1048)
	at hudson.Proc$LocalProc.<init>(Proc.java:249)
	at hudson.Proc$LocalProc.<init>(Proc.java:218)
	at hudson.Launcher$LocalLauncher.launch(Launcher.java:936)
	at hudson.Launcher$ProcStarter.start(Launcher.java:455)
	at org.jenkinsci.plugins.gitclient.CliGitAPIImpl.launchCommandIn(CliGitAPIImpl.java:2038)
	... 15 more
Caused by: java.io.IOException: error=11, Resource temporarily unavailable
	at java.lang.UNIXProcess.forkAndExec(Native Method)
	at java.lang.UNIXProcess.<init>(UNIXProcess.java:247)
	at java.lang.ProcessImpl.start(ProcessImpl.java:134)
	at java.lang.ProcessBuilder.start(ProcessBuilder.java:1029)
	... 20 more
ERROR: Error cloning remote repo 'origin'
[FINDBUGS] Collecting findbugs analysis files...
ERROR: Step ?[Deprecated] Publish FindBugs analysis results? aborted due to exception: 
Also:   hudson.remoting.Channel$CallSiteStackTrace: Remote call to H40
		at hudson.remoting.Channel.attachCallSiteStackTrace(Channel.java:1741)
		at hudson.remoting.UserRequest$ExceptionResponse.retrieve(UserRequest.java:357)
		at hudson.remoting.Channel.call(Channel.java:955)
		at hudson.FilePath.act(FilePath.java:1072)
		at hudson.FilePath.act(FilePath.java:1061)
		at hudson.plugins.findbugs.FindBugsPublisher.perform(FindBugsPublisher.java:144)
		at hudson.plugins.analysis.core.HealthAwarePublisher.perform(HealthAwarePublisher.java:69)
		at hudson.plugins.analysis.core.HealthAwareRecorder.perform(HealthAwareRecorder.java:298)
		at hudson.tasks.BuildStepCompatibilityLayer.perform(BuildStepCompatibilityLayer.java:81)
		at hudson.tasks.BuildStepMonitor$1.perform(BuildStepMonitor.java:20)
		at hudson.model.AbstractBuild$AbstractBuildExecution.perform(AbstractBuild.java:744)
		at hudson.model.AbstractBuild$AbstractBuildExecution.performAllBuildSteps(AbstractBuild.java:690)
		at hudson.model.Build$BuildExecution.post2(Build.java:186)
		at hudson.model.AbstractBuild$AbstractBuildExecution.post(AbstractBuild.java:635)
		at hudson.model.Run.execute(Run.java:1835)
		at hudson.model.FreeStyleBuild.run(FreeStyleBuild.java:43)
		at hudson.model.ResourceController.execute(ResourceController.java:97)
		at hudson.model.Executor.run(Executor.java:429)
java.lang.OutOfMemoryError: unable to create new native thread
	at java.lang.Thread.start0(Native Method)
	at java.lang.Thread.start(Thread.java:717)
	at java.util.concurrent.ThreadPoolExecutor.addWorker(ThreadPoolExecutor.java:950)
	at java.util.concurrent.ThreadPoolExecutor.execute(ThreadPoolExecutor.java:1368)
	at java.util.concurrent.AbstractExecutorService.submit(AbstractExecutorService.java:134)
	at hudson.remoting.DelegatingExecutorService.submit(DelegatingExecutorService.java:42)
	at hudson.remoting.InterceptingExecutorService.submit(InterceptingExecutorService.java:46)
	at hudson.remoting.InterceptingExecutorService.submit(InterceptingExecutorService.java:41)
	at org.jenkinsci.remoting.util.AnonymousClassWarnings.check(AnonymousClassWarnings.java:65)
	at hudson.remoting.MultiClassLoaderSerializer$Output.annotateClass(MultiClassLoaderSerializer.java:50)
	at java.io.ObjectOutputStream.writeNonProxyDesc(ObjectOutputStream.java:1290)
	at java.io.ObjectOutputStream.writeClassDesc(ObjectOutputStream.java:1231)
	at java.io.ObjectOutputStream.writeNonProxyDesc(ObjectOutputStream.java:1294)
	at java.io.ObjectOutputStream.writeClassDesc(ObjectOutputStream.java:1231)
	at java.io.ObjectOutputStream.writeNonProxyDesc(ObjectOutputStream.java:1294)
	at java.io.ObjectOutputStream.writeClassDesc(ObjectOutputStream.java:1231)
	at java.io.ObjectOutputStream.writeOrdinaryObject(ObjectOutputStream.java:1427)
	at java.io.ObjectOutputStream.writeObject0(ObjectOutputStream.java:1178)
	at java.io.ObjectOutputStream.defaultWriteFields(ObjectOutputStream.java:1548)
	at java.io.ObjectOutputStream.writeSerialData(ObjectOutputStream.java:1509)
	at java.io.ObjectOutputStream.writeOrdinaryObject(ObjectOutputStream.java:1432)
	at java.io.ObjectOutputStream.writeObject0(ObjectOutputStream.java:1178)
	at java.io.ObjectOutputStream.writeObject(ObjectOutputStream.java:348)
	at hudson.remoting.UserRequest._serialize(UserRequest.java:264)
	at hudson.remoting.UserRequest.serialize(UserRequest.java:273)
	at hudson.remoting.UserRequest.<init>(UserRequest.java:101)
	at hudson.remoting.Channel.callAsync(Channel.java:985)
	at hudson.remoting.RemoteInvocationHandler.invoke(RemoteInvocationHandler.java:282)
	at com.sun.proxy.$Proxy3.notifyJarPresence(Unknown Source)
	at hudson.remoting.FileSystemJarCache.lookInCache(FileSystemJarCache.java:80)
	at hudson.remoting.JarCacheSupport.resolve(JarCacheSupport.java:46)
	at hudson.remoting.ResourceImageInJar._resolveJarURL(ResourceImageInJar.java:90)
	at hudson.remoting.ResourceImageInJar.resolve(ResourceImageInJar.java:43)
	at hudson.remoting.RemoteClassLoader.findClass(RemoteClassLoader.java:304)
	at java.lang.ClassLoader.loadClass(ClassLoader.java:424)
	at java.lang.ClassLoader.loadClass(ClassLoader.java:357)
	at java.lang.Class.getDeclaredMethods0(Native Method)
	at java.lang.Class.privateGetDeclaredMethods(Class.java:2701)
	at java.lang.Class.getDeclaredMethod(Class.java:2128)
	at java.io.ObjectStreamClass.getPrivateMethod(ObjectStreamClass.java:1475)
	at java.io.ObjectStreamClass.access$1700(ObjectStreamClass.java:72)
	at java.io.ObjectStreamClass$2.run(ObjectStreamClass.java:498)
	at java.io.ObjectStreamClass$2.run(ObjectStreamClass.java:472)
	at java.security.AccessController.doPrivileged(Native Method)
	at java.io.ObjectStreamClass.<init>(ObjectStreamClass.java:472)
	at java.io.ObjectStreamClass.lookup(ObjectStreamClass.java:369)
	at java.io.ObjectStreamClass.initNonProxy(ObjectStreamClass.java:598)
	at java.io.ObjectInputStream.readNonProxyDesc(ObjectInputStream.java:1843)
	at java.io.ObjectInputStream.readClassDesc(ObjectInputStream.java:1713)
	at java.io.ObjectInputStream.readOrdinaryObject(ObjectInputStream.java:2000)
	at java.io.ObjectInputStream.readObject0(ObjectInputStream.java:1535)
	at java.io.ObjectInputStream.defaultReadFields(ObjectInputStream.java:2245)
	at java.io.ObjectInputStream.readSerialData(ObjectInputStream.java:2169)
	at java.io.ObjectInputStream.readOrdinaryObject(ObjectInputStream.java:2027)
	at java.io.ObjectInputStream.readObject0(ObjectInputStream.java:1535)
	at java.io.ObjectInputStream.defaultReadFields(ObjectInputStream.java:2245)
	at java.io.ObjectInputStream.readSerialData(ObjectInputStream.java:2169)
	at java.io.ObjectInputStream.readOrdinaryObject(ObjectInputStream.java:2027)
	at java.io.ObjectInputStream.readObject0(ObjectInputStream.java:1535)
	at java.io.ObjectInputStream.readObject(ObjectInputStream.java:422)
	at hudson.remoting.UserRequest.deserialize(UserRequest.java:291)
	at hudson.remoting.UserRequest.perform(UserRequest.java:190)
	at hudson.remoting.UserRequest.perform(UserRequest.java:54)
	at hudson.remoting.Request$2.run(Request.java:369)
	at hudson.remoting.InterceptingExecutorService$1.call(InterceptingExecutorService.java:72)
	at java.util.concurrent.FutureTask.run(FutureTask.java:266)
	at java.util.concurrent.ThreadPoolExecutor.runWorker(ThreadPoolExecutor.java:1142)
	at java.util.concurrent.ThreadPoolExecutor$Worker.run(ThreadPoolExecutor.java:617)
	at java.lang.Thread.run(Thread.java:748)
Caused: java.io.IOException: Remote call on H40 failed
	at hudson.remoting.Channel.call(Channel.java:961)
	at hudson.FilePath.act(FilePath.java:1072)
	at hudson.FilePath.act(FilePath.java:1061)
	at hudson.plugins.findbugs.FindBugsPublisher.perform(FindBugsPublisher.java:144)
	at hudson.plugins.analysis.core.HealthAwarePublisher.perform(HealthAwarePublisher.java:69)
	at hudson.plugins.analysis.core.HealthAwareRecorder.perform(HealthAwareRecorder.java:298)
	at hudson.tasks.BuildStepCompatibilityLayer.perform(BuildStepCompatibilityLayer.java:81)
	at hudson.tasks.BuildStepMonitor$1.perform(BuildStepMonitor.java:20)
	at hudson.model.AbstractBuild$AbstractBuildExecution.perform(AbstractBuild.java:744)
	at hudson.model.AbstractBuild$AbstractBuildExecution.performAllBuildSteps(AbstractBuild.java:690)
	at hudson.model.Build$BuildExecution.post2(Build.java:186)
	at hudson.model.AbstractBuild$AbstractBuildExecution.post(AbstractBuild.java:635)
	at hudson.model.Run.execute(Run.java:1835)
	at hudson.model.FreeStyleBuild.run(FreeStyleBuild.java:43)
	at hudson.model.ResourceController.execute(ResourceController.java:97)
	at hudson.model.Executor.run(Executor.java:429)
Recording test results
ERROR: Step ?Publish JUnit test result report? failed: No test report files were found. Configuration error?
Not sending mail to unregistered user wangguoz@gmail.com
Not sending mail to unregistered user noreply@github.com
Not sending mail to unregistered user mumrah@gmail.com

Build failed in Jenkins: kafka-trunk-jdk8 #3924

Posted by Apache Jenkins Server <je...@builds.apache.org>.
See <https://builds.apache.org/job/kafka-trunk-jdk8/3924/display/redirect?page=changes>

Changes:

[github] MINOR: Improve the org.apache.kafka.common.protocol code (#7344)

[mumrah] MINOR: improve the Kafka RPC code generator (#7340)

------------------------------------------
[...truncated 5.36 MB...]
org.apache.kafka.streams.TopologyTestDriverTest > shouldForwardRecordsFromSubtopologyToSubtopology[Eos enabled = false] PASSED

org.apache.kafka.streams.TopologyTestDriverTest > shouldNotUpdateStoreForSmallerValue[Eos enabled = false] STARTED

org.apache.kafka.streams.TopologyTestDriverTest > shouldNotUpdateStoreForSmallerValue[Eos enabled = false] PASSED

org.apache.kafka.streams.TopologyTestDriverTest > shouldCreateStateDirectoryForStatefulTopology[Eos enabled = false] STARTED

org.apache.kafka.streams.TopologyTestDriverTest > shouldCreateStateDirectoryForStatefulTopology[Eos enabled = false] PASSED

org.apache.kafka.streams.TopologyTestDriverTest > shouldPunctuateIfWallClockTimeAdvances[Eos enabled = false] STARTED

org.apache.kafka.streams.TopologyTestDriverTest > shouldPunctuateIfWallClockTimeAdvances[Eos enabled = false] PASSED

org.apache.kafka.streams.MockTimeTest > shouldGetNanosAsMillis STARTED

org.apache.kafka.streams.MockTimeTest > shouldGetNanosAsMillis PASSED

org.apache.kafka.streams.MockTimeTest > shouldSetStartTime STARTED

org.apache.kafka.streams.MockTimeTest > shouldSetStartTime PASSED

org.apache.kafka.streams.MockTimeTest > shouldNotAllowNegativeSleep STARTED

org.apache.kafka.streams.MockTimeTest > shouldNotAllowNegativeSleep PASSED

org.apache.kafka.streams.MockTimeTest > shouldAdvanceTimeOnSleep STARTED

org.apache.kafka.streams.MockTimeTest > shouldAdvanceTimeOnSleep PASSED

org.apache.kafka.streams.internals.KeyValueStoreFacadeTest > shouldReturnIsOpen STARTED

org.apache.kafka.streams.internals.KeyValueStoreFacadeTest > shouldReturnIsOpen PASSED

org.apache.kafka.streams.internals.KeyValueStoreFacadeTest > shouldDeleteAndReturnPlainValue STARTED

org.apache.kafka.streams.internals.KeyValueStoreFacadeTest > shouldDeleteAndReturnPlainValue PASSED

org.apache.kafka.streams.internals.KeyValueStoreFacadeTest > shouldReturnName STARTED

org.apache.kafka.streams.internals.KeyValueStoreFacadeTest > shouldReturnName PASSED

org.apache.kafka.streams.internals.KeyValueStoreFacadeTest > shouldPutWithUnknownTimestamp STARTED

org.apache.kafka.streams.internals.KeyValueStoreFacadeTest > shouldPutWithUnknownTimestamp PASSED

org.apache.kafka.streams.internals.KeyValueStoreFacadeTest > shouldPutAllWithUnknownTimestamp STARTED

org.apache.kafka.streams.internals.KeyValueStoreFacadeTest > shouldPutAllWithUnknownTimestamp PASSED

org.apache.kafka.streams.internals.KeyValueStoreFacadeTest > shouldReturnIsPersistent STARTED

org.apache.kafka.streams.internals.KeyValueStoreFacadeTest > shouldReturnIsPersistent PASSED

org.apache.kafka.streams.internals.KeyValueStoreFacadeTest > shouldPutIfAbsentWithUnknownTimestamp STARTED

org.apache.kafka.streams.internals.KeyValueStoreFacadeTest > shouldPutIfAbsentWithUnknownTimestamp PASSED

org.apache.kafka.streams.internals.KeyValueStoreFacadeTest > shouldForwardClose STARTED

org.apache.kafka.streams.internals.KeyValueStoreFacadeTest > shouldForwardClose PASSED

org.apache.kafka.streams.internals.KeyValueStoreFacadeTest > shouldForwardFlush STARTED

org.apache.kafka.streams.internals.KeyValueStoreFacadeTest > shouldForwardFlush PASSED

org.apache.kafka.streams.internals.KeyValueStoreFacadeTest > shouldForwardInit STARTED

org.apache.kafka.streams.internals.KeyValueStoreFacadeTest > shouldForwardInit PASSED

org.apache.kafka.streams.internals.WindowStoreFacadeTest > shouldReturnIsOpen STARTED

org.apache.kafka.streams.internals.WindowStoreFacadeTest > shouldReturnIsOpen PASSED

org.apache.kafka.streams.internals.WindowStoreFacadeTest > shouldReturnName STARTED

org.apache.kafka.streams.internals.WindowStoreFacadeTest > shouldReturnName PASSED

org.apache.kafka.streams.internals.WindowStoreFacadeTest > shouldPutWithUnknownTimestamp STARTED

org.apache.kafka.streams.internals.WindowStoreFacadeTest > shouldPutWithUnknownTimestamp PASSED

org.apache.kafka.streams.internals.WindowStoreFacadeTest > shouldPutWindowStartTimestampWithUnknownTimestamp STARTED

org.apache.kafka.streams.internals.WindowStoreFacadeTest > shouldPutWindowStartTimestampWithUnknownTimestamp PASSED

org.apache.kafka.streams.internals.WindowStoreFacadeTest > shouldReturnIsPersistent STARTED

org.apache.kafka.streams.internals.WindowStoreFacadeTest > shouldReturnIsPersistent PASSED

org.apache.kafka.streams.internals.WindowStoreFacadeTest > shouldForwardClose STARTED

org.apache.kafka.streams.internals.WindowStoreFacadeTest > shouldForwardClose PASSED

org.apache.kafka.streams.internals.WindowStoreFacadeTest > shouldForwardFlush STARTED

org.apache.kafka.streams.internals.WindowStoreFacadeTest > shouldForwardFlush PASSED

org.apache.kafka.streams.internals.WindowStoreFacadeTest > shouldForwardInit STARTED

org.apache.kafka.streams.internals.WindowStoreFacadeTest > shouldForwardInit PASSED

> Task :streams:upgrade-system-tests-0100:processTestResources NO-SOURCE
> Task :streams:upgrade-system-tests-0100:testClasses
> Task :streams:upgrade-system-tests-0100:checkstyleTest
> Task :streams:upgrade-system-tests-0100:spotbugsMain NO-SOURCE
> Task :streams:upgrade-system-tests-0100:test
> Task :streams:upgrade-system-tests-0101:compileJava NO-SOURCE
> Task :streams:upgrade-system-tests-0101:processResources NO-SOURCE
> Task :streams:upgrade-system-tests-0101:classes UP-TO-DATE
> Task :streams:upgrade-system-tests-0101:checkstyleMain NO-SOURCE
> Task :streams:upgrade-system-tests-0101:compileTestJava
> Task :streams:upgrade-system-tests-0101:processTestResources NO-SOURCE
> Task :streams:upgrade-system-tests-0101:testClasses
> Task :streams:upgrade-system-tests-0101:checkstyleTest
> Task :streams:upgrade-system-tests-0101:spotbugsMain NO-SOURCE
> Task :streams:upgrade-system-tests-0101:test
> Task :streams:upgrade-system-tests-0102:compileJava NO-SOURCE
> Task :streams:upgrade-system-tests-0102:processResources NO-SOURCE
> Task :streams:upgrade-system-tests-0102:classes UP-TO-DATE
> Task :streams:upgrade-system-tests-0102:checkstyleMain NO-SOURCE
> Task :streams:upgrade-system-tests-0102:compileTestJava
> Task :streams:upgrade-system-tests-0102:processTestResources NO-SOURCE
> Task :streams:upgrade-system-tests-0102:testClasses
> Task :streams:upgrade-system-tests-0102:checkstyleTest
> Task :streams:upgrade-system-tests-0102:spotbugsMain NO-SOURCE
> Task :streams:upgrade-system-tests-0102:test
> Task :streams:upgrade-system-tests-0110:compileJava NO-SOURCE
> Task :streams:upgrade-system-tests-0110:processResources NO-SOURCE
> Task :streams:upgrade-system-tests-0110:classes UP-TO-DATE
> Task :streams:upgrade-system-tests-0110:checkstyleMain NO-SOURCE
> Task :streams:upgrade-system-tests-0110:compileTestJava
> Task :streams:upgrade-system-tests-0110:processTestResources NO-SOURCE
> Task :streams:upgrade-system-tests-0110:testClasses
> Task :streams:upgrade-system-tests-0110:checkstyleTest
> Task :streams:upgrade-system-tests-0110:spotbugsMain NO-SOURCE
> Task :streams:upgrade-system-tests-0110:test
> Task :streams:upgrade-system-tests-10:compileJava NO-SOURCE
> Task :streams:upgrade-system-tests-10:processResources NO-SOURCE
> Task :streams:upgrade-system-tests-10:classes UP-TO-DATE
> Task :streams:upgrade-system-tests-10:checkstyleMain NO-SOURCE
> Task :streams:upgrade-system-tests-10:compileTestJava
> Task :streams:upgrade-system-tests-10:processTestResources NO-SOURCE
> Task :streams:upgrade-system-tests-10:testClasses
> Task :streams:upgrade-system-tests-10:checkstyleTest
> Task :streams:upgrade-system-tests-10:spotbugsMain NO-SOURCE
> Task :streams:upgrade-system-tests-10:test
> Task :streams:upgrade-system-tests-11:compileJava NO-SOURCE
> Task :streams:upgrade-system-tests-11:processResources NO-SOURCE
> Task :streams:upgrade-system-tests-11:classes UP-TO-DATE
> Task :streams:upgrade-system-tests-11:checkstyleMain NO-SOURCE
> Task :streams:upgrade-system-tests-11:compileTestJava
> Task :streams:upgrade-system-tests-11:processTestResources NO-SOURCE
> Task :streams:upgrade-system-tests-11:testClasses
> Task :streams:upgrade-system-tests-11:checkstyleTest
> Task :streams:upgrade-system-tests-11:spotbugsMain NO-SOURCE
> Task :streams:upgrade-system-tests-11:test
> Task :streams:upgrade-system-tests-20:compileJava NO-SOURCE
> Task :streams:upgrade-system-tests-20:processResources NO-SOURCE
> Task :streams:upgrade-system-tests-20:classes UP-TO-DATE
> Task :streams:upgrade-system-tests-20:checkstyleMain NO-SOURCE
> Task :streams:upgrade-system-tests-20:compileTestJava
> Task :streams:upgrade-system-tests-20:processTestResources NO-SOURCE
> Task :streams:upgrade-system-tests-20:testClasses
> Task :streams:upgrade-system-tests-20:checkstyleTest
> Task :streams:upgrade-system-tests-20:spotbugsMain NO-SOURCE
> Task :streams:upgrade-system-tests-20:test
> Task :streams:upgrade-system-tests-21:compileJava NO-SOURCE
> Task :streams:upgrade-system-tests-21:processResources NO-SOURCE
> Task :streams:upgrade-system-tests-21:classes UP-TO-DATE
> Task :streams:upgrade-system-tests-21:checkstyleMain NO-SOURCE
> Task :streams:upgrade-system-tests-21:compileTestJava
> Task :streams:upgrade-system-tests-21:processTestResources NO-SOURCE
> Task :streams:upgrade-system-tests-21:testClasses
> Task :streams:upgrade-system-tests-21:checkstyleTest
> Task :streams:upgrade-system-tests-21:spotbugsMain NO-SOURCE
> Task :streams:upgrade-system-tests-21:test
> Task :streams:upgrade-system-tests-22:compileJava NO-SOURCE
> Task :streams:upgrade-system-tests-22:processResources NO-SOURCE
> Task :streams:upgrade-system-tests-22:classes UP-TO-DATE
> Task :streams:upgrade-system-tests-22:checkstyleMain NO-SOURCE
> Task :streams:upgrade-system-tests-22:compileTestJava
> Task :streams:upgrade-system-tests-22:processTestResources NO-SOURCE
> Task :streams:upgrade-system-tests-22:testClasses
> Task :streams:upgrade-system-tests-22:checkstyleTest
> Task :streams:upgrade-system-tests-22:spotbugsMain NO-SOURCE
> Task :streams:upgrade-system-tests-22:test
> Task :streams:upgrade-system-tests-23:compileJava NO-SOURCE
> Task :streams:upgrade-system-tests-23:processResources NO-SOURCE
> Task :streams:upgrade-system-tests-23:classes UP-TO-DATE
> Task :streams:upgrade-system-tests-23:checkstyleMain NO-SOURCE
> Task :streams:upgrade-system-tests-23:compileTestJava
> Task :streams:upgrade-system-tests-23:processTestResources NO-SOURCE
> Task :streams:upgrade-system-tests-23:testClasses
> Task :streams:upgrade-system-tests-23:checkstyleTest
> Task :streams:upgrade-system-tests-23:spotbugsMain NO-SOURCE
> Task :streams:upgrade-system-tests-23:test

FAILURE: Build failed with an exception.

* What went wrong:
Execution failed for task ':core:test'.
> There were failing tests. See the report at: file://<https://builds.apache.org/job/kafka-trunk-jdk8/ws/core/build/reports/tests/test/index.html>

* Try:
Run with --stacktrace option to get the stack trace. Run with --info or --debug option to get more log output. Run with --scan to get full insights.

* Get more help at https://help.gradle.org

Deprecated Gradle features were used in this build, making it incompatible with Gradle 6.0.
Use '--warning-mode all' to show the individual deprecation warnings.
See https://docs.gradle.org/5.6.2/userguide/command_line_interface.html#sec:command_line_warnings

BUILD FAILED in 3h 27m 26s
183 actionable tasks: 179 executed, 4 up-to-date
Build step 'Execute shell' marked build as failure
[FINDBUGS] Collecting findbugs analysis files...
Setting GRADLE_4_10_3_HOME=/home/jenkins/tools/gradle/4.10.3
[FINDBUGS] Searching for all files in <https://builds.apache.org/job/kafka-trunk-jdk8/ws/> that match the pattern **/build/reports/*bugs/*.xml
[FINDBUGS] Parsing 17 files in <https://builds.apache.org/job/kafka-trunk-jdk8/ws/>
[FINDBUGS] Successfully parsed file <https://builds.apache.org/job/kafka-trunk-jdk8/ws/clients/build/reports/spotbugs/main.xml> with 0 unique warnings and 0 duplicates.
[FINDBUGS] Successfully parsed file <https://builds.apache.org/job/kafka-trunk-jdk8/ws/connect/api/build/reports/spotbugs/main.xml> with 0 unique warnings and 0 duplicates.
[FINDBUGS] Successfully parsed file <https://builds.apache.org/job/kafka-trunk-jdk8/ws/connect/basic-auth-extension/build/reports/spotbugs/main.xml> with 0 unique warnings and 0 duplicates.
[FINDBUGS] Successfully parsed file <https://builds.apache.org/job/kafka-trunk-jdk8/ws/connect/file/build/reports/spotbugs/main.xml> with 0 unique warnings and 0 duplicates.
[FINDBUGS] Successfully parsed file <https://builds.apache.org/job/kafka-trunk-jdk8/ws/connect/json/build/reports/spotbugs/main.xml> with 0 unique warnings and 0 duplicates.
[FINDBUGS] Successfully parsed file <https://builds.apache.org/job/kafka-trunk-jdk8/ws/connect/runtime/build/reports/spotbugs/main.xml> with 0 unique warnings and 0 duplicates.
[FINDBUGS] Successfully parsed file <https://builds.apache.org/job/kafka-trunk-jdk8/ws/connect/transforms/build/reports/spotbugs/main.xml> with 0 unique warnings and 0 duplicates.
[FINDBUGS] Successfully parsed file <https://builds.apache.org/job/kafka-trunk-jdk8/ws/core/build/reports/spotbugs/main.xml> with 0 unique warnings and 0 duplicates.
[FINDBUGS] Successfully parsed file <https://builds.apache.org/job/kafka-trunk-jdk8/ws/examples/build/reports/spotbugs/main.xml> with 0 unique warnings and 0 duplicates.
[FINDBUGS] Successfully parsed file <https://builds.apache.org/job/kafka-trunk-jdk8/ws/generator/build/reports/spotbugs/main.xml> with 0 unique warnings and 0 duplicates.
[FINDBUGS] Successfully parsed file <https://builds.apache.org/job/kafka-trunk-jdk8/ws/jmh-benchmarks/build/reports/spotbugs/main.xml> with 0 unique warnings and 0 duplicates.
[FINDBUGS] Successfully parsed file <https://builds.apache.org/job/kafka-trunk-jdk8/ws/log4j-appender/build/reports/spotbugs/main.xml> with 0 unique warnings and 0 duplicates.
[FINDBUGS] Successfully parsed file <https://builds.apache.org/job/kafka-trunk-jdk8/ws/streams/build/reports/spotbugs/main.xml> with 0 unique warnings and 0 duplicates.
[FINDBUGS] Successfully parsed file <https://builds.apache.org/job/kafka-trunk-jdk8/ws/streams/examples/build/reports/spotbugs/main.xml> with 0 unique warnings and 0 duplicates.
[FINDBUGS] Successfully parsed file <https://builds.apache.org/job/kafka-trunk-jdk8/ws/streams/streams-scala/build/reports/spotbugs/main.xml> with 0 unique warnings and 0 duplicates.
[FINDBUGS] Successfully parsed file <https://builds.apache.org/job/kafka-trunk-jdk8/ws/streams/test-utils/build/reports/spotbugs/main.xml> with 0 unique warnings and 0 duplicates.
[FINDBUGS] Successfully parsed file <https://builds.apache.org/job/kafka-trunk-jdk8/ws/tools/build/reports/spotbugs/main.xml> with 0 unique warnings and 0 duplicates.
Setting GRADLE_4_10_3_HOME=/home/jenkins/tools/gradle/4.10.3
No credentials specified
Setting GRADLE_4_10_3_HOME=/home/jenkins/tools/gradle/4.10.3
<Git Blamer> Using GitBlamer to create author and commit information for all warnings.
<Git Blamer> GIT_COMMIT=92688ef82ccbeee6014ae9c1db64fb4289b7bdd7, workspace=<https://builds.apache.org/job/kafka-trunk-jdk8/ws/>
[FINDBUGS] Computing warning deltas based on reference build #3914
Recording test results
Setting GRADLE_4_10_3_HOME=/home/jenkins/tools/gradle/4.10.3
Setting GRADLE_4_10_3_HOME=/home/jenkins/tools/gradle/4.10.3
Not sending mail to unregistered user wangguoz@gmail.com
Not sending mail to unregistered user noreply@github.com
Not sending mail to unregistered user mumrah@gmail.com

Build failed in Jenkins: kafka-trunk-jdk8 #3923

Posted by Apache Jenkins Server <je...@builds.apache.org>.
See <https://builds.apache.org/job/kafka-trunk-jdk8/3923/display/redirect?page=changes>

Changes:

[github] KAFKA-8880: Docs on upgrade-guide (#7385)

------------------------------------------
[...truncated 3.04 MB...]
org.apache.kafka.streams.test.OutputVerifierTest > shouldFailIfKeyIsDifferentForCompareKeyValueTimestamp PASSED

org.apache.kafka.streams.test.OutputVerifierTest > shouldFailIfKeyIsDifferentForCompareKeyValueTimestampWithProducerRecord STARTED

org.apache.kafka.streams.test.OutputVerifierTest > shouldFailIfKeyIsDifferentForCompareKeyValueTimestampWithProducerRecord PASSED

org.apache.kafka.streams.test.OutputVerifierTest > shouldPassIfValueIsEqualWithNullForCompareValueWithProducerRecord STARTED

org.apache.kafka.streams.test.OutputVerifierTest > shouldPassIfValueIsEqualWithNullForCompareValueWithProducerRecord PASSED

org.apache.kafka.streams.test.OutputVerifierTest > shouldFailIfValueIsDifferentWithNullReverseForCompareValueTimestamp STARTED

org.apache.kafka.streams.test.OutputVerifierTest > shouldFailIfValueIsDifferentWithNullReverseForCompareValueTimestamp PASSED

org.apache.kafka.streams.test.OutputVerifierTest > shouldFailIfValueIsDifferentWithNullReverseForCompareValue STARTED

org.apache.kafka.streams.test.OutputVerifierTest > shouldFailIfValueIsDifferentWithNullReverseForCompareValue PASSED

org.apache.kafka.streams.test.OutputVerifierTest > shouldFailIfTimestampIsDifferentForCompareValueTimestamp STARTED

org.apache.kafka.streams.test.OutputVerifierTest > shouldFailIfTimestampIsDifferentForCompareValueTimestamp PASSED

org.apache.kafka.streams.test.OutputVerifierTest > shouldPassIfKeyAndValueAndTimestampIsEqualWithNullForCompareKeyValueTimestampWithProducerRecord STARTED

org.apache.kafka.streams.test.OutputVerifierTest > shouldPassIfKeyAndValueAndTimestampIsEqualWithNullForCompareKeyValueTimestampWithProducerRecord PASSED

org.apache.kafka.streams.test.OutputVerifierTest > shouldFailIfValueIsDifferentWithNullForCompareKeyValueWithProducerRecord STARTED

org.apache.kafka.streams.test.OutputVerifierTest > shouldFailIfValueIsDifferentWithNullForCompareKeyValueWithProducerRecord PASSED

org.apache.kafka.streams.test.OutputVerifierTest > shouldFailIfValueIsDifferentForCompareKeyValueTimestampWithProducerRecord STARTED

org.apache.kafka.streams.test.OutputVerifierTest > shouldFailIfValueIsDifferentForCompareKeyValueTimestampWithProducerRecord PASSED

org.apache.kafka.streams.test.OutputVerifierTest > shouldNotAllowNullProducerRecordWithExpectedRecordForCompareValueTimestamp STARTED

org.apache.kafka.streams.test.OutputVerifierTest > shouldNotAllowNullProducerRecordWithExpectedRecordForCompareValueTimestamp PASSED

org.apache.kafka.streams.test.OutputVerifierTest > shouldNotAllowNullExpectedRecordForCompareValue STARTED

org.apache.kafka.streams.test.OutputVerifierTest > shouldNotAllowNullExpectedRecordForCompareValue PASSED

org.apache.kafka.streams.test.OutputVerifierTest > shouldFailIfValueIsDifferentWithNullReversForCompareKeyValueTimestampWithProducerRecord STARTED

org.apache.kafka.streams.test.OutputVerifierTest > shouldFailIfValueIsDifferentWithNullReversForCompareKeyValueTimestampWithProducerRecord PASSED

org.apache.kafka.streams.test.OutputVerifierTest > shouldNotAllowNullProducerRecordForCompareKeyValue STARTED

org.apache.kafka.streams.test.OutputVerifierTest > shouldNotAllowNullProducerRecordForCompareKeyValue PASSED

org.apache.kafka.streams.test.OutputVerifierTest > shouldFailIfValueIsDifferentWithNullReversForCompareKeyValueWithProducerRecord STARTED

org.apache.kafka.streams.test.OutputVerifierTest > shouldFailIfValueIsDifferentWithNullReversForCompareKeyValueWithProducerRecord PASSED

org.apache.kafka.streams.test.OutputVerifierTest > shouldPassIfKeyAndValueAndTimestampIsEqualForCompareKeyValueTimestamp STARTED

org.apache.kafka.streams.test.OutputVerifierTest > shouldPassIfKeyAndValueAndTimestampIsEqualForCompareKeyValueTimestamp PASSED

org.apache.kafka.streams.test.OutputVerifierTest > shouldFailIfValueIsDifferentWithNullForCompareKeyValueTimestampWithProducerRecord STARTED

org.apache.kafka.streams.test.OutputVerifierTest > shouldFailIfValueIsDifferentWithNullForCompareKeyValueTimestampWithProducerRecord PASSED

org.apache.kafka.streams.test.OutputVerifierTest > shouldFailIfKeyIsDifferentWithNullReversForCompareKeyValueWithProducerRecord STARTED

org.apache.kafka.streams.test.OutputVerifierTest > shouldFailIfKeyIsDifferentWithNullReversForCompareKeyValueWithProducerRecord PASSED

org.apache.kafka.streams.test.OutputVerifierTest > shouldPassIfKeyAndValueIsEqualWithNullForCompareKeyValueWithProducerRecord STARTED

org.apache.kafka.streams.test.OutputVerifierTest > shouldPassIfKeyAndValueIsEqualWithNullForCompareKeyValueWithProducerRecord PASSED

org.apache.kafka.streams.test.OutputVerifierTest > shouldFailIfKeyIsDifferentWithNullForCompareKeyValueTimestampWithProducerRecord STARTED

org.apache.kafka.streams.test.OutputVerifierTest > shouldFailIfKeyIsDifferentWithNullForCompareKeyValueTimestampWithProducerRecord PASSED

org.apache.kafka.streams.test.OutputVerifierTest > shouldFailIfValueIsDifferentForCompareKeyValueTimestamp STARTED

org.apache.kafka.streams.test.OutputVerifierTest > shouldFailIfValueIsDifferentForCompareKeyValueTimestamp PASSED

org.apache.kafka.streams.test.OutputVerifierTest > shouldPassIfValueAndTimestampIsEqualForCompareValueTimestampWithProducerRecord STARTED

org.apache.kafka.streams.test.OutputVerifierTest > shouldPassIfValueAndTimestampIsEqualForCompareValueTimestampWithProducerRecord PASSED

org.apache.kafka.streams.test.OutputVerifierTest > shouldFailIfValueIsDifferentWithNullReversForCompareKeyValueTimestamp STARTED

org.apache.kafka.streams.test.OutputVerifierTest > shouldFailIfValueIsDifferentWithNullReversForCompareKeyValueTimestamp PASSED

org.apache.kafka.streams.test.OutputVerifierTest > shouldFailIfValueIsDifferentWithNullReverseForCompareValueTimestampWithProducerRecord STARTED

org.apache.kafka.streams.test.OutputVerifierTest > shouldFailIfValueIsDifferentWithNullReverseForCompareValueTimestampWithProducerRecord PASSED

> Task :streams:upgrade-system-tests-0100:processTestResources NO-SOURCE
> Task :streams:upgrade-system-tests-0100:testClasses
> Task :streams:upgrade-system-tests-0100:checkstyleTest
> Task :streams:upgrade-system-tests-0100:spotbugsMain NO-SOURCE
> Task :streams:upgrade-system-tests-0100:test
> Task :streams:upgrade-system-tests-0101:compileJava NO-SOURCE
> Task :streams:upgrade-system-tests-0101:processResources NO-SOURCE
> Task :streams:upgrade-system-tests-0101:classes UP-TO-DATE
> Task :streams:upgrade-system-tests-0101:checkstyleMain NO-SOURCE
> Task :streams:upgrade-system-tests-0101:compileTestJava
> Task :streams:upgrade-system-tests-0101:processTestResources NO-SOURCE
> Task :streams:upgrade-system-tests-0101:testClasses
> Task :streams:upgrade-system-tests-0101:checkstyleTest
> Task :streams:upgrade-system-tests-0101:spotbugsMain NO-SOURCE
> Task :streams:upgrade-system-tests-0101:test
> Task :streams:upgrade-system-tests-0102:compileJava NO-SOURCE
> Task :streams:upgrade-system-tests-0102:processResources NO-SOURCE
> Task :streams:upgrade-system-tests-0102:classes UP-TO-DATE
> Task :streams:upgrade-system-tests-0102:checkstyleMain NO-SOURCE
> Task :streams:upgrade-system-tests-0102:compileTestJava
> Task :streams:upgrade-system-tests-0102:processTestResources NO-SOURCE
> Task :streams:upgrade-system-tests-0102:testClasses
> Task :streams:upgrade-system-tests-0102:checkstyleTest
> Task :streams:upgrade-system-tests-0102:spotbugsMain NO-SOURCE
> Task :streams:upgrade-system-tests-0102:test
> Task :streams:upgrade-system-tests-0110:compileJava NO-SOURCE
> Task :streams:upgrade-system-tests-0110:processResources NO-SOURCE
> Task :streams:upgrade-system-tests-0110:classes UP-TO-DATE
> Task :streams:upgrade-system-tests-0110:checkstyleMain NO-SOURCE
> Task :streams:upgrade-system-tests-0110:compileTestJava
> Task :streams:upgrade-system-tests-0110:processTestResources NO-SOURCE
> Task :streams:upgrade-system-tests-0110:testClasses
> Task :streams:upgrade-system-tests-0110:checkstyleTest
> Task :streams:upgrade-system-tests-0110:spotbugsMain NO-SOURCE
> Task :streams:upgrade-system-tests-0110:test
> Task :streams:upgrade-system-tests-10:compileJava NO-SOURCE
> Task :streams:upgrade-system-tests-10:processResources NO-SOURCE
> Task :streams:upgrade-system-tests-10:classes UP-TO-DATE
> Task :streams:upgrade-system-tests-10:checkstyleMain NO-SOURCE
> Task :streams:upgrade-system-tests-10:compileTestJava
> Task :streams:upgrade-system-tests-10:processTestResources NO-SOURCE
> Task :streams:upgrade-system-tests-10:testClasses
> Task :streams:upgrade-system-tests-10:checkstyleTest
> Task :streams:upgrade-system-tests-10:spotbugsMain NO-SOURCE
> Task :streams:upgrade-system-tests-10:test
> Task :streams:upgrade-system-tests-11:compileJava NO-SOURCE
> Task :streams:upgrade-system-tests-11:processResources NO-SOURCE
> Task :streams:upgrade-system-tests-11:classes UP-TO-DATE
> Task :streams:upgrade-system-tests-11:checkstyleMain NO-SOURCE
> Task :streams:upgrade-system-tests-11:compileTestJava
> Task :streams:upgrade-system-tests-11:processTestResources NO-SOURCE
> Task :streams:upgrade-system-tests-11:testClasses
> Task :streams:upgrade-system-tests-11:checkstyleTest
> Task :streams:upgrade-system-tests-11:spotbugsMain NO-SOURCE
> Task :streams:upgrade-system-tests-11:test
> Task :streams:upgrade-system-tests-20:compileJava NO-SOURCE
> Task :streams:upgrade-system-tests-20:processResources NO-SOURCE
> Task :streams:upgrade-system-tests-20:classes UP-TO-DATE
> Task :streams:upgrade-system-tests-20:checkstyleMain NO-SOURCE
> Task :streams:upgrade-system-tests-20:compileTestJava
> Task :streams:upgrade-system-tests-20:processTestResources NO-SOURCE
> Task :streams:upgrade-system-tests-20:testClasses
> Task :streams:upgrade-system-tests-20:checkstyleTest
> Task :streams:upgrade-system-tests-20:spotbugsMain NO-SOURCE
> Task :streams:upgrade-system-tests-20:test
> Task :streams:upgrade-system-tests-21:compileJava NO-SOURCE
> Task :streams:upgrade-system-tests-21:processResources NO-SOURCE
> Task :streams:upgrade-system-tests-21:classes UP-TO-DATE
> Task :streams:upgrade-system-tests-21:checkstyleMain NO-SOURCE
> Task :streams:upgrade-system-tests-21:compileTestJava
> Task :streams:upgrade-system-tests-21:processTestResources NO-SOURCE
> Task :streams:upgrade-system-tests-21:testClasses
> Task :streams:upgrade-system-tests-21:checkstyleTest
> Task :streams:upgrade-system-tests-21:spotbugsMain NO-SOURCE
> Task :streams:upgrade-system-tests-21:test
> Task :streams:upgrade-system-tests-22:compileJava NO-SOURCE
> Task :streams:upgrade-system-tests-22:processResources NO-SOURCE
> Task :streams:upgrade-system-tests-22:classes UP-TO-DATE
> Task :streams:upgrade-system-tests-22:checkstyleMain NO-SOURCE
> Task :streams:upgrade-system-tests-22:compileTestJava
> Task :streams:upgrade-system-tests-22:processTestResources NO-SOURCE
> Task :streams:upgrade-system-tests-22:testClasses
> Task :streams:upgrade-system-tests-22:checkstyleTest
> Task :streams:upgrade-system-tests-22:spotbugsMain NO-SOURCE
> Task :streams:upgrade-system-tests-22:test
> Task :streams:upgrade-system-tests-23:compileJava NO-SOURCE
> Task :streams:upgrade-system-tests-23:processResources NO-SOURCE
> Task :streams:upgrade-system-tests-23:classes UP-TO-DATE
> Task :streams:upgrade-system-tests-23:checkstyleMain NO-SOURCE
> Task :streams:upgrade-system-tests-23:compileTestJava
> Task :streams:upgrade-system-tests-23:processTestResources NO-SOURCE
> Task :streams:upgrade-system-tests-23:testClasses
> Task :streams:upgrade-system-tests-23:checkstyleTest
> Task :streams:upgrade-system-tests-23:spotbugsMain NO-SOURCE
> Task :streams:upgrade-system-tests-23:test

FAILURE: Build completed with 2 failures.

1: Task failed with an exception.
-----------
* What went wrong:
Execution failed for task ':streams:test'.
> There were failing tests. See the report at: file://<https://builds.apache.org/job/kafka-trunk-jdk8/ws/streams/build/reports/tests/test/index.html>

* Try:
Run with --stacktrace option to get the stack trace. Run with --info or --debug option to get more log output. Run with --scan to get full insights.
==============================================================================

2: Task failed with an exception.
-----------
* What went wrong:
Execution failed for task ':core:test'.
> There were failing tests. See the report at: file://<https://builds.apache.org/job/kafka-trunk-jdk8/ws/core/build/reports/tests/test/index.html>

* Try:
Run with --stacktrace option to get the stack trace. Run with --info or --debug option to get more log output. Run with --scan to get full insights.
==============================================================================

* Get more help at https://help.gradle.org

Deprecated Gradle features were used in this build, making it incompatible with Gradle 6.0.
Use '--warning-mode all' to show the individual deprecation warnings.
See https://docs.gradle.org/5.6.2/userguide/command_line_interface.html#sec:command_line_warnings

BUILD FAILED in 9h 3m 19s
183 actionable tasks: 156 executed, 27 up-to-date
Build step 'Execute shell' marked build as failure
[FINDBUGS] Collecting findbugs analysis files...
Setting GRADLE_4_10_3_HOME=/home/jenkins/tools/gradle/4.10.3
[FINDBUGS] Searching for all files in <https://builds.apache.org/job/kafka-trunk-jdk8/ws/> that match the pattern **/build/reports/*bugs/*.xml
[FINDBUGS] Parsing 17 files in <https://builds.apache.org/job/kafka-trunk-jdk8/ws/>
[FINDBUGS] Successfully parsed file <https://builds.apache.org/job/kafka-trunk-jdk8/ws/clients/build/reports/spotbugs/main.xml> with 0 unique warnings and 0 duplicates.
[FINDBUGS] Successfully parsed file <https://builds.apache.org/job/kafka-trunk-jdk8/ws/connect/api/build/reports/spotbugs/main.xml> with 0 unique warnings and 0 duplicates.
[FINDBUGS] Successfully parsed file <https://builds.apache.org/job/kafka-trunk-jdk8/ws/connect/basic-auth-extension/build/reports/spotbugs/main.xml> with 0 unique warnings and 0 duplicates.
[FINDBUGS] Successfully parsed file <https://builds.apache.org/job/kafka-trunk-jdk8/ws/connect/file/build/reports/spotbugs/main.xml> with 0 unique warnings and 0 duplicates.
[FINDBUGS] Successfully parsed file <https://builds.apache.org/job/kafka-trunk-jdk8/ws/connect/json/build/reports/spotbugs/main.xml> with 0 unique warnings and 0 duplicates.
[FINDBUGS] Successfully parsed file <https://builds.apache.org/job/kafka-trunk-jdk8/ws/connect/runtime/build/reports/spotbugs/main.xml> with 0 unique warnings and 0 duplicates.
[FINDBUGS] Successfully parsed file <https://builds.apache.org/job/kafka-trunk-jdk8/ws/connect/transforms/build/reports/spotbugs/main.xml> with 0 unique warnings and 0 duplicates.
[FINDBUGS] Successfully parsed file <https://builds.apache.org/job/kafka-trunk-jdk8/ws/core/build/reports/spotbugs/main.xml> with 0 unique warnings and 0 duplicates.
[FINDBUGS] Successfully parsed file <https://builds.apache.org/job/kafka-trunk-jdk8/ws/examples/build/reports/spotbugs/main.xml> with 0 unique warnings and 0 duplicates.
[FINDBUGS] Successfully parsed file <https://builds.apache.org/job/kafka-trunk-jdk8/ws/generator/build/reports/spotbugs/main.xml> with 0 unique warnings and 0 duplicates.
[FINDBUGS] Successfully parsed file <https://builds.apache.org/job/kafka-trunk-jdk8/ws/jmh-benchmarks/build/reports/spotbugs/main.xml> with 0 unique warnings and 0 duplicates.
[FINDBUGS] Successfully parsed file <https://builds.apache.org/job/kafka-trunk-jdk8/ws/log4j-appender/build/reports/spotbugs/main.xml> with 0 unique warnings and 0 duplicates.
[FINDBUGS] Successfully parsed file <https://builds.apache.org/job/kafka-trunk-jdk8/ws/streams/build/reports/spotbugs/main.xml> with 0 unique warnings and 0 duplicates.
[FINDBUGS] Successfully parsed file <https://builds.apache.org/job/kafka-trunk-jdk8/ws/streams/examples/build/reports/spotbugs/main.xml> with 0 unique warnings and 0 duplicates.
[FINDBUGS] Successfully parsed file <https://builds.apache.org/job/kafka-trunk-jdk8/ws/streams/streams-scala/build/reports/spotbugs/main.xml> with 0 unique warnings and 0 duplicates.
[FINDBUGS] Successfully parsed file <https://builds.apache.org/job/kafka-trunk-jdk8/ws/streams/test-utils/build/reports/spotbugs/main.xml> with 0 unique warnings and 0 duplicates.
[FINDBUGS] Successfully parsed file <https://builds.apache.org/job/kafka-trunk-jdk8/ws/tools/build/reports/spotbugs/main.xml> with 0 unique warnings and 0 duplicates.
Setting GRADLE_4_10_3_HOME=/home/jenkins/tools/gradle/4.10.3
No credentials specified
Setting GRADLE_4_10_3_HOME=/home/jenkins/tools/gradle/4.10.3
<Git Blamer> Using GitBlamer to create author and commit information for all warnings.
<Git Blamer> GIT_COMMIT=d112ffd8d85de2441a8ea32d080e584d7d16a9a5, workspace=<https://builds.apache.org/job/kafka-trunk-jdk8/ws/>
[FINDBUGS] Computing warning deltas based on reference build #3914
Recording test results
Setting GRADLE_4_10_3_HOME=/home/jenkins/tools/gradle/4.10.3
Setting GRADLE_4_10_3_HOME=/home/jenkins/tools/gradle/4.10.3
Not sending mail to unregistered user wangguoz@gmail.com
Not sending mail to unregistered user noreply@github.com

Build failed in Jenkins: kafka-trunk-jdk8 #3922

Posted by Apache Jenkins Server <je...@builds.apache.org>.
See <https://builds.apache.org/job/kafka-trunk-jdk8/3922/display/redirect?page=changes>

Changes:

[github] KAFKA-8880: Add overloaded function of Consumer.committed (#7304)

[wangguoz] KAFKA-8580: Compute RocksDB metrics (#7263)

[wangguoz] KAFKA-8179: do not suspend standby tasks during rebalance (#7321)

------------------------------------------
[...truncated 2.64 MB...]
org.apache.kafka.streams.TopologyTestDriverTest > shouldSendRecordViaCorrectSourceTopic[Eos enabled = false] STARTED

org.apache.kafka.streams.TopologyTestDriverTest > shouldSendRecordViaCorrectSourceTopic[Eos enabled = false] PASSED

org.apache.kafka.streams.TopologyTestDriverTest > shouldNotCreateStateDirectoryForStatelessTopology[Eos enabled = false] STARTED

org.apache.kafka.streams.TopologyTestDriverTest > shouldNotCreateStateDirectoryForStatelessTopology[Eos enabled = false] PASSED

org.apache.kafka.streams.TopologyTestDriverTest > shouldReturnAllStoresNames[Eos enabled = false] STARTED

org.apache.kafka.streams.TopologyTestDriverTest > shouldReturnAllStoresNames[Eos enabled = false] PASSED

org.apache.kafka.streams.TopologyTestDriverTest > shouldProcessConsumerRecordList[Eos enabled = false] STARTED

org.apache.kafka.streams.TopologyTestDriverTest > shouldProcessConsumerRecordList[Eos enabled = false] PASSED

org.apache.kafka.streams.TopologyTestDriverTest > shouldUseSinkSpecificSerializers[Eos enabled = false] STARTED

org.apache.kafka.streams.TopologyTestDriverTest > shouldUseSinkSpecificSerializers[Eos enabled = false] PASSED

org.apache.kafka.streams.TopologyTestDriverTest > shouldFlushStoreForFirstInput[Eos enabled = false] STARTED

org.apache.kafka.streams.TopologyTestDriverTest > shouldFlushStoreForFirstInput[Eos enabled = false] PASSED

org.apache.kafka.streams.TopologyTestDriverTest > shouldProcessFromSourceThatMatchPattern[Eos enabled = false] STARTED

org.apache.kafka.streams.TopologyTestDriverTest > shouldProcessFromSourceThatMatchPattern[Eos enabled = false] PASSED

org.apache.kafka.streams.TopologyTestDriverTest > shouldUpdateStoreForNewKey[Eos enabled = false] STARTED

org.apache.kafka.streams.TopologyTestDriverTest > shouldUpdateStoreForNewKey[Eos enabled = false] PASSED

org.apache.kafka.streams.TopologyTestDriverTest > shouldPunctuateOnWallClockTime[Eos enabled = false] STARTED

org.apache.kafka.streams.TopologyTestDriverTest > shouldPunctuateOnWallClockTime[Eos enabled = false] PASSED

org.apache.kafka.streams.TopologyTestDriverTest > shouldSetRecordMetadata[Eos enabled = false] STARTED

org.apache.kafka.streams.TopologyTestDriverTest > shouldSetRecordMetadata[Eos enabled = false] PASSED

org.apache.kafka.streams.TopologyTestDriverTest > shouldNotUpdateStoreForLargerValue[Eos enabled = false] STARTED

org.apache.kafka.streams.TopologyTestDriverTest > shouldNotUpdateStoreForLargerValue[Eos enabled = false] PASSED

org.apache.kafka.streams.TopologyTestDriverTest > shouldReturnCorrectInMemoryStoreTypeOnly[Eos enabled = false] STARTED

org.apache.kafka.streams.TopologyTestDriverTest > shouldReturnCorrectInMemoryStoreTypeOnly[Eos enabled = false] PASSED

org.apache.kafka.streams.TopologyTestDriverTest > shouldProcessRecordForTopic[Eos enabled = false] STARTED

org.apache.kafka.streams.TopologyTestDriverTest > shouldProcessRecordForTopic[Eos enabled = false] PASSED

org.apache.kafka.streams.TopologyTestDriverTest > shouldForwardRecordsFromSubtopologyToSubtopology[Eos enabled = false] STARTED

org.apache.kafka.streams.TopologyTestDriverTest > shouldForwardRecordsFromSubtopologyToSubtopology[Eos enabled = false] PASSED

org.apache.kafka.streams.TopologyTestDriverTest > shouldNotUpdateStoreForSmallerValue[Eos enabled = false] STARTED

org.apache.kafka.streams.TopologyTestDriverTest > shouldNotUpdateStoreForSmallerValue[Eos enabled = false] PASSED

org.apache.kafka.streams.TopologyTestDriverTest > shouldCreateStateDirectoryForStatefulTopology[Eos enabled = false] STARTED

org.apache.kafka.streams.TopologyTestDriverTest > shouldCreateStateDirectoryForStatefulTopology[Eos enabled = false] PASSED

org.apache.kafka.streams.TopologyTestDriverTest > shouldPunctuateIfWallClockTimeAdvances[Eos enabled = false] STARTED

org.apache.kafka.streams.TopologyTestDriverTest > shouldPunctuateIfWallClockTimeAdvances[Eos enabled = false] PASSED

org.apache.kafka.streams.MockTimeTest > shouldGetNanosAsMillis STARTED

org.apache.kafka.streams.MockTimeTest > shouldGetNanosAsMillis PASSED

org.apache.kafka.streams.MockTimeTest > shouldSetStartTime STARTED

org.apache.kafka.streams.MockTimeTest > shouldSetStartTime PASSED

org.apache.kafka.streams.MockTimeTest > shouldNotAllowNegativeSleep STARTED

org.apache.kafka.streams.MockTimeTest > shouldNotAllowNegativeSleep PASSED

org.apache.kafka.streams.MockTimeTest > shouldAdvanceTimeOnSleep STARTED

org.apache.kafka.streams.MockTimeTest > shouldAdvanceTimeOnSleep PASSED

org.apache.kafka.streams.internals.KeyValueStoreFacadeTest > shouldReturnIsOpen STARTED

org.apache.kafka.streams.internals.KeyValueStoreFacadeTest > shouldReturnIsOpen PASSED

org.apache.kafka.streams.internals.KeyValueStoreFacadeTest > shouldDeleteAndReturnPlainValue STARTED

org.apache.kafka.streams.internals.KeyValueStoreFacadeTest > shouldDeleteAndReturnPlainValue PASSED

org.apache.kafka.streams.internals.KeyValueStoreFacadeTest > shouldReturnName STARTED

org.apache.kafka.streams.internals.KeyValueStoreFacadeTest > shouldReturnName PASSED

org.apache.kafka.streams.internals.KeyValueStoreFacadeTest > shouldPutWithUnknownTimestamp STARTED

org.apache.kafka.streams.internals.KeyValueStoreFacadeTest > shouldPutWithUnknownTimestamp PASSED

org.apache.kafka.streams.internals.KeyValueStoreFacadeTest > shouldPutAllWithUnknownTimestamp STARTED

org.apache.kafka.streams.internals.KeyValueStoreFacadeTest > shouldPutAllWithUnknownTimestamp PASSED

org.apache.kafka.streams.internals.KeyValueStoreFacadeTest > shouldReturnIsPersistent STARTED

org.apache.kafka.streams.internals.KeyValueStoreFacadeTest > shouldReturnIsPersistent PASSED

org.apache.kafka.streams.internals.KeyValueStoreFacadeTest > shouldPutIfAbsentWithUnknownTimestamp STARTED

org.apache.kafka.streams.internals.KeyValueStoreFacadeTest > shouldPutIfAbsentWithUnknownTimestamp PASSED

org.apache.kafka.streams.internals.KeyValueStoreFacadeTest > shouldForwardClose STARTED

org.apache.kafka.streams.internals.KeyValueStoreFacadeTest > shouldForwardClose PASSED

org.apache.kafka.streams.internals.KeyValueStoreFacadeTest > shouldForwardFlush STARTED

org.apache.kafka.streams.internals.KeyValueStoreFacadeTest > shouldForwardFlush PASSED

org.apache.kafka.streams.internals.KeyValueStoreFacadeTest > shouldForwardInit STARTED

org.apache.kafka.streams.internals.KeyValueStoreFacadeTest > shouldForwardInit PASSED

org.apache.kafka.streams.internals.WindowStoreFacadeTest > shouldReturnIsOpen STARTED

org.apache.kafka.streams.internals.WindowStoreFacadeTest > shouldReturnIsOpen PASSED

org.apache.kafka.streams.internals.WindowStoreFacadeTest > shouldReturnName STARTED

org.apache.kafka.streams.internals.WindowStoreFacadeTest > shouldReturnName PASSED

org.apache.kafka.streams.internals.WindowStoreFacadeTest > shouldPutWithUnknownTimestamp STARTED

org.apache.kafka.streams.internals.WindowStoreFacadeTest > shouldPutWithUnknownTimestamp PASSED

org.apache.kafka.streams.internals.WindowStoreFacadeTest > shouldPutWindowStartTimestampWithUnknownTimestamp STARTED

org.apache.kafka.streams.internals.WindowStoreFacadeTest > shouldPutWindowStartTimestampWithUnknownTimestamp PASSED

org.apache.kafka.streams.internals.WindowStoreFacadeTest > shouldReturnIsPersistent STARTED

org.apache.kafka.streams.internals.WindowStoreFacadeTest > shouldReturnIsPersistent PASSED

org.apache.kafka.streams.internals.WindowStoreFacadeTest > shouldForwardClose STARTED

org.apache.kafka.streams.internals.WindowStoreFacadeTest > shouldForwardClose PASSED

org.apache.kafka.streams.internals.WindowStoreFacadeTest > shouldForwardFlush STARTED

org.apache.kafka.streams.internals.WindowStoreFacadeTest > shouldForwardFlush PASSED

org.apache.kafka.streams.internals.WindowStoreFacadeTest > shouldForwardInit STARTED

org.apache.kafka.streams.internals.WindowStoreFacadeTest > shouldForwardInit PASSED

> Task :streams:upgrade-system-tests-11:spotbugsMain NO-SOURCE
> Task :streams:upgrade-system-tests-11:test
> Task :streams:upgrade-system-tests-20:compileJava NO-SOURCE
> Task :streams:upgrade-system-tests-20:processResources NO-SOURCE
> Task :streams:upgrade-system-tests-20:classes UP-TO-DATE
> Task :streams:upgrade-system-tests-20:checkstyleMain NO-SOURCE
> Task :streams:upgrade-system-tests-20:compileTestJava
> Task :streams:upgrade-system-tests-20:processTestResources NO-SOURCE
> Task :streams:upgrade-system-tests-20:testClasses
> Task :streams:upgrade-system-tests-20:checkstyleTest
> Task :streams:upgrade-system-tests-20:spotbugsMain NO-SOURCE
> Task :streams:upgrade-system-tests-20:test
> Task :streams:upgrade-system-tests-21:compileJava NO-SOURCE
> Task :streams:upgrade-system-tests-21:processResources NO-SOURCE
> Task :streams:upgrade-system-tests-21:classes UP-TO-DATE
> Task :streams:upgrade-system-tests-21:checkstyleMain NO-SOURCE
> Task :streams:upgrade-system-tests-21:compileTestJava
> Task :streams:upgrade-system-tests-21:processTestResources NO-SOURCE
> Task :streams:upgrade-system-tests-21:testClasses
> Task :streams:upgrade-system-tests-21:checkstyleTest
> Task :streams:upgrade-system-tests-21:spotbugsMain NO-SOURCE
> Task :streams:upgrade-system-tests-21:test
> Task :streams:upgrade-system-tests-22:compileJava NO-SOURCE
> Task :streams:upgrade-system-tests-22:processResources NO-SOURCE
> Task :streams:upgrade-system-tests-22:classes UP-TO-DATE
> Task :streams:upgrade-system-tests-22:checkstyleMain NO-SOURCE
> Task :streams:upgrade-system-tests-22:compileTestJava
> Task :streams:upgrade-system-tests-22:processTestResources NO-SOURCE
> Task :streams:upgrade-system-tests-22:testClasses
> Task :streams:upgrade-system-tests-22:checkstyleTest
> Task :streams:upgrade-system-tests-22:spotbugsMain NO-SOURCE
> Task :streams:upgrade-system-tests-22:test
> Task :streams:upgrade-system-tests-23:compileJava NO-SOURCE
> Task :streams:upgrade-system-tests-23:processResources NO-SOURCE
> Task :streams:upgrade-system-tests-23:classes UP-TO-DATE
> Task :streams:upgrade-system-tests-23:checkstyleMain NO-SOURCE
> Task :streams:upgrade-system-tests-23:compileTestJava
> Task :streams:upgrade-system-tests-23:processTestResources NO-SOURCE
> Task :streams:upgrade-system-tests-23:testClasses
> Task :streams:upgrade-system-tests-23:checkstyleTest
> Task :streams:upgrade-system-tests-23:spotbugsMain NO-SOURCE
> Task :streams:upgrade-system-tests-23:test

FAILURE: Build failed with an exception.

* What went wrong:
Execution failed for task ':core:test'.
> There were failing tests. See the report at: file://<https://builds.apache.org/job/kafka-trunk-jdk8/ws/core/build/reports/tests/test/index.html>

* Try:
Run with --stacktrace option to get the stack trace. Run with --info or --debug option to get more log output. Run with --scan to get full insights.

* Get more help at https://help.gradle.org

Deprecated Gradle features were used in this build, making it incompatible with Gradle 6.0.
Use '--warning-mode all' to show the individual deprecation warnings.
See https://docs.gradle.org/5.6.2/userguide/command_line_interface.html#sec:command_line_warnings

BUILD FAILED in 3h 31m 28s
183 actionable tasks: 156 executed, 27 up-to-date
Build step 'Execute shell' marked build as failure
[FINDBUGS] Collecting findbugs analysis files...
Setting GRADLE_4_10_3_HOME=/home/jenkins/tools/gradle/4.10.3
[FINDBUGS] Searching for all files in <https://builds.apache.org/job/kafka-trunk-jdk8/ws/> that match the pattern **/build/reports/*bugs/*.xml
[FINDBUGS] Parsing 17 files in <https://builds.apache.org/job/kafka-trunk-jdk8/ws/>
[FINDBUGS] Successfully parsed file <https://builds.apache.org/job/kafka-trunk-jdk8/ws/clients/build/reports/spotbugs/main.xml> with 0 unique warnings and 0 duplicates.
[FINDBUGS] Successfully parsed file <https://builds.apache.org/job/kafka-trunk-jdk8/ws/connect/api/build/reports/spotbugs/main.xml> with 0 unique warnings and 0 duplicates.
[FINDBUGS] Successfully parsed file <https://builds.apache.org/job/kafka-trunk-jdk8/ws/connect/basic-auth-extension/build/reports/spotbugs/main.xml> with 0 unique warnings and 0 duplicates.
[FINDBUGS] Successfully parsed file <https://builds.apache.org/job/kafka-trunk-jdk8/ws/connect/file/build/reports/spotbugs/main.xml> with 0 unique warnings and 0 duplicates.
[FINDBUGS] Successfully parsed file <https://builds.apache.org/job/kafka-trunk-jdk8/ws/connect/json/build/reports/spotbugs/main.xml> with 0 unique warnings and 0 duplicates.
[FINDBUGS] Successfully parsed file <https://builds.apache.org/job/kafka-trunk-jdk8/ws/connect/runtime/build/reports/spotbugs/main.xml> with 0 unique warnings and 0 duplicates.
[FINDBUGS] Successfully parsed file <https://builds.apache.org/job/kafka-trunk-jdk8/ws/connect/transforms/build/reports/spotbugs/main.xml> with 0 unique warnings and 0 duplicates.
[FINDBUGS] Successfully parsed file <https://builds.apache.org/job/kafka-trunk-jdk8/ws/core/build/reports/spotbugs/main.xml> with 0 unique warnings and 0 duplicates.
[FINDBUGS] Successfully parsed file <https://builds.apache.org/job/kafka-trunk-jdk8/ws/examples/build/reports/spotbugs/main.xml> with 0 unique warnings and 0 duplicates.
[FINDBUGS] Successfully parsed file <https://builds.apache.org/job/kafka-trunk-jdk8/ws/generator/build/reports/spotbugs/main.xml> with 0 unique warnings and 0 duplicates.
[FINDBUGS] Successfully parsed file <https://builds.apache.org/job/kafka-trunk-jdk8/ws/jmh-benchmarks/build/reports/spotbugs/main.xml> with 0 unique warnings and 0 duplicates.
[FINDBUGS] Successfully parsed file <https://builds.apache.org/job/kafka-trunk-jdk8/ws/log4j-appender/build/reports/spotbugs/main.xml> with 0 unique warnings and 0 duplicates.
[FINDBUGS] Successfully parsed file <https://builds.apache.org/job/kafka-trunk-jdk8/ws/streams/build/reports/spotbugs/main.xml> with 0 unique warnings and 0 duplicates.
[FINDBUGS] Successfully parsed file <https://builds.apache.org/job/kafka-trunk-jdk8/ws/streams/examples/build/reports/spotbugs/main.xml> with 0 unique warnings and 0 duplicates.
[FINDBUGS] Successfully parsed file <https://builds.apache.org/job/kafka-trunk-jdk8/ws/streams/streams-scala/build/reports/spotbugs/main.xml> with 0 unique warnings and 0 duplicates.
[FINDBUGS] Successfully parsed file <https://builds.apache.org/job/kafka-trunk-jdk8/ws/streams/test-utils/build/reports/spotbugs/main.xml> with 0 unique warnings and 0 duplicates.
[FINDBUGS] Successfully parsed file <https://builds.apache.org/job/kafka-trunk-jdk8/ws/tools/build/reports/spotbugs/main.xml> with 0 unique warnings and 0 duplicates.
Setting GRADLE_4_10_3_HOME=/home/jenkins/tools/gradle/4.10.3
No credentials specified
Setting GRADLE_4_10_3_HOME=/home/jenkins/tools/gradle/4.10.3
<Git Blamer> Using GitBlamer to create author and commit information for all warnings.
<Git Blamer> GIT_COMMIT=74f8ae13034d90800da5573666dea3bea5d702ce, workspace=<https://builds.apache.org/job/kafka-trunk-jdk8/ws/>
[FINDBUGS] Computing warning deltas based on reference build #3914
Recording test results
Setting GRADLE_4_10_3_HOME=/home/jenkins/tools/gradle/4.10.3
Setting GRADLE_4_10_3_HOME=/home/jenkins/tools/gradle/4.10.3
Not sending mail to unregistered user wangguoz@gmail.com
Not sending mail to unregistered user noreply@github.com

Build failed in Jenkins: kafka-trunk-jdk8 #3921

Posted by Apache Jenkins Server <je...@builds.apache.org>.
See <https://builds.apache.org/job/kafka-trunk-jdk8/3921/display/redirect?page=changes>

Changes:

[github] HOTFIX: fix Kafka Streams upgrade note for broker backward compatibility

------------------------------------------
[...truncated 2.99 MB...]

org.apache.kafka.streams.MockProcessorContextTest > shouldCapturePunctuator PASSED

org.apache.kafka.streams.internals.KeyValueStoreFacadeTest > shouldReturnIsOpen STARTED

org.apache.kafka.streams.internals.KeyValueStoreFacadeTest > shouldReturnIsOpen PASSED

org.apache.kafka.streams.internals.KeyValueStoreFacadeTest > shouldDeleteAndReturnPlainValue STARTED

org.apache.kafka.streams.internals.KeyValueStoreFacadeTest > shouldDeleteAndReturnPlainValue PASSED

org.apache.kafka.streams.internals.KeyValueStoreFacadeTest > shouldReturnName STARTED

org.apache.kafka.streams.internals.KeyValueStoreFacadeTest > shouldReturnName PASSED

org.apache.kafka.streams.internals.KeyValueStoreFacadeTest > shouldPutWithUnknownTimestamp STARTED

org.apache.kafka.streams.internals.KeyValueStoreFacadeTest > shouldPutWithUnknownTimestamp PASSED

org.apache.kafka.streams.internals.KeyValueStoreFacadeTest > shouldPutAllWithUnknownTimestamp STARTED

org.apache.kafka.streams.internals.KeyValueStoreFacadeTest > shouldPutAllWithUnknownTimestamp PASSED

org.apache.kafka.streams.internals.KeyValueStoreFacadeTest > shouldReturnIsPersistent STARTED

org.apache.kafka.streams.internals.KeyValueStoreFacadeTest > shouldReturnIsPersistent PASSED

org.apache.kafka.streams.internals.KeyValueStoreFacadeTest > shouldPutIfAbsentWithUnknownTimestamp STARTED

org.apache.kafka.streams.internals.KeyValueStoreFacadeTest > shouldPutIfAbsentWithUnknownTimestamp PASSED

org.apache.kafka.streams.internals.KeyValueStoreFacadeTest > shouldForwardClose STARTED

org.apache.kafka.streams.internals.KeyValueStoreFacadeTest > shouldForwardClose PASSED

org.apache.kafka.streams.internals.KeyValueStoreFacadeTest > shouldForwardFlush STARTED

org.apache.kafka.streams.internals.KeyValueStoreFacadeTest > shouldForwardFlush PASSED

org.apache.kafka.streams.internals.KeyValueStoreFacadeTest > shouldForwardInit STARTED

org.apache.kafka.streams.internals.KeyValueStoreFacadeTest > shouldForwardInit PASSED

org.apache.kafka.streams.internals.WindowStoreFacadeTest > shouldReturnIsOpen STARTED

org.apache.kafka.streams.internals.WindowStoreFacadeTest > shouldReturnIsOpen PASSED

org.apache.kafka.streams.internals.WindowStoreFacadeTest > shouldReturnName STARTED

org.apache.kafka.streams.internals.WindowStoreFacadeTest > shouldReturnName PASSED

org.apache.kafka.streams.internals.WindowStoreFacadeTest > shouldPutWithUnknownTimestamp STARTED

org.apache.kafka.streams.internals.WindowStoreFacadeTest > shouldPutWithUnknownTimestamp PASSED

org.apache.kafka.streams.internals.WindowStoreFacadeTest > shouldPutWindowStartTimestampWithUnknownTimestamp STARTED

org.apache.kafka.streams.internals.WindowStoreFacadeTest > shouldPutWindowStartTimestampWithUnknownTimestamp PASSED

org.apache.kafka.streams.internals.WindowStoreFacadeTest > shouldReturnIsPersistent STARTED

org.apache.kafka.streams.internals.WindowStoreFacadeTest > shouldReturnIsPersistent PASSED

org.apache.kafka.streams.internals.WindowStoreFacadeTest > shouldForwardClose STARTED

org.apache.kafka.streams.internals.WindowStoreFacadeTest > shouldForwardClose PASSED

org.apache.kafka.streams.internals.WindowStoreFacadeTest > shouldForwardFlush STARTED

org.apache.kafka.streams.internals.WindowStoreFacadeTest > shouldForwardFlush PASSED

org.apache.kafka.streams.internals.WindowStoreFacadeTest > shouldForwardInit STARTED

org.apache.kafka.streams.internals.WindowStoreFacadeTest > shouldForwardInit PASSED

org.apache.kafka.streams.MockTimeTest > shouldGetNanosAsMillis STARTED

org.apache.kafka.streams.MockTimeTest > shouldGetNanosAsMillis PASSED

org.apache.kafka.streams.MockTimeTest > shouldSetStartTime STARTED

org.apache.kafka.streams.MockTimeTest > shouldSetStartTime PASSED

org.apache.kafka.streams.MockTimeTest > shouldNotAllowNegativeSleep STARTED

org.apache.kafka.streams.MockTimeTest > shouldNotAllowNegativeSleep PASSED

org.apache.kafka.streams.MockTimeTest > shouldAdvanceTimeOnSleep STARTED

org.apache.kafka.streams.MockTimeTest > shouldAdvanceTimeOnSleep PASSED

> Task :streams:upgrade-system-tests-0100:processTestResources NO-SOURCE
> Task :streams:upgrade-system-tests-0100:testClasses
> Task :streams:upgrade-system-tests-0100:checkstyleTest
> Task :streams:upgrade-system-tests-0100:spotbugsMain NO-SOURCE
> Task :streams:upgrade-system-tests-0100:test
> Task :streams:upgrade-system-tests-0101:compileJava NO-SOURCE
> Task :streams:upgrade-system-tests-0101:processResources NO-SOURCE
> Task :streams:upgrade-system-tests-0101:classes UP-TO-DATE
> Task :streams:upgrade-system-tests-0101:checkstyleMain NO-SOURCE
> Task :streams:upgrade-system-tests-0101:compileTestJava
> Task :streams:upgrade-system-tests-0101:processTestResources NO-SOURCE
> Task :streams:upgrade-system-tests-0101:testClasses
> Task :streams:upgrade-system-tests-0101:checkstyleTest
> Task :streams:upgrade-system-tests-0101:spotbugsMain NO-SOURCE
> Task :streams:upgrade-system-tests-0101:test
> Task :streams:upgrade-system-tests-0102:compileJava NO-SOURCE
> Task :streams:upgrade-system-tests-0102:processResources NO-SOURCE
> Task :streams:upgrade-system-tests-0102:classes UP-TO-DATE
> Task :streams:upgrade-system-tests-0102:checkstyleMain NO-SOURCE
> Task :streams:upgrade-system-tests-0102:compileTestJava
> Task :streams:upgrade-system-tests-0102:processTestResources NO-SOURCE
> Task :streams:upgrade-system-tests-0102:testClasses
> Task :streams:upgrade-system-tests-0102:checkstyleTest
> Task :streams:upgrade-system-tests-0102:spotbugsMain NO-SOURCE
> Task :streams:upgrade-system-tests-0102:test
> Task :streams:upgrade-system-tests-0110:compileJava NO-SOURCE
> Task :streams:upgrade-system-tests-0110:processResources NO-SOURCE
> Task :streams:upgrade-system-tests-0110:classes UP-TO-DATE
> Task :streams:upgrade-system-tests-0110:checkstyleMain NO-SOURCE
> Task :streams:upgrade-system-tests-0110:compileTestJava
> Task :streams:upgrade-system-tests-0110:processTestResources NO-SOURCE
> Task :streams:upgrade-system-tests-0110:testClasses
> Task :streams:upgrade-system-tests-0110:checkstyleTest
> Task :streams:upgrade-system-tests-0110:spotbugsMain NO-SOURCE
> Task :streams:upgrade-system-tests-0110:test
> Task :streams:upgrade-system-tests-10:compileJava NO-SOURCE
> Task :streams:upgrade-system-tests-10:processResources NO-SOURCE
> Task :streams:upgrade-system-tests-10:classes UP-TO-DATE
> Task :streams:upgrade-system-tests-10:checkstyleMain NO-SOURCE
> Task :streams:upgrade-system-tests-10:compileTestJava
> Task :streams:upgrade-system-tests-10:processTestResources NO-SOURCE
> Task :streams:upgrade-system-tests-10:testClasses
> Task :streams:upgrade-system-tests-10:checkstyleTest
> Task :streams:upgrade-system-tests-10:spotbugsMain NO-SOURCE
> Task :streams:upgrade-system-tests-10:test
> Task :streams:upgrade-system-tests-11:compileJava NO-SOURCE
> Task :streams:upgrade-system-tests-11:processResources NO-SOURCE
> Task :streams:upgrade-system-tests-11:classes UP-TO-DATE
> Task :streams:upgrade-system-tests-11:checkstyleMain NO-SOURCE
> Task :streams:upgrade-system-tests-11:compileTestJava
> Task :streams:upgrade-system-tests-11:processTestResources NO-SOURCE
> Task :streams:upgrade-system-tests-11:testClasses
> Task :streams:upgrade-system-tests-11:checkstyleTest
> Task :streams:upgrade-system-tests-11:spotbugsMain NO-SOURCE
> Task :streams:upgrade-system-tests-11:test
> Task :streams:upgrade-system-tests-20:compileJava NO-SOURCE
> Task :streams:upgrade-system-tests-20:processResources NO-SOURCE
> Task :streams:upgrade-system-tests-20:classes UP-TO-DATE
> Task :streams:upgrade-system-tests-20:checkstyleMain NO-SOURCE
> Task :streams:upgrade-system-tests-20:compileTestJava
> Task :streams:upgrade-system-tests-20:processTestResources NO-SOURCE
> Task :streams:upgrade-system-tests-20:testClasses
> Task :streams:upgrade-system-tests-20:checkstyleTest
> Task :streams:upgrade-system-tests-20:spotbugsMain NO-SOURCE
> Task :streams:upgrade-system-tests-20:test
> Task :streams:upgrade-system-tests-21:compileJava NO-SOURCE
> Task :streams:upgrade-system-tests-21:processResources NO-SOURCE
> Task :streams:upgrade-system-tests-21:classes UP-TO-DATE
> Task :streams:upgrade-system-tests-21:checkstyleMain NO-SOURCE
> Task :streams:upgrade-system-tests-21:compileTestJava
> Task :streams:upgrade-system-tests-21:processTestResources NO-SOURCE
> Task :streams:upgrade-system-tests-21:testClasses
> Task :streams:upgrade-system-tests-21:checkstyleTest
> Task :streams:upgrade-system-tests-21:spotbugsMain NO-SOURCE
> Task :streams:upgrade-system-tests-21:test
> Task :streams:upgrade-system-tests-22:compileJava NO-SOURCE
> Task :streams:upgrade-system-tests-22:processResources NO-SOURCE
> Task :streams:upgrade-system-tests-22:classes UP-TO-DATE
> Task :streams:upgrade-system-tests-22:checkstyleMain NO-SOURCE
> Task :streams:upgrade-system-tests-22:compileTestJava
> Task :streams:upgrade-system-tests-22:processTestResources NO-SOURCE
> Task :streams:upgrade-system-tests-22:testClasses
> Task :streams:upgrade-system-tests-22:checkstyleTest
> Task :streams:upgrade-system-tests-22:spotbugsMain NO-SOURCE
> Task :streams:upgrade-system-tests-22:test
> Task :streams:upgrade-system-tests-23:compileJava NO-SOURCE
> Task :streams:upgrade-system-tests-23:processResources NO-SOURCE
> Task :streams:upgrade-system-tests-23:classes UP-TO-DATE
> Task :streams:upgrade-system-tests-23:checkstyleMain NO-SOURCE
> Task :streams:upgrade-system-tests-23:compileTestJava
> Task :streams:upgrade-system-tests-23:processTestResources NO-SOURCE
> Task :streams:upgrade-system-tests-23:testClasses
> Task :streams:upgrade-system-tests-23:checkstyleTest
> Task :streams:upgrade-system-tests-23:spotbugsMain NO-SOURCE
> Task :streams:upgrade-system-tests-23:test

FAILURE: Build completed with 2 failures.

1: Task failed with an exception.
-----------
* What went wrong:
Execution failed for task ':streams:test'.
> There were failing tests. See the report at: file://<https://builds.apache.org/job/kafka-trunk-jdk8/ws/streams/build/reports/tests/test/index.html>

* Try:
Run with --stacktrace option to get the stack trace. Run with --info or --debug option to get more log output. Run with --scan to get full insights.
==============================================================================

2: Task failed with an exception.
-----------
* What went wrong:
Execution failed for task ':core:test'.
> There were failing tests. See the report at: file://<https://builds.apache.org/job/kafka-trunk-jdk8/ws/core/build/reports/tests/test/index.html>

* Try:
Run with --stacktrace option to get the stack trace. Run with --info or --debug option to get more log output. Run with --scan to get full insights.
==============================================================================

* Get more help at https://help.gradle.org

Deprecated Gradle features were used in this build, making it incompatible with Gradle 6.0.
Use '--warning-mode all' to show the individual deprecation warnings.
See https://docs.gradle.org/5.6.2/userguide/command_line_interface.html#sec:command_line_warnings

BUILD FAILED in 8h 38m 37s
183 actionable tasks: 156 executed, 27 up-to-date
Build step 'Execute shell' marked build as failure
[FINDBUGS] Collecting findbugs analysis files...
Setting GRADLE_4_10_3_HOME=/home/jenkins/tools/gradle/4.10.3
[FINDBUGS] Searching for all files in <https://builds.apache.org/job/kafka-trunk-jdk8/ws/> that match the pattern **/build/reports/*bugs/*.xml
[FINDBUGS] Parsing 17 files in <https://builds.apache.org/job/kafka-trunk-jdk8/ws/>
[FINDBUGS] Successfully parsed file <https://builds.apache.org/job/kafka-trunk-jdk8/ws/clients/build/reports/spotbugs/main.xml> with 0 unique warnings and 0 duplicates.
[FINDBUGS] Successfully parsed file <https://builds.apache.org/job/kafka-trunk-jdk8/ws/connect/api/build/reports/spotbugs/main.xml> with 0 unique warnings and 0 duplicates.
[FINDBUGS] Successfully parsed file <https://builds.apache.org/job/kafka-trunk-jdk8/ws/connect/basic-auth-extension/build/reports/spotbugs/main.xml> with 0 unique warnings and 0 duplicates.
[FINDBUGS] Successfully parsed file <https://builds.apache.org/job/kafka-trunk-jdk8/ws/connect/file/build/reports/spotbugs/main.xml> with 0 unique warnings and 0 duplicates.
[FINDBUGS] Successfully parsed file <https://builds.apache.org/job/kafka-trunk-jdk8/ws/connect/json/build/reports/spotbugs/main.xml> with 0 unique warnings and 0 duplicates.
[FINDBUGS] Successfully parsed file <https://builds.apache.org/job/kafka-trunk-jdk8/ws/connect/runtime/build/reports/spotbugs/main.xml> with 0 unique warnings and 0 duplicates.
[FINDBUGS] Successfully parsed file <https://builds.apache.org/job/kafka-trunk-jdk8/ws/connect/transforms/build/reports/spotbugs/main.xml> with 0 unique warnings and 0 duplicates.
[FINDBUGS] Successfully parsed file <https://builds.apache.org/job/kafka-trunk-jdk8/ws/core/build/reports/spotbugs/main.xml> with 0 unique warnings and 0 duplicates.
[FINDBUGS] Successfully parsed file <https://builds.apache.org/job/kafka-trunk-jdk8/ws/examples/build/reports/spotbugs/main.xml> with 0 unique warnings and 0 duplicates.
[FINDBUGS] Successfully parsed file <https://builds.apache.org/job/kafka-trunk-jdk8/ws/generator/build/reports/spotbugs/main.xml> with 0 unique warnings and 0 duplicates.
[FINDBUGS] Successfully parsed file <https://builds.apache.org/job/kafka-trunk-jdk8/ws/jmh-benchmarks/build/reports/spotbugs/main.xml> with 0 unique warnings and 0 duplicates.
[FINDBUGS] Successfully parsed file <https://builds.apache.org/job/kafka-trunk-jdk8/ws/log4j-appender/build/reports/spotbugs/main.xml> with 0 unique warnings and 0 duplicates.
[FINDBUGS] Successfully parsed file <https://builds.apache.org/job/kafka-trunk-jdk8/ws/streams/build/reports/spotbugs/main.xml> with 0 unique warnings and 0 duplicates.
[FINDBUGS] Successfully parsed file <https://builds.apache.org/job/kafka-trunk-jdk8/ws/streams/examples/build/reports/spotbugs/main.xml> with 0 unique warnings and 0 duplicates.
[FINDBUGS] Successfully parsed file <https://builds.apache.org/job/kafka-trunk-jdk8/ws/streams/streams-scala/build/reports/spotbugs/main.xml> with 0 unique warnings and 0 duplicates.
[FINDBUGS] Successfully parsed file <https://builds.apache.org/job/kafka-trunk-jdk8/ws/streams/test-utils/build/reports/spotbugs/main.xml> with 0 unique warnings and 0 duplicates.
[FINDBUGS] Successfully parsed file <https://builds.apache.org/job/kafka-trunk-jdk8/ws/tools/build/reports/spotbugs/main.xml> with 0 unique warnings and 0 duplicates.
Setting GRADLE_4_10_3_HOME=/home/jenkins/tools/gradle/4.10.3
No credentials specified
Setting GRADLE_4_10_3_HOME=/home/jenkins/tools/gradle/4.10.3
<Git Blamer> Using GitBlamer to create author and commit information for all warnings.
<Git Blamer> GIT_COMMIT=1ae0956892cf7fb6e2337dcdd8cd07d56a22ed54, workspace=<https://builds.apache.org/job/kafka-trunk-jdk8/ws/>
[FINDBUGS] Computing warning deltas based on reference build #3914
Recording test results
Setting GRADLE_4_10_3_HOME=/home/jenkins/tools/gradle/4.10.3
Setting GRADLE_4_10_3_HOME=/home/jenkins/tools/gradle/4.10.3
Not sending mail to unregistered user noreply@github.com

Build failed in Jenkins: kafka-trunk-jdk8 #3920

Posted by Apache Jenkins Server <je...@builds.apache.org>.
See <https://builds.apache.org/job/kafka-trunk-jdk8/3920/display/redirect?page=changes>

Changes:

[github] KAFKA-8848; Update system tests to use new AclAuthorizer (#7374)

------------------------------------------
Started by an SCM change
[EnvInject] - Loading node environment variables.
Building remotely on H41 (ubuntu xenial) in workspace <https://builds.apache.org/job/kafka-trunk-jdk8/ws/>
[WS-CLEANUP] Deleting project workspace...
[WS-CLEANUP] Deferred wipeout is used...
[WS-CLEANUP] Done
No credentials specified
Cloning the remote Git repository
Cloning repository https://github.com/apache/kafka.git
 > git init <https://builds.apache.org/job/kafka-trunk-jdk8/ws/> # timeout=10
Fetching upstream changes from https://github.com/apache/kafka.git
 > git --version # timeout=10
 > git fetch --tags --progress https://github.com/apache/kafka.git +refs/heads/*:refs/remotes/origin/*
 > git config remote.origin.url https://github.com/apache/kafka.git # timeout=10
 > git config --add remote.origin.fetch +refs/heads/*:refs/remotes/origin/* # timeout=10
 > git config remote.origin.url https://github.com/apache/kafka.git # timeout=10
Fetching upstream changes from https://github.com/apache/kafka.git
 > git fetch --tags --progress https://github.com/apache/kafka.git +refs/heads/*:refs/remotes/origin/*
 > git rev-parse refs/remotes/origin/trunk^{commit} # timeout=10
 > git rev-parse refs/remotes/origin/origin/trunk^{commit} # timeout=10
Checking out Revision 0d31272b350adf40bda09709304721545553d7f8 (refs/remotes/origin/trunk)
 > git config core.sparsecheckout # timeout=10
 > git checkout -f 0d31272b350adf40bda09709304721545553d7f8
Commit message: "KAFKA-8848; Update system tests to use new AclAuthorizer (#7374)"
 > git rev-list --no-walk bc4fd676e5ea0e3cf44a8684dca0db46f912c828 # timeout=10
Setting GRADLE_4_10_3_HOME=/home/jenkins/tools/gradle/4.10.3
[kafka-trunk-jdk8] $ /bin/bash -xe /tmp/jenkins7043756291710883065.sh
+ rm -rf <https://builds.apache.org/job/kafka-trunk-jdk8/ws/.gradle>
+ /home/jenkins/tools/gradle/4.10.3/bin/gradle
To honour the JVM settings for this build a new JVM will be forked. Please consider using the daemon: https://docs.gradle.org/4.10.3/userguide/gradle_daemon.html.

FAILURE: Build failed with an exception.

* What went wrong:
Unable to start the daemon process.
This problem might be caused by incorrect configuration of the daemon.
For example, an unrecognized jvm option is used.
Please refer to the user guide chapter on the daemon at https://docs.gradle.org/4.10.3/userguide/gradle_daemon.html
Please read the following process output to find out more:
-----------------------
Error occurred during initialization of VM
java.lang.OutOfMemoryError: unable to create new native thread


* Try:
Run with --stacktrace option to get the stack trace. Run with --info or --debug option to get more log output. Run with --scan to get full insights.

* Get more help at https://help.gradle.org
Build step 'Execute shell' marked build as failure
[FINDBUGS] Collecting findbugs analysis files...
Setting GRADLE_4_10_3_HOME=/home/jenkins/tools/gradle/4.10.3
[FINDBUGS] Searching for all files in <https://builds.apache.org/job/kafka-trunk-jdk8/ws/> that match the pattern **/build/reports/*bugs/*.xml
[FINDBUGS] No files found. Configuration error?
Setting GRADLE_4_10_3_HOME=/home/jenkins/tools/gradle/4.10.3
No credentials specified
Setting GRADLE_4_10_3_HOME=/home/jenkins/tools/gradle/4.10.3
<Git Blamer> Using GitBlamer to create author and commit information for all warnings.
<Git Blamer> GIT_COMMIT=0d31272b350adf40bda09709304721545553d7f8, workspace=<https://builds.apache.org/job/kafka-trunk-jdk8/ws/>
[FINDBUGS] Computing warning deltas based on reference build #3914
Recording test results
Setting GRADLE_4_10_3_HOME=/home/jenkins/tools/gradle/4.10.3
ERROR: Step ?Publish JUnit test result report? failed: No test report files were found. Configuration error?
Setting GRADLE_4_10_3_HOME=/home/jenkins/tools/gradle/4.10.3
Not sending mail to unregistered user noreply@github.com

Build failed in Jenkins: kafka-trunk-jdk8 #3919

Posted by Apache Jenkins Server <je...@builds.apache.org>.
See <https://builds.apache.org/job/kafka-trunk-jdk8/3919/display/redirect>

------------------------------------------
[...truncated 2.64 MB...]
org.apache.kafka.streams.TopologyTestDriverTest > shouldProcessConsumerRecordList[Eos enabled = false] STARTED

org.apache.kafka.streams.TopologyTestDriverTest > shouldProcessConsumerRecordList[Eos enabled = false] PASSED

org.apache.kafka.streams.TopologyTestDriverTest > shouldUseSinkSpecificSerializers[Eos enabled = false] STARTED

org.apache.kafka.streams.TopologyTestDriverTest > shouldUseSinkSpecificSerializers[Eos enabled = false] PASSED

org.apache.kafka.streams.TopologyTestDriverTest > shouldFlushStoreForFirstInput[Eos enabled = false] STARTED

org.apache.kafka.streams.TopologyTestDriverTest > shouldFlushStoreForFirstInput[Eos enabled = false] PASSED

org.apache.kafka.streams.TopologyTestDriverTest > shouldProcessFromSourceThatMatchPattern[Eos enabled = false] STARTED

org.apache.kafka.streams.TopologyTestDriverTest > shouldProcessFromSourceThatMatchPattern[Eos enabled = false] PASSED

org.apache.kafka.streams.TopologyTestDriverTest > shouldUpdateStoreForNewKey[Eos enabled = false] STARTED

org.apache.kafka.streams.TopologyTestDriverTest > shouldUpdateStoreForNewKey[Eos enabled = false] PASSED

org.apache.kafka.streams.TopologyTestDriverTest > shouldPunctuateOnWallClockTime[Eos enabled = false] STARTED

org.apache.kafka.streams.TopologyTestDriverTest > shouldPunctuateOnWallClockTime[Eos enabled = false] PASSED

org.apache.kafka.streams.TopologyTestDriverTest > shouldSetRecordMetadata[Eos enabled = false] STARTED

org.apache.kafka.streams.TopologyTestDriverTest > shouldSetRecordMetadata[Eos enabled = false] PASSED

org.apache.kafka.streams.TopologyTestDriverTest > shouldNotUpdateStoreForLargerValue[Eos enabled = false] STARTED

org.apache.kafka.streams.TopologyTestDriverTest > shouldNotUpdateStoreForLargerValue[Eos enabled = false] PASSED

org.apache.kafka.streams.TopologyTestDriverTest > shouldReturnCorrectInMemoryStoreTypeOnly[Eos enabled = false] STARTED

org.apache.kafka.streams.TopologyTestDriverTest > shouldReturnCorrectInMemoryStoreTypeOnly[Eos enabled = false] PASSED

org.apache.kafka.streams.TopologyTestDriverTest > shouldProcessRecordForTopic[Eos enabled = false] STARTED

org.apache.kafka.streams.TopologyTestDriverTest > shouldProcessRecordForTopic[Eos enabled = false] PASSED

org.apache.kafka.streams.TopologyTestDriverTest > shouldForwardRecordsFromSubtopologyToSubtopology[Eos enabled = false] STARTED

org.apache.kafka.streams.TopologyTestDriverTest > shouldForwardRecordsFromSubtopologyToSubtopology[Eos enabled = false] PASSED

org.apache.kafka.streams.TopologyTestDriverTest > shouldNotUpdateStoreForSmallerValue[Eos enabled = false] STARTED

org.apache.kafka.streams.TopologyTestDriverTest > shouldNotUpdateStoreForSmallerValue[Eos enabled = false] PASSED

org.apache.kafka.streams.TopologyTestDriverTest > shouldCreateStateDirectoryForStatefulTopology[Eos enabled = false] STARTED

org.apache.kafka.streams.TopologyTestDriverTest > shouldCreateStateDirectoryForStatefulTopology[Eos enabled = false] PASSED

org.apache.kafka.streams.TopologyTestDriverTest > shouldPunctuateIfWallClockTimeAdvances[Eos enabled = false] STARTED

org.apache.kafka.streams.TopologyTestDriverTest > shouldPunctuateIfWallClockTimeAdvances[Eos enabled = false] PASSED

org.apache.kafka.streams.MockTimeTest > shouldGetNanosAsMillis STARTED

org.apache.kafka.streams.MockTimeTest > shouldGetNanosAsMillis PASSED

org.apache.kafka.streams.MockTimeTest > shouldSetStartTime STARTED

org.apache.kafka.streams.MockTimeTest > shouldSetStartTime PASSED

org.apache.kafka.streams.MockTimeTest > shouldNotAllowNegativeSleep STARTED

org.apache.kafka.streams.MockTimeTest > shouldNotAllowNegativeSleep PASSED

org.apache.kafka.streams.MockTimeTest > shouldAdvanceTimeOnSleep STARTED

org.apache.kafka.streams.MockTimeTest > shouldAdvanceTimeOnSleep PASSED

org.apache.kafka.streams.internals.KeyValueStoreFacadeTest > shouldReturnIsOpen STARTED

org.apache.kafka.streams.internals.KeyValueStoreFacadeTest > shouldReturnIsOpen PASSED

org.apache.kafka.streams.internals.KeyValueStoreFacadeTest > shouldDeleteAndReturnPlainValue STARTED

org.apache.kafka.streams.internals.KeyValueStoreFacadeTest > shouldDeleteAndReturnPlainValue PASSED

org.apache.kafka.streams.internals.KeyValueStoreFacadeTest > shouldReturnName STARTED

org.apache.kafka.streams.internals.KeyValueStoreFacadeTest > shouldReturnName PASSED

org.apache.kafka.streams.internals.KeyValueStoreFacadeTest > shouldPutWithUnknownTimestamp STARTED

org.apache.kafka.streams.internals.KeyValueStoreFacadeTest > shouldPutWithUnknownTimestamp PASSED

org.apache.kafka.streams.internals.KeyValueStoreFacadeTest > shouldPutAllWithUnknownTimestamp STARTED

org.apache.kafka.streams.internals.KeyValueStoreFacadeTest > shouldPutAllWithUnknownTimestamp PASSED

org.apache.kafka.streams.internals.KeyValueStoreFacadeTest > shouldReturnIsPersistent STARTED

org.apache.kafka.streams.internals.KeyValueStoreFacadeTest > shouldReturnIsPersistent PASSED

org.apache.kafka.streams.internals.KeyValueStoreFacadeTest > shouldPutIfAbsentWithUnknownTimestamp STARTED

org.apache.kafka.streams.internals.KeyValueStoreFacadeTest > shouldPutIfAbsentWithUnknownTimestamp PASSED

org.apache.kafka.streams.internals.KeyValueStoreFacadeTest > shouldForwardClose STARTED

org.apache.kafka.streams.internals.KeyValueStoreFacadeTest > shouldForwardClose PASSED

org.apache.kafka.streams.internals.KeyValueStoreFacadeTest > shouldForwardFlush STARTED

org.apache.kafka.streams.internals.KeyValueStoreFacadeTest > shouldForwardFlush PASSED

org.apache.kafka.streams.internals.KeyValueStoreFacadeTest > shouldForwardInit STARTED

org.apache.kafka.streams.internals.KeyValueStoreFacadeTest > shouldForwardInit PASSED

org.apache.kafka.streams.internals.WindowStoreFacadeTest > shouldReturnIsOpen STARTED

org.apache.kafka.streams.internals.WindowStoreFacadeTest > shouldReturnIsOpen PASSED

org.apache.kafka.streams.internals.WindowStoreFacadeTest > shouldReturnName STARTED

org.apache.kafka.streams.internals.WindowStoreFacadeTest > shouldReturnName PASSED

org.apache.kafka.streams.internals.WindowStoreFacadeTest > shouldPutWithUnknownTimestamp STARTED

org.apache.kafka.streams.internals.WindowStoreFacadeTest > shouldPutWithUnknownTimestamp PASSED

org.apache.kafka.streams.internals.WindowStoreFacadeTest > shouldPutWindowStartTimestampWithUnknownTimestamp STARTED

org.apache.kafka.streams.internals.WindowStoreFacadeTest > shouldPutWindowStartTimestampWithUnknownTimestamp PASSED

org.apache.kafka.streams.internals.WindowStoreFacadeTest > shouldReturnIsPersistent STARTED

org.apache.kafka.streams.internals.WindowStoreFacadeTest > shouldReturnIsPersistent PASSED

org.apache.kafka.streams.internals.WindowStoreFacadeTest > shouldForwardClose STARTED

org.apache.kafka.streams.internals.WindowStoreFacadeTest > shouldForwardClose PASSED

org.apache.kafka.streams.internals.WindowStoreFacadeTest > shouldForwardFlush STARTED

org.apache.kafka.streams.internals.WindowStoreFacadeTest > shouldForwardFlush PASSED

org.apache.kafka.streams.internals.WindowStoreFacadeTest > shouldForwardInit STARTED

org.apache.kafka.streams.internals.WindowStoreFacadeTest > shouldForwardInit PASSED

> Task :streams:upgrade-system-tests-10:processTestResources NO-SOURCE
> Task :streams:upgrade-system-tests-10:testClasses
> Task :streams:upgrade-system-tests-10:checkstyleTest
> Task :streams:upgrade-system-tests-10:spotbugsMain NO-SOURCE
> Task :streams:upgrade-system-tests-10:test
> Task :streams:upgrade-system-tests-11:compileJava NO-SOURCE
> Task :streams:upgrade-system-tests-11:processResources NO-SOURCE
> Task :streams:upgrade-system-tests-11:classes UP-TO-DATE
> Task :streams:upgrade-system-tests-11:checkstyleMain NO-SOURCE
> Task :streams:upgrade-system-tests-11:compileTestJava
> Task :streams:upgrade-system-tests-11:processTestResources NO-SOURCE
> Task :streams:upgrade-system-tests-11:testClasses
> Task :streams:upgrade-system-tests-11:checkstyleTest
> Task :streams:upgrade-system-tests-11:spotbugsMain NO-SOURCE
> Task :streams:upgrade-system-tests-11:test
> Task :streams:upgrade-system-tests-20:compileJava NO-SOURCE
> Task :streams:upgrade-system-tests-20:processResources NO-SOURCE
> Task :streams:upgrade-system-tests-20:classes UP-TO-DATE
> Task :streams:upgrade-system-tests-20:checkstyleMain NO-SOURCE
> Task :streams:upgrade-system-tests-20:compileTestJava
> Task :streams:upgrade-system-tests-20:processTestResources NO-SOURCE
> Task :streams:upgrade-system-tests-20:testClasses
> Task :streams:upgrade-system-tests-20:checkstyleTest
> Task :streams:upgrade-system-tests-20:spotbugsMain NO-SOURCE
> Task :streams:upgrade-system-tests-20:test
> Task :streams:upgrade-system-tests-21:compileJava NO-SOURCE
> Task :streams:upgrade-system-tests-21:processResources NO-SOURCE
> Task :streams:upgrade-system-tests-21:classes UP-TO-DATE
> Task :streams:upgrade-system-tests-21:checkstyleMain NO-SOURCE
> Task :streams:upgrade-system-tests-21:compileTestJava
> Task :streams:upgrade-system-tests-21:processTestResources NO-SOURCE
> Task :streams:upgrade-system-tests-21:testClasses
> Task :streams:upgrade-system-tests-21:checkstyleTest
> Task :streams:upgrade-system-tests-21:spotbugsMain NO-SOURCE
> Task :streams:upgrade-system-tests-21:test
> Task :streams:upgrade-system-tests-22:compileJava NO-SOURCE
> Task :streams:upgrade-system-tests-22:processResources NO-SOURCE
> Task :streams:upgrade-system-tests-22:classes UP-TO-DATE
> Task :streams:upgrade-system-tests-22:checkstyleMain NO-SOURCE
> Task :streams:upgrade-system-tests-22:compileTestJava
> Task :streams:upgrade-system-tests-22:processTestResources NO-SOURCE
> Task :streams:upgrade-system-tests-22:testClasses
> Task :streams:upgrade-system-tests-22:checkstyleTest
> Task :streams:upgrade-system-tests-22:spotbugsMain NO-SOURCE
> Task :streams:upgrade-system-tests-22:test
> Task :streams:upgrade-system-tests-23:compileJava NO-SOURCE
> Task :streams:upgrade-system-tests-23:processResources NO-SOURCE
> Task :streams:upgrade-system-tests-23:classes UP-TO-DATE
> Task :streams:upgrade-system-tests-23:checkstyleMain NO-SOURCE
> Task :streams:upgrade-system-tests-23:compileTestJava
> Task :streams:upgrade-system-tests-23:processTestResources NO-SOURCE
> Task :streams:upgrade-system-tests-23:testClasses
> Task :streams:upgrade-system-tests-23:checkstyleTest
> Task :streams:upgrade-system-tests-23:spotbugsMain NO-SOURCE
> Task :streams:upgrade-system-tests-23:test

FAILURE: Build failed with an exception.

* What went wrong:
Execution failed for task ':core:test'.
> There were failing tests. See the report at: file://<https://builds.apache.org/job/kafka-trunk-jdk8/ws/core/build/reports/tests/test/index.html>

* Try:
Run with --stacktrace option to get the stack trace. Run with --info or --debug option to get more log output. Run with --scan to get full insights.

* Get more help at https://help.gradle.org

Deprecated Gradle features were used in this build, making it incompatible with Gradle 6.0.
Use '--warning-mode all' to show the individual deprecation warnings.
See https://docs.gradle.org/5.6.2/userguide/command_line_interface.html#sec:command_line_warnings

BUILD FAILED in 3h 27m 34s
183 actionable tasks: 156 executed, 27 up-to-date
Build step 'Execute shell' marked build as failure
[FINDBUGS] Collecting findbugs analysis files...
Setting GRADLE_4_10_3_HOME=/home/jenkins/tools/gradle/4.10.3
[FINDBUGS] Searching for all files in <https://builds.apache.org/job/kafka-trunk-jdk8/ws/> that match the pattern **/build/reports/*bugs/*.xml
[FINDBUGS] Parsing 17 files in <https://builds.apache.org/job/kafka-trunk-jdk8/ws/>
[FINDBUGS] Successfully parsed file <https://builds.apache.org/job/kafka-trunk-jdk8/ws/clients/build/reports/spotbugs/main.xml> with 0 unique warnings and 0 duplicates.
[FINDBUGS] Successfully parsed file <https://builds.apache.org/job/kafka-trunk-jdk8/ws/connect/api/build/reports/spotbugs/main.xml> with 0 unique warnings and 0 duplicates.
[FINDBUGS] Successfully parsed file <https://builds.apache.org/job/kafka-trunk-jdk8/ws/connect/basic-auth-extension/build/reports/spotbugs/main.xml> with 0 unique warnings and 0 duplicates.
[FINDBUGS] Successfully parsed file <https://builds.apache.org/job/kafka-trunk-jdk8/ws/connect/file/build/reports/spotbugs/main.xml> with 0 unique warnings and 0 duplicates.
[FINDBUGS] Successfully parsed file <https://builds.apache.org/job/kafka-trunk-jdk8/ws/connect/json/build/reports/spotbugs/main.xml> with 0 unique warnings and 0 duplicates.
[FINDBUGS] Successfully parsed file <https://builds.apache.org/job/kafka-trunk-jdk8/ws/connect/runtime/build/reports/spotbugs/main.xml> with 0 unique warnings and 0 duplicates.
[FINDBUGS] Successfully parsed file <https://builds.apache.org/job/kafka-trunk-jdk8/ws/connect/transforms/build/reports/spotbugs/main.xml> with 0 unique warnings and 0 duplicates.
[FINDBUGS] Successfully parsed file <https://builds.apache.org/job/kafka-trunk-jdk8/ws/core/build/reports/spotbugs/main.xml> with 0 unique warnings and 0 duplicates.
[FINDBUGS] Successfully parsed file <https://builds.apache.org/job/kafka-trunk-jdk8/ws/examples/build/reports/spotbugs/main.xml> with 0 unique warnings and 0 duplicates.
[FINDBUGS] Successfully parsed file <https://builds.apache.org/job/kafka-trunk-jdk8/ws/generator/build/reports/spotbugs/main.xml> with 0 unique warnings and 0 duplicates.
[FINDBUGS] Successfully parsed file <https://builds.apache.org/job/kafka-trunk-jdk8/ws/jmh-benchmarks/build/reports/spotbugs/main.xml> with 0 unique warnings and 0 duplicates.
[FINDBUGS] Successfully parsed file <https://builds.apache.org/job/kafka-trunk-jdk8/ws/log4j-appender/build/reports/spotbugs/main.xml> with 0 unique warnings and 0 duplicates.
[FINDBUGS] Successfully parsed file <https://builds.apache.org/job/kafka-trunk-jdk8/ws/streams/build/reports/spotbugs/main.xml> with 0 unique warnings and 0 duplicates.
[FINDBUGS] Successfully parsed file <https://builds.apache.org/job/kafka-trunk-jdk8/ws/streams/examples/build/reports/spotbugs/main.xml> with 0 unique warnings and 0 duplicates.
[FINDBUGS] Successfully parsed file <https://builds.apache.org/job/kafka-trunk-jdk8/ws/streams/streams-scala/build/reports/spotbugs/main.xml> with 0 unique warnings and 0 duplicates.
[FINDBUGS] Successfully parsed file <https://builds.apache.org/job/kafka-trunk-jdk8/ws/streams/test-utils/build/reports/spotbugs/main.xml> with 0 unique warnings and 0 duplicates.
[FINDBUGS] Successfully parsed file <https://builds.apache.org/job/kafka-trunk-jdk8/ws/tools/build/reports/spotbugs/main.xml> with 0 unique warnings and 0 duplicates.
Setting GRADLE_4_10_3_HOME=/home/jenkins/tools/gradle/4.10.3
No credentials specified
Setting GRADLE_4_10_3_HOME=/home/jenkins/tools/gradle/4.10.3
<Git Blamer> Using GitBlamer to create author and commit information for all warnings.
<Git Blamer> GIT_COMMIT=bc4fd676e5ea0e3cf44a8684dca0db46f912c828, workspace=<https://builds.apache.org/job/kafka-trunk-jdk8/ws/>
[FINDBUGS] Computing warning deltas based on reference build #3914
Recording test results
Setting GRADLE_4_10_3_HOME=/home/jenkins/tools/gradle/4.10.3
Setting GRADLE_4_10_3_HOME=/home/jenkins/tools/gradle/4.10.3
Not sending mail to unregistered user noreply@github.com

Build failed in Jenkins: kafka-trunk-jdk8 #3918

Posted by Apache Jenkins Server <je...@builds.apache.org>.
See <https://builds.apache.org/job/kafka-trunk-jdk8/3918/display/redirect?page=changes>

Changes:

[github] KAFKA-8086: Use 1 partition for offset topic when possible (#7356)

[bbejeck] KAFKA-6958: Overload methods for group and windowed stream to allow to

------------------------------------------
[...truncated 7.98 MB...]

org.apache.kafka.streams.scala.kstream.KStreamTest > filter a KStream should filter records satisfying the predicate STARTED

org.apache.kafka.streams.scala.kstream.KStreamTest > filter a KStream should filter records satisfying the predicate PASSED

org.apache.kafka.streams.scala.kstream.KStreamTest > filterNot a KStream should filter records not satisfying the predicate STARTED

org.apache.kafka.streams.scala.kstream.KStreamTest > filterNot a KStream should filter records not satisfying the predicate PASSED

org.apache.kafka.streams.scala.kstream.KStreamTest > foreach a KStream should run foreach actions on records STARTED

org.apache.kafka.streams.scala.kstream.KStreamTest > foreach a KStream should run foreach actions on records PASSED

org.apache.kafka.streams.scala.kstream.KStreamTest > peek a KStream should run peek actions on records STARTED

org.apache.kafka.streams.scala.kstream.KStreamTest > peek a KStream should run peek actions on records PASSED

org.apache.kafka.streams.scala.kstream.KStreamTest > selectKey a KStream should select a new key STARTED

org.apache.kafka.streams.scala.kstream.KStreamTest > selectKey a KStream should select a new key PASSED

org.apache.kafka.streams.scala.kstream.KStreamTest > join 2 KStreams should join correctly records STARTED

org.apache.kafka.streams.scala.kstream.KStreamTest > join 2 KStreams should join correctly records PASSED

org.apache.kafka.streams.scala.kstream.JoinedTest > Create a Joined should create a Joined with Serdes STARTED

org.apache.kafka.streams.scala.kstream.JoinedTest > Create a Joined should create a Joined with Serdes PASSED

org.apache.kafka.streams.scala.kstream.JoinedTest > Create a Joined should create a Joined with Serdes and repartition topic name STARTED

org.apache.kafka.streams.scala.kstream.JoinedTest > Create a Joined should create a Joined with Serdes and repartition topic name PASSED

org.apache.kafka.streams.scala.kstream.ProducedTest > Create a Produced should create a Produced with Serdes STARTED

org.apache.kafka.streams.scala.kstream.ProducedTest > Create a Produced should create a Produced with Serdes PASSED

org.apache.kafka.streams.scala.kstream.ProducedTest > Create a Produced with timestampExtractor and resetPolicy should create a Consumed with Serdes, timestampExtractor and resetPolicy STARTED

org.apache.kafka.streams.scala.kstream.ProducedTest > Create a Produced with timestampExtractor and resetPolicy should create a Consumed with Serdes, timestampExtractor and resetPolicy PASSED

org.apache.kafka.streams.scala.kstream.GroupedTest > Create a Grouped should create a Grouped with Serdes STARTED

org.apache.kafka.streams.scala.kstream.GroupedTest > Create a Grouped should create a Grouped with Serdes PASSED

org.apache.kafka.streams.scala.kstream.GroupedTest > Create a Grouped with repartition topic name should create a Grouped with Serdes, and repartition topic name STARTED

org.apache.kafka.streams.scala.kstream.GroupedTest > Create a Grouped with repartition topic name should create a Grouped with Serdes, and repartition topic name PASSED

org.apache.kafka.streams.scala.kstream.SuppressedTest > Suppressed.untilWindowCloses should produce the correct suppression STARTED

org.apache.kafka.streams.scala.kstream.SuppressedTest > Suppressed.untilWindowCloses should produce the correct suppression PASSED

org.apache.kafka.streams.scala.kstream.SuppressedTest > Suppressed.untilTimeLimit should produce the correct suppression STARTED

org.apache.kafka.streams.scala.kstream.SuppressedTest > Suppressed.untilTimeLimit should produce the correct suppression PASSED

org.apache.kafka.streams.scala.kstream.SuppressedTest > BufferConfig.maxRecords should produce the correct buffer config STARTED

org.apache.kafka.streams.scala.kstream.SuppressedTest > BufferConfig.maxRecords should produce the correct buffer config PASSED

org.apache.kafka.streams.scala.kstream.SuppressedTest > BufferConfig.maxBytes should produce the correct buffer config STARTED

org.apache.kafka.streams.scala.kstream.SuppressedTest > BufferConfig.maxBytes should produce the correct buffer config PASSED

org.apache.kafka.streams.scala.kstream.SuppressedTest > BufferConfig.unbounded should produce the correct buffer config STARTED

org.apache.kafka.streams.scala.kstream.SuppressedTest > BufferConfig.unbounded should produce the correct buffer config PASSED

org.apache.kafka.streams.scala.kstream.SuppressedTest > BufferConfig should support very long chains of factory methods STARTED

org.apache.kafka.streams.scala.kstream.SuppressedTest > BufferConfig should support very long chains of factory methods PASSED

org.apache.kafka.streams.scala.kstream.MaterializedTest > Create a Materialized should create a Materialized with Serdes STARTED

org.apache.kafka.streams.scala.kstream.MaterializedTest > Create a Materialized should create a Materialized with Serdes PASSED

org.apache.kafka.streams.scala.kstream.MaterializedTest > Create a Materialize with a store name should create a Materialized with Serdes and a store name STARTED

org.apache.kafka.streams.scala.kstream.MaterializedTest > Create a Materialize with a store name should create a Materialized with Serdes and a store name PASSED

org.apache.kafka.streams.scala.kstream.MaterializedTest > Create a Materialize with a window store supplier should create a Materialized with Serdes and a store supplier STARTED

org.apache.kafka.streams.scala.kstream.MaterializedTest > Create a Materialize with a window store supplier should create a Materialized with Serdes and a store supplier PASSED

org.apache.kafka.streams.scala.kstream.MaterializedTest > Create a Materialize with a key value store supplier should create a Materialized with Serdes and a store supplier STARTED

org.apache.kafka.streams.scala.kstream.MaterializedTest > Create a Materialize with a key value store supplier should create a Materialized with Serdes and a store supplier PASSED

org.apache.kafka.streams.scala.kstream.MaterializedTest > Create a Materialize with a session store supplier should create a Materialized with Serdes and a store supplier STARTED

org.apache.kafka.streams.scala.kstream.MaterializedTest > Create a Materialize with a session store supplier should create a Materialized with Serdes and a store supplier PASSED

org.apache.kafka.streams.scala.WordCountTest > testShouldCountWordsMaterialized STARTED

org.apache.kafka.streams.scala.WordCountTest > testShouldCountWordsMaterialized PASSED

org.apache.kafka.streams.scala.WordCountTest > testShouldCountWordsJava STARTED

org.apache.kafka.streams.scala.WordCountTest > testShouldCountWordsJava PASSED

org.apache.kafka.streams.scala.WordCountTest > testShouldCountWords STARTED

org.apache.kafka.streams.scala.WordCountTest > testShouldCountWords PASSED

org.apache.kafka.streams.scala.StreamToTableJoinScalaIntegrationTestImplicitSerdes > testShouldCountClicksPerRegionWithNamedRepartitionTopic STARTED

org.apache.kafka.streams.scala.StreamToTableJoinScalaIntegrationTestImplicitSerdes > testShouldCountClicksPerRegionWithNamedRepartitionTopic PASSED

org.apache.kafka.streams.scala.StreamToTableJoinScalaIntegrationTestImplicitSerdes > testShouldCountClicksPerRegionJava STARTED

org.apache.kafka.streams.scala.StreamToTableJoinScalaIntegrationTestImplicitSerdes > testShouldCountClicksPerRegionJava PASSED

org.apache.kafka.streams.scala.StreamToTableJoinScalaIntegrationTestImplicitSerdes > testShouldCountClicksPerRegion STARTED

org.apache.kafka.streams.scala.StreamToTableJoinScalaIntegrationTestImplicitSerdes > testShouldCountClicksPerRegion PASSED

org.apache.kafka.streams.scala.TopologyTest > shouldBuildIdenticalTopologyInJavaNScalaJoin STARTED

org.apache.kafka.streams.scala.TopologyTest > shouldBuildIdenticalTopologyInJavaNScalaJoin PASSED

org.apache.kafka.streams.scala.TopologyTest > shouldBuildIdenticalTopologyInJavaNScalaSimple STARTED

org.apache.kafka.streams.scala.TopologyTest > shouldBuildIdenticalTopologyInJavaNScalaSimple PASSED

org.apache.kafka.streams.scala.TopologyTest > shouldBuildIdenticalTopologyInJavaNScalaAggregate STARTED

org.apache.kafka.streams.scala.TopologyTest > shouldBuildIdenticalTopologyInJavaNScalaAggregate PASSED

org.apache.kafka.streams.scala.TopologyTest > shouldBuildIdenticalTopologyInJavaNScalaProperties STARTED

org.apache.kafka.streams.scala.TopologyTest > shouldBuildIdenticalTopologyInJavaNScalaProperties PASSED

org.apache.kafka.streams.scala.TopologyTest > shouldBuildIdenticalTopologyInJavaNScalaTransform STARTED

org.apache.kafka.streams.scala.TopologyTest > shouldBuildIdenticalTopologyInJavaNScalaTransform PASSED

> Task :streams:upgrade-system-tests-0110:spotbugsMain NO-SOURCE
> Task :streams:upgrade-system-tests-0110:test
> Task :streams:upgrade-system-tests-10:compileJava NO-SOURCE
> Task :streams:upgrade-system-tests-10:processResources NO-SOURCE
> Task :streams:upgrade-system-tests-10:classes UP-TO-DATE
> Task :streams:upgrade-system-tests-10:checkstyleMain NO-SOURCE
> Task :streams:upgrade-system-tests-10:compileTestJava
> Task :streams:upgrade-system-tests-10:processTestResources NO-SOURCE
> Task :streams:upgrade-system-tests-10:testClasses
> Task :streams:upgrade-system-tests-10:checkstyleTest
> Task :streams:upgrade-system-tests-10:spotbugsMain NO-SOURCE
> Task :streams:upgrade-system-tests-10:test
> Task :streams:upgrade-system-tests-11:compileJava NO-SOURCE
> Task :streams:upgrade-system-tests-11:processResources NO-SOURCE
> Task :streams:upgrade-system-tests-11:classes UP-TO-DATE
> Task :streams:upgrade-system-tests-11:checkstyleMain NO-SOURCE
> Task :streams:upgrade-system-tests-11:compileTestJava
> Task :streams:upgrade-system-tests-11:processTestResources NO-SOURCE
> Task :streams:upgrade-system-tests-11:testClasses
> Task :streams:upgrade-system-tests-11:checkstyleTest
> Task :streams:upgrade-system-tests-11:spotbugsMain NO-SOURCE
> Task :streams:upgrade-system-tests-11:test
> Task :streams:upgrade-system-tests-20:compileJava NO-SOURCE
> Task :streams:upgrade-system-tests-20:processResources NO-SOURCE
> Task :streams:upgrade-system-tests-20:classes UP-TO-DATE
> Task :streams:upgrade-system-tests-20:checkstyleMain NO-SOURCE
> Task :streams:upgrade-system-tests-20:compileTestJava
> Task :streams:upgrade-system-tests-20:processTestResources NO-SOURCE
> Task :streams:upgrade-system-tests-20:testClasses
> Task :streams:upgrade-system-tests-20:checkstyleTest
> Task :streams:upgrade-system-tests-20:spotbugsMain NO-SOURCE
> Task :streams:upgrade-system-tests-20:test
> Task :streams:upgrade-system-tests-21:compileJava NO-SOURCE
> Task :streams:upgrade-system-tests-21:processResources NO-SOURCE
> Task :streams:upgrade-system-tests-21:classes UP-TO-DATE
> Task :streams:upgrade-system-tests-21:checkstyleMain NO-SOURCE
> Task :streams:upgrade-system-tests-21:compileTestJava
> Task :streams:upgrade-system-tests-21:processTestResources NO-SOURCE
> Task :streams:upgrade-system-tests-21:testClasses
> Task :streams:upgrade-system-tests-21:checkstyleTest
> Task :streams:upgrade-system-tests-21:spotbugsMain NO-SOURCE
> Task :streams:upgrade-system-tests-21:test
> Task :streams:upgrade-system-tests-22:compileJava NO-SOURCE
> Task :streams:upgrade-system-tests-22:processResources NO-SOURCE
> Task :streams:upgrade-system-tests-22:classes UP-TO-DATE
> Task :streams:upgrade-system-tests-22:checkstyleMain NO-SOURCE
> Task :streams:upgrade-system-tests-22:compileTestJava
> Task :streams:upgrade-system-tests-22:processTestResources NO-SOURCE
> Task :streams:upgrade-system-tests-22:testClasses
> Task :streams:upgrade-system-tests-22:checkstyleTest
> Task :streams:upgrade-system-tests-22:spotbugsMain NO-SOURCE
> Task :streams:upgrade-system-tests-22:test
> Task :streams:upgrade-system-tests-23:compileJava NO-SOURCE
> Task :streams:upgrade-system-tests-23:processResources NO-SOURCE
> Task :streams:upgrade-system-tests-23:classes UP-TO-DATE
> Task :streams:upgrade-system-tests-23:checkstyleMain NO-SOURCE
> Task :streams:upgrade-system-tests-23:compileTestJava
> Task :streams:upgrade-system-tests-23:processTestResources NO-SOURCE
> Task :streams:upgrade-system-tests-23:testClasses
> Task :streams:upgrade-system-tests-23:checkstyleTest
> Task :streams:upgrade-system-tests-23:spotbugsMain NO-SOURCE
> Task :streams:upgrade-system-tests-23:test

FAILURE: Build failed with an exception.

* What went wrong:
Execution failed for task ':core:test'.
> There were failing tests. See the report at: file://<https://builds.apache.org/job/kafka-trunk-jdk8/ws/core/build/reports/tests/test/index.html>

* Try:
Run with --stacktrace option to get the stack trace. Run with --info or --debug option to get more log output. Run with --scan to get full insights.

* Get more help at https://help.gradle.org

Deprecated Gradle features were used in this build, making it incompatible with Gradle 6.0.
Use '--warning-mode all' to show the individual deprecation warnings.
See https://docs.gradle.org/5.6.2/userguide/command_line_interface.html#sec:command_line_warnings

BUILD FAILED in 3h 16m 50s
183 actionable tasks: 179 executed, 4 up-to-date
Build step 'Execute shell' marked build as failure
[FINDBUGS] Collecting findbugs analysis files...
Setting GRADLE_4_10_3_HOME=/home/jenkins/tools/gradle/4.10.3
[FINDBUGS] Searching for all files in <https://builds.apache.org/job/kafka-trunk-jdk8/ws/> that match the pattern **/build/reports/*bugs/*.xml
[FINDBUGS] Parsing 17 files in <https://builds.apache.org/job/kafka-trunk-jdk8/ws/>
[FINDBUGS] Successfully parsed file <https://builds.apache.org/job/kafka-trunk-jdk8/ws/clients/build/reports/spotbugs/main.xml> with 0 unique warnings and 0 duplicates.
[FINDBUGS] Successfully parsed file <https://builds.apache.org/job/kafka-trunk-jdk8/ws/connect/api/build/reports/spotbugs/main.xml> with 0 unique warnings and 0 duplicates.
[FINDBUGS] Successfully parsed file <https://builds.apache.org/job/kafka-trunk-jdk8/ws/connect/basic-auth-extension/build/reports/spotbugs/main.xml> with 0 unique warnings and 0 duplicates.
[FINDBUGS] Successfully parsed file <https://builds.apache.org/job/kafka-trunk-jdk8/ws/connect/file/build/reports/spotbugs/main.xml> with 0 unique warnings and 0 duplicates.
[FINDBUGS] Successfully parsed file <https://builds.apache.org/job/kafka-trunk-jdk8/ws/connect/json/build/reports/spotbugs/main.xml> with 0 unique warnings and 0 duplicates.
[FINDBUGS] Successfully parsed file <https://builds.apache.org/job/kafka-trunk-jdk8/ws/connect/runtime/build/reports/spotbugs/main.xml> with 0 unique warnings and 0 duplicates.
[FINDBUGS] Successfully parsed file <https://builds.apache.org/job/kafka-trunk-jdk8/ws/connect/transforms/build/reports/spotbugs/main.xml> with 0 unique warnings and 0 duplicates.
[FINDBUGS] Successfully parsed file <https://builds.apache.org/job/kafka-trunk-jdk8/ws/core/build/reports/spotbugs/main.xml> with 0 unique warnings and 0 duplicates.
[FINDBUGS] Successfully parsed file <https://builds.apache.org/job/kafka-trunk-jdk8/ws/examples/build/reports/spotbugs/main.xml> with 0 unique warnings and 0 duplicates.
[FINDBUGS] Successfully parsed file <https://builds.apache.org/job/kafka-trunk-jdk8/ws/generator/build/reports/spotbugs/main.xml> with 0 unique warnings and 0 duplicates.
[FINDBUGS] Successfully parsed file <https://builds.apache.org/job/kafka-trunk-jdk8/ws/jmh-benchmarks/build/reports/spotbugs/main.xml> with 0 unique warnings and 0 duplicates.
[FINDBUGS] Successfully parsed file <https://builds.apache.org/job/kafka-trunk-jdk8/ws/log4j-appender/build/reports/spotbugs/main.xml> with 0 unique warnings and 0 duplicates.
[FINDBUGS] Successfully parsed file <https://builds.apache.org/job/kafka-trunk-jdk8/ws/streams/build/reports/spotbugs/main.xml> with 0 unique warnings and 0 duplicates.
[FINDBUGS] Successfully parsed file <https://builds.apache.org/job/kafka-trunk-jdk8/ws/streams/examples/build/reports/spotbugs/main.xml> with 0 unique warnings and 0 duplicates.
[FINDBUGS] Successfully parsed file <https://builds.apache.org/job/kafka-trunk-jdk8/ws/streams/streams-scala/build/reports/spotbugs/main.xml> with 0 unique warnings and 0 duplicates.
[FINDBUGS] Successfully parsed file <https://builds.apache.org/job/kafka-trunk-jdk8/ws/streams/test-utils/build/reports/spotbugs/main.xml> with 0 unique warnings and 0 duplicates.
[FINDBUGS] Successfully parsed file <https://builds.apache.org/job/kafka-trunk-jdk8/ws/tools/build/reports/spotbugs/main.xml> with 0 unique warnings and 0 duplicates.
Setting GRADLE_4_10_3_HOME=/home/jenkins/tools/gradle/4.10.3
No credentials specified
Setting GRADLE_4_10_3_HOME=/home/jenkins/tools/gradle/4.10.3
<Git Blamer> Using GitBlamer to create author and commit information for all warnings.
<Git Blamer> GIT_COMMIT=beac4c7534ef0cd7be92514a8d92639bf417221c, workspace=<https://builds.apache.org/job/kafka-trunk-jdk8/ws/>
[FINDBUGS] Computing warning deltas based on reference build #3914
Recording test results
Setting GRADLE_4_10_3_HOME=/home/jenkins/tools/gradle/4.10.3
Setting GRADLE_4_10_3_HOME=/home/jenkins/tools/gradle/4.10.3
Not sending mail to unregistered user noreply@github.com