You are viewing a plain text version of this content. The canonical link for it is here.
Posted to builds@beam.apache.org by Apache Jenkins Server <je...@builds.apache.org> on 2022/03/18 18:02:28 UTC

Build failed in Jenkins: beam_PostCommit_Go #9600

See <https://ci-beam.apache.org/job/beam_PostCommit_Go/9600/display/redirect?page=changes>

Changes:

[mmack] [adhoc] Minor cleanup for aws2 tests


------------------------------------------
[...truncated 6.74 KB...]
> Task :buildSrc:validatePlugins FROM-CACHE
> Task :buildSrc:check UP-TO-DATE
> Task :buildSrc:build
> Task :model:fn-execution:createCheckerFrameworkManifest
> Task :model:pipeline:createCheckerFrameworkManifest
> Task :model:pipeline:extractIncludeProto
> Task :model:pipeline:extractProto
> Task :model:pipeline:generateProto FROM-CACHE
> Task :model:pipeline:compileJava FROM-CACHE
> Task :model:pipeline:processResources
> Task :model:pipeline:classes
> Task :model:pipeline:jar
> Task :model:fn-execution:extractIncludeProto
> Task :model:fn-execution:extractProto
> Task :model:fn-execution:generateProto FROM-CACHE
> Task :model:fn-execution:compileJava FROM-CACHE
> Task :model:fn-execution:processResources
> Task :model:fn-execution:classes
> Task :model:pipeline:shadowJar FROM-CACHE
> Task :model:fn-execution:shadowJar FROM-CACHE
> Task :model:job-management:createCheckerFrameworkManifest
> Task :model:job-management:extractIncludeProto
> Task :model:job-management:extractProto
> Task :model:job-management:generateProto FROM-CACHE
> Task :model:job-management:compileJava FROM-CACHE
> Task :model:job-management:processResources
> Task :model:job-management:classes
> Task :model:job-management:shadowJar FROM-CACHE
> Task :runners:core-construction-java:createCheckerFrameworkManifest
> Task :sdks:java:core:createCheckerFrameworkManifest
> Task :sdks:java:core:generateAvroProtocol NO-SOURCE
> Task :sdks:java:core:generateAvroJava NO-SOURCE
> Task :sdks:java:core:generateGrammarSource FROM-CACHE
> Task :sdks:java:core:compileJava FROM-CACHE
> Task :sdks:java:core:processResources
> Task :sdks:java:core:classes
> Task :sdks:java:core:shadowJar FROM-CACHE
> Task :sdks:java:fn-execution:createCheckerFrameworkManifest
> Task :sdks:java:fn-execution:compileJava FROM-CACHE
> Task :sdks:java:fn-execution:processResources NO-SOURCE
> Task :sdks:java:fn-execution:classes UP-TO-DATE
> Task :sdks:java:fn-execution:jar
> Task :runners:core-construction-java:compileJava FROM-CACHE
> Task :runners:core-construction-java:processResources NO-SOURCE
> Task :runners:core-construction-java:classes UP-TO-DATE
> Task :runners:core-construction-java:jar
> Task :runners:core-java:createCheckerFrameworkManifest
> Task :runners:core-java:compileJava FROM-CACHE
> Task :runners:core-java:processResources NO-SOURCE
> Task :runners:core-java:classes UP-TO-DATE
> Task :runners:core-java:jar
> Task :runners:google-cloud-dataflow-java:createCheckerFrameworkManifest
> Task :sdks:java:extensions:google-cloud-platform-core:createCheckerFrameworkManifest
> Task :sdks:java:extensions:google-cloud-platform-core:compileJava FROM-CACHE
> Task :sdks:java:extensions:google-cloud-platform-core:processResources NO-SOURCE
> Task :sdks:java:extensions:google-cloud-platform-core:classes UP-TO-DATE
> Task :sdks:java:extensions:google-cloud-platform-core:jar
> Task :runners:java-fn-execution:createCheckerFrameworkManifest
> Task :sdks:java:harness:createCheckerFrameworkManifest
> Task :sdks:java:harness:compileJava FROM-CACHE
> Task :sdks:java:harness:processResources NO-SOURCE
> Task :sdks:java:harness:classes UP-TO-DATE
> Task :sdks:java:harness:jar
> Task :runners:java-fn-execution:compileJava FROM-CACHE
> Task :runners:java-fn-execution:processResources NO-SOURCE
> Task :runners:java-fn-execution:classes UP-TO-DATE
> Task :runners:java-fn-execution:jar
> Task :sdks:java:expansion-service:createCheckerFrameworkManifest
> Task :sdks:java:expansion-service:compileJava FROM-CACHE
> Task :sdks:java:expansion-service:processResources NO-SOURCE
> Task :sdks:java:expansion-service:classes UP-TO-DATE
> Task :sdks:java:expansion-service:jar
> Task :sdks:java:extensions:arrow:createCheckerFrameworkManifest
> Task :sdks:java:extensions:arrow:compileJava FROM-CACHE
> Task :sdks:java:extensions:arrow:processResources NO-SOURCE
> Task :sdks:java:extensions:arrow:classes UP-TO-DATE
> Task :sdks:java:extensions:arrow:jar
> Task :sdks:java:extensions:protobuf:createCheckerFrameworkManifest
> Task :sdks:java:extensions:protobuf:extractIncludeProto
> Task :sdks:java:extensions:protobuf:extractProto
> Task :sdks:java:extensions:protobuf:generateProto NO-SOURCE
> Task :sdks:java:extensions:protobuf:compileJava FROM-CACHE
> Task :sdks:java:extensions:protobuf:processResources NO-SOURCE
> Task :sdks:java:extensions:protobuf:classes UP-TO-DATE
> Task :sdks:java:extensions:protobuf:jar
> Task :sdks:java:io:google-cloud-platform:createCheckerFrameworkManifest
> Task :sdks:java:io:google-cloud-platform:compileJava FROM-CACHE
> Task :sdks:java:io:google-cloud-platform:processResources NO-SOURCE
> Task :sdks:java:io:google-cloud-platform:classes UP-TO-DATE
> Task :sdks:java:io:google-cloud-platform:jar
> Task :sdks:java:io:kafka:createCheckerFrameworkManifest
> Task :sdks:java:io:kafka:compileJava FROM-CACHE
> Task :sdks:java:io:kafka:processResources NO-SOURCE
> Task :sdks:java:io:kafka:classes UP-TO-DATE
> Task :sdks:java:io:kafka:jar
> Task :runners:google-cloud-dataflow-java:compileJava FROM-CACHE
> Task :runners:google-cloud-dataflow-java:processResources
> Task :runners:google-cloud-dataflow-java:classes
> Task :runners:google-cloud-dataflow-java:jar
> Task :runners:google-cloud-dataflow-java:worker:createCheckerFrameworkManifest
> Task :runners:google-cloud-dataflow-java:worker:windmill:createCheckerFrameworkManifest
> Task :runners:google-cloud-dataflow-java:worker:windmill:extractIncludeProto
> Task :runners:google-cloud-dataflow-java:worker:windmill:extractProto
> Task :runners:google-cloud-dataflow-java:worker:windmill:generateProto FROM-CACHE
> Task :runners:google-cloud-dataflow-java:worker:windmill:compileJava FROM-CACHE
> Task :runners:google-cloud-dataflow-java:worker:windmill:processResources
> Task :runners:google-cloud-dataflow-java:worker:windmill:classes
> Task :runners:google-cloud-dataflow-java:worker:windmill:shadowJar FROM-CACHE
> Task :runners:google-cloud-dataflow-java:worker:compileJava FROM-CACHE
> Task :runners:google-cloud-dataflow-java:worker:processResources
> Task :runners:google-cloud-dataflow-java:worker:classes
> Task :runners:google-cloud-dataflow-java:worker:shadowJar FROM-CACHE
> Task :sdks:go:test:assemble UP-TO-DATE
> Task :sdks:go:test:test UP-TO-DATE
> Task :sdks:go:test:check UP-TO-DATE
> Task :sdks:go:test:build UP-TO-DATE

> Task :goIntegrationTests
$ TESTS=./test/integration/... ./test/regression
$ RUNNER=portable
$ TIMEOUT=2h
$ SIMULTANEOUS=3
$ GCS_LOCATION=gs://temp-storage-for-end-to-end-tests
$ PROJECT=apache-beam-testing
$ DATAFLOW_PROJECT=apache-beam-testing
$ REGION=us-central1
$ trap exit_background_processes SIGINT SIGTERM EXIT
$ key=--runner
$ case --runner in
$ RUNNER=dataflow
$ cd <https://ci-beam.apache.org/job/beam_PostCommit_Go/ws/src>
$ test -d sdks/go/test
$ DATAFLOW_WORKER_JAR=<https://ci-beam.apache.org/job/beam_PostCommit_Go/ws/src/runners/google-cloud-dataflow-java/worker/build/libs/beam-runners-google-cloud-dataflow-java-fn-api-worker-2.38.0-SNAPSHOT.jar>
Using Dataflow worker jar: <https://ci-beam.apache.org/job/beam_PostCommit_Go/ws/src/runners/google-cloud-dataflow-java/worker/build/libs/beam-runners-google-cloud-dataflow-java-fn-api-worker-2.38.0-SNAPSHOT.jar>
$ command -v docker
/usr/bin/docker
$ docker -v
Docker version 18.09.4, build d14af54
$ command -v gcloud
/usr/bin/gcloud
$ gcloud --version
Google Cloud SDK 335.0.0
alpha 2021.04.02
beta 2021.04.02
bq 2.0.66
core 2021.04.02
gsutil 4.60
$ TMPDIR=/tmp/tmp.aCpPD6drrx
$ gcloud_ver=335.0.0
$ TAG=20220318-180207
$ CONTAINER=us.gcr.io/apache-beam-testing/jenkins/beam_go_sdk
Using container us.gcr.io/apache-beam-testing/jenkins/beam_go_sdk
$ ./gradlew :sdks:go:container:docker -Pdocker-repository-root=us.gcr.io/apache-beam-testing/jenkins -Pdocker-tag=20220318-180207
Configuration on demand is an incubating feature.
> Task :buildSrc:compileJava NO-SOURCE
> Task :buildSrc:compileGroovy UP-TO-DATE
> Task :buildSrc:pluginDescriptors UP-TO-DATE
> Task :buildSrc:processResources UP-TO-DATE
> Task :buildSrc:classes UP-TO-DATE
> Task :buildSrc:jar UP-TO-DATE
> Task :buildSrc:assemble UP-TO-DATE
> Task :buildSrc:spotlessGroovy UP-TO-DATE
> Task :buildSrc:spotlessGroovyCheck UP-TO-DATE
> Task :buildSrc:spotlessGroovyGradle UP-TO-DATE
> Task :buildSrc:spotlessGroovyGradleCheck UP-TO-DATE
> Task :buildSrc:spotlessCheck UP-TO-DATE
> Task :buildSrc:pluginUnderTestMetadata UP-TO-DATE
> Task :buildSrc:compileTestJava NO-SOURCE
> Task :buildSrc:compileTestGroovy NO-SOURCE
> Task :buildSrc:processTestResources NO-SOURCE
> Task :buildSrc:testClasses UP-TO-DATE
> Task :buildSrc:test NO-SOURCE
> Task :buildSrc:validatePlugins UP-TO-DATE
> Task :buildSrc:check UP-TO-DATE
> Task :buildSrc:build UP-TO-DATE
System Go installation: /snap/bin/go is go version go1.16.15 linux/amd64; Preparing to use /home/jenkins/go/bin/go1.16.12
GOCMD=/home/jenkins/go/bin/go1.16.12go1.16.12: already downloaded in /home/jenkins/sdk/go1.16.12

> Task :sdks:go:container:copyLicenses
> Task :sdks:go:container:dockerClean UP-TO-DATE
> Task :sdks:go:container:goPrepare UP-TO-DATE
The message received from the daemon indicates that the daemon has disappeared.
Build request sent: Build{id=04408d05-eeae-46f3-a4fd-19499ea64767, currentDir=<https://ci-beam.apache.org/job/beam_PostCommit_Go/ws/src}>
Attempting to read last messages from the daemon log...
Daemon pid: 550103
  log file: /home/jenkins/.gradle/daemon/7.3.2/daemon-550103.out.log
----- Last  20 lines from daemon log file - daemon-550103.out.log -----
2022-03-18T18:02:08.595+0000 [DEBUG] [org.gradle.launcher.daemon.registry.PersistentDaemonRegistry] Marking busy by address: [571bc1b3-dace-4be9-adbd-30231b35be67 port:43081, addresses:[localhost/127.0.0.1]]
2022-03-18T18:02:08.596+0000 [DEBUG] [org.gradle.cache.internal.DefaultFileLockManager] Waiting to acquire exclusive lock on daemon addresses registry.
2022-03-18T18:02:08.596+0000 [DEBUG] [org.gradle.cache.internal.DefaultFileLockManager] Lock acquired on daemon addresses registry.
2022-03-18T18:02:08.596+0000 [DEBUG] [org.gradle.cache.internal.DefaultFileLockManager] Releasing lock on daemon addresses registry.
2022-03-18T18:02:08.597+0000 [DEBUG] [org.gradle.launcher.daemon.server.DaemonStateCoordinator] resetting idle timer
2022-03-18T18:02:08.597+0000 [DEBUG] [org.gradle.launcher.daemon.server.DaemonStateCoordinator] daemon is running. Sleeping until state changes.
2022-03-18T18:02:08.597+0000 [INFO] [org.gradle.launcher.daemon.server.exec.StartBuildOrRespondWithBusy] Daemon is about to start building Build{id=04408d05-eeae-46f3-a4fd-19499ea64767, currentDir=<https://ci-beam.apache.org/job/beam_PostCommit_Go/ws/src}.> Dispatching build started information...
2022-03-18T18:02:08.597+0000 [DEBUG] [org.gradle.launcher.daemon.server.SynchronizedDispatchConnection] thread 27: dispatching org.gradle.launcher.daemon.protocol.BuildStarted@58b24949
2022-03-18T18:02:08.597+0000 [DEBUG] [org.gradle.launcher.daemon.server.exec.EstablishBuildEnvironment] Configuring env variables: [PATH, RUN_DISPLAY_URL, HUDSON_HOME, RUN_CHANGES_DISPLAY_URL, JOB_URL, HUDSON_COOKIE, MOTD_SHOWN, DBUS_SESSION_BUS_ADDRESS, JENKINS_SERVER_COOKIE, LOGNAME, PWD, RUN_TESTS_DISPLAY_URL, JENKINS_URL, SHELL, BUILD_TAG, ROOT_BUILD_CAUSE, BUILD_CAUSE_TIMERTRIGGER, OLDPWD, GIT_CHECKOUT_DIR, JENKINS_HOME, sha1, CODECOV_TOKEN, NODE_NAME, BUILD_DISPLAY_NAME, JOB_DISPLAY_URL, GIT_BRANCH, SETUPTOOLS_USE_DISTUTILS, SHLVL, WORKSPACE_TMP, GIT_PREVIOUS_COMMIT, JAVA_HOME, BUILD_ID, LANG, XDG_SESSION_ID, XDG_SESSION_TYPE, JOB_NAME, SPARK_LOCAL_IP, BUILD_CAUSE, GIT_PREVIOUS_SUCCESSFUL_COMMIT, NODE_LABELS, HUDSON_URL, WORKSPACE, ROOT_BUILD_CAUSE_TIMERTRIGGER, XDG_SESSION_CLASS, _, GIT_COMMIT, COVERALLS_REPO_TOKEN, CI, EXECUTOR_NUMBER, HUDSON_SERVER_COOKIE, SSH_CLIENT, JOB_BASE_NAME, USER, SSH_CONNECTION, BUILD_NUMBER, BUILD_URL, RUN_ARTIFACTS_DISPLAY_URL, GIT_URL, XDG_RUNTIME_DIR, HOME]
2022-03-18T18:02:08.600+0000 [DEBUG] [org.gradle.launcher.daemon.server.exec.LogToClient] About to start relaying all logs to the client via the connection.
2022-03-18T18:02:08.600+0000 [INFO] [org.gradle.launcher.daemon.server.exec.LogToClient] The client will now receive all logging from the daemon (pid: 550103). The daemon log file: /home/jenkins/.gradle/daemon/7.3.2/daemon-550103.out.log
2022-03-18T18:02:08.600+0000 [INFO] [org.gradle.launcher.daemon.server.exec.LogAndCheckHealth] Starting 2nd build in daemon [uptime: 1 mins 41.751 secs, performance: 99%]
2022-03-18T18:02:08.601+0000 [DEBUG] [org.gradle.launcher.daemon.server.exec.ExecuteBuild] The daemon has started executing the build.
2022-03-18T18:02:08.601+0000 [DEBUG] [org.gradle.launcher.daemon.server.exec.ExecuteBuild] Executing build with daemon context: DefaultDaemonContext[uid=b9181a10-e9b8-40f1-adbf-1ad6df4fbe1e,javaHome=/usr/lib/jvm/java-8-openjdk-amd64,daemonRegistryDir=/home/jenkins/.gradle/daemon,pid=550103,idleTimeout=10800000,priority=NORMAL,daemonOpts=-Xss10240k,-Dfile.encoding=UTF-8,-Duser.country=US,-Duser.language=en,-Duser.variant]
Configuration on demand is an incubating feature.
System Go installation: /snap/bin/go is go version go1.16.15 linux/amd64; Preparing to use /home/jenkins/go/bin/go1.16.12
GOCMD=/home/jenkins/go/bin/go1.16.12
go1.16.12: already downloaded in /home/jenkins/sdk/go1.16.12
/home/jenkins/go/bin/go1.16.12 build -o ./build/target/linux_amd64/boot boot.go boot_test.go
Daemon vm is shutting down... The daemon has exited normally or was terminated in response to a user interrupt.
----- End of the daemon log -----


FAILURE: Build failed with an exception.

* What went wrong:
Gradle build daemon disappeared unexpectedly (it may have been killed or may have crashed)

* Try:
> Run with --stacktrace option to get the stack trace.
> Run with --info or --debug option to get more log output.
> Run with --scan to get full insights.


> Task :sdks:go:container:goBuild
* Get more help at https://help.gradle.org
/home/jenkins/go/bin/go1.16.12 build -o ./build/target/linux_amd64/boot boot.go boot_test.go
$ ./gradlew :sdks:go:container:docker -Pdocker-repository-root=us.gcr.io/apache-beam-testing/jenkins -Pdocker-tag=20220318-180207

> Task :goIntegrationTests FAILED

FAILURE: Build failed with an exception.

* What went wrong:
Execution failed for task ':goIntegrationTests'.
> Process 'command 'sh'' finished with non-zero exit value 1

* Try:
> Run with --stacktrace option to get the stack trace.
> Run with --info or --debug option to get more log output.
> Run with --scan to get full insights.

* Get more help at https://help.gradle.org

BUILD FAILED in 2m 2s
88 actionable tasks: 53 executed, 33 from cache, 2 up-to-date

Publishing build scan...
https://gradle.com/s/eujlq36wkdvem

Build step 'Invoke Gradle script' changed build result to FAILURE
Build step 'Invoke Gradle script' marked build as failure

---------------------------------------------------------------------
To unsubscribe, e-mail: builds-unsubscribe@beam.apache.org
For additional commands, e-mail: builds-help@beam.apache.org


Jenkins build is back to normal : beam_PostCommit_Go #9601

Posted by Apache Jenkins Server <je...@builds.apache.org>.
See <https://ci-beam.apache.org/job/beam_PostCommit_Go/9601/display/redirect?page=changes>


---------------------------------------------------------------------
To unsubscribe, e-mail: builds-unsubscribe@beam.apache.org
For additional commands, e-mail: builds-help@beam.apache.org