You are viewing a plain text version of this content. The canonical link for it is here.
Posted to notifications@ctakes.apache.org by Apache Jenkins Server <je...@builds.apache.org> on 2013/04/30 01:33:42 UTC

Build failed in Jenkins: ctakes-trunk-compiletest #238

See <https://builds.apache.org/job/ctakes-trunk-compiletest/238/>

------------------------------------------
[...truncated 5887 lines...]
[INFO] Nothing to compile - all classes are up to date
[debug] execute contextualize
[INFO] [INFO] Using 'UTF-8' encoding to copy filtered resources.
[INFO] skip non existing resourceDirectory <https://builds.apache.org/job/ctakes-trunk-compiletest/ws/ctakes-assertion/src/test/resources>
[INFO] Copying 3 resources
[INFO] Copying 3 resources

[INFO] --- maven-resources-plugin:2.5:testResources (default-testResources) @ ctakes-assertion ---
[INFO] [INFO] No sources to compile

[INFO] --- maven-compiler-plugin:2.4:testCompile (default-testCompile) @ ctakes-assertion ---
[INFO] 
[INFO] --- maven-surefire-plugin:2.12:test (default-test) @ ctakes-assertion ---
[INFO] Surefire report directory: <https://builds.apache.org/job/ctakes-trunk-compiletest/ws/ctakes-assertion/target/surefire-reports>

-------------------------------------------------------
 T E S T S
-------------------------------------------------------

Results :

Tests run: 0, Failures: 0, Errors: 0, Skipped: 0

[JENKINS] Recording test results
[INFO]                                                                         
[INFO] [INFO] Deleting <https://builds.apache.org/job/ctakes-trunk-compiletest/ws/ctakes-temporal-res/target>
------------------------------------------------------------------------
[INFO] Building Apache cTAKES Resources temporal 3.1.0-SNAPSHOT
[INFO] ------------------------------------------------------------------------
[INFO] 
[INFO] --- maven-clean-plugin:2.4.1:clean (default-clean) @ ctakes-temporal-res ---
[INFO] 
[INFO] --- maven-remote-resources-plugin:1.3:process (default) @ ctakes-temporal-res ---
[debug] execute contextualize
[INFO] [INFO] Using 'UTF-8' encoding to copy filtered resources.

[INFO] --- maven-resources-plugin:2.5:resources (default-resources) @ ctakes-temporal-res ---
[INFO] Copying 1 resource
[INFO] Copying 3 resources
[INFO] [INFO] No sources to compile

[INFO] --- maven-compiler-plugin:2.4:compile (default-compile) @ ctakes-temporal-res ---
[INFO] 
[INFO] --- maven-remote-resources-plugin:1.3:process (default) @ ctakes-temporal-res ---
[debug] execute contextualize
[INFO] [INFO] Using 'UTF-8' encoding to copy filtered resources.
[INFO] Copying 1 resource
[INFO] Copying 3 resources
[INFO] Copying 3 resources

[INFO] --- maven-resources-plugin:2.5:resources (default-resources) @ ctakes-temporal-res ---
[INFO] [INFO] No sources to compile

[INFO] --- maven-compiler-plugin:2.4:compile (default-compile) @ ctakes-temporal-res ---
[debug] execute contextualize
[INFO] [INFO] Using 'UTF-8' encoding to copy filtered resources.
[INFO] skip non existing resourceDirectory <https://builds.apache.org/job/ctakes-trunk-compiletest/ws/ctakes-temporal-res/src/test/resources>
[INFO] Copying 3 resources
[INFO] Copying 3 resources

[INFO] --- maven-resources-plugin:2.5:testResources (default-testResources) @ ctakes-temporal-res ---
[INFO] [INFO] No sources to compile

[INFO] --- maven-compiler-plugin:2.4:testCompile (default-testCompile) @ ctakes-temporal-res ---
[INFO] 
[INFO] [INFO] Surefire report directory: <https://builds.apache.org/job/ctakes-trunk-compiletest/ws/ctakes-temporal-res/target/surefire-reports>
--- maven-surefire-plugin:2.12:test (default-test) @ ctakes-temporal-res ---

-------------------------------------------------------
 T E S T S
-------------------------------------------------------

Results :

Tests run: 0, Failures: 0, Errors: 0, Skipped: 0

[JENKINS] Recording test results
[INFO]                                                                         
[INFO] ------------------------------------------------------------------------
[INFO] Building Apache cTAKES Temporal Information Extraction 3.1.0-SNAPSHOT
[INFO] ------------------------------------------------------------------------
[INFO] Deleting <https://builds.apache.org/job/ctakes-trunk-compiletest/ws/ctakes-temporal/target>
[INFO] 
[INFO] --- maven-clean-plugin:2.4.1:clean (default-clean) @ ctakes-temporal ---
[INFO] 
[INFO] --- maven-dependency-plugin:2.6:unpack (unpack) @ ctakes-temporal ---
[INFO] Configured Artifact: net.sourceforge.ctakesresources:ctakes-resources-umls2011ab:3.1.0:jar
[INFO] Unpacking /home/jenkins/jenkins-slave/maven-repositories/1/net/sourceforge/ctakesresources/ctakes-resources-umls2011ab/3.1.0/ctakes-resources-umls2011ab-3.1.0.jar to <https://builds.apache.org/job/ctakes-trunk-compiletest/ws/ctakes-temporal/target/unpacked> with includes "" and excludes ""
[INFO] 
[INFO] --- maven-remote-resources-plugin:1.3:process (default) @ ctakes-temporal ---
[debug] execute contextualize
[INFO] [INFO] Using 'UTF-8' encoding to copy filtered resources.
[INFO] skip non existing resourceDirectory <https://builds.apache.org/job/ctakes-trunk-compiletest/ws/ctakes-temporal/src/main/resources>
[INFO] Copying 3 resources

[INFO] --- maven-resources-plugin:2.5:resources (default-resources) @ ctakes-temporal ---
[INFO] 
[INFO] --- maven-compiler-plugin:2.4:compile (default-compile) @ ctakes-temporal ---
[INFO] Compiling 45 source files to <https://builds.apache.org/job/ctakes-trunk-compiletest/ws/ctakes-temporal/target/classes>
[INFO] -------------------------------------------------------------
[ERROR] COMPILATION ERROR : 
[INFO] -------------------------------------------------------------
[ERROR] <https://builds.apache.org/job/ctakes-trunk-compiletest/ws/ctakes-temporal/src/main/java/org/apache/ctakes/temporal/ae/feature/TemporalFTExtractor.java>:[78,22] moveTimexDownToNP(org.apache.ctakes.utils.tree.SimpleTree) has private access in org.apache.ctakes.temporal.ae.feature.TemporalPETExtractor
[INFO] 1 error
[INFO] -------------------------------------------------------------
[INFO] ------------------------------------------------------------------------
[INFO] Reactor Summary:
[INFO] 
[INFO] Apache cTAKES ..................................... SUCCESS [6.949s]
[INFO] Apache cTAKES common type system .................. SUCCESS [7.769s]
[INFO] Apache cTAKES utils ............................... SUCCESS [1.894s]
[INFO] Apache cTAKES Resources core ...................... SUCCESS [0.699s]
[INFO] Apache cTAKES core ................................ SUCCESS [7.898s]
[INFO] Apache cTAKES Resources pos-tagger ................ SUCCESS [0.906s]
[INFO] Apache cTAKES part-of-speech tagger ............... SUCCESS [3.567s]
[INFO] Apache cTAKES Resources ctakes-chunker-res ........ SUCCESS [0.766s]
[INFO] Apache cTAKES chunker ............................. SUCCESS [1.635s]
[INFO] Apache cTAKES document preprocessor ............... SUCCESS [2.094s]
[INFO] Apache cTAKES Resources dictionary-lookup ......... SUCCESS [0.893s]
[INFO] Apache cTAKES dictionary lookup ................... SUCCESS [8.551s]
[INFO] Apache cTAKES context dependent tokenizer ......... SUCCESS [1.197s]
[INFO] Apache cTAKES Resources lvg ....................... SUCCESS [0.796s]
[INFO] Apache cTAKES LVG lexical tools ................... SUCCESS [1.234s]
[INFO] Apache cTAKES Resources ne-contexts ............... SUCCESS [0.667s]
[INFO] Apache cTAKES named entity contexts ............... SUCCESS [2.333s]
[INFO] Apache cTAKES Resources constituency-parser ....... SUCCESS [1.102s]
[INFO] Apache cTAKES Constituency Parser ................. SUCCESS [1.177s]
[INFO] Apache cTAKES Resources coreference ............... SUCCESS [1.370s]
[INFO] Apache cTAKES Resources relation-extractor ........ SUCCESS [0.681s]
[INFO] Apache cTAKES Resources dependency-parser ......... SUCCESS [4.490s]
[INFO] Apache cTAKES Dependency Parser ................... SUCCESS [27.380s]
[INFO] Apache cTAKES Relation Extractor .................. SUCCESS [10.438s]
[INFO] Apache cTAKES CoReference Resolver ................ SUCCESS [3.315s]
[INFO] Apache cTAKES Resources drug-ner .................. SUCCESS [1.140s]
[INFO] Apache cTAKES Drug NER ............................ SUCCESS [2.736s]
[INFO] Apache cTAKES Resources side-effect ............... SUCCESS [2.064s]
[INFO] Apache cTAKES Side Effects ........................ SUCCESS [2.431s]
[INFO] Apache cTAKES Resources smoking-status ............ SUCCESS [1.714s]
[INFO] Apache cTAKES Smoking Status ...................... SUCCESS [2.334s]
[INFO] Apache cTAKES Resources pad-term-spotter-res ...... SUCCESS [1.555s]
[INFO] Apache cTAKES Pad Term Spotter .................... SUCCESS [2.376s]
[INFO] Apache cTAKES Resources assertion ................. SUCCESS [1.350s]
[INFO] Apache cTAKES Resources assertion-zoner ........... SUCCESS [0.990s]
[INFO] Apache cTAKES Assertion's zoner ................... SUCCESS [1.157s]
[INFO] Apache cTAKES Assertion ........................... SUCCESS [5.343s]
[INFO] Apache cTAKES Resources temporal .................. SUCCESS [0.637s]
[INFO] Apache cTAKES Temporal Information Extraction ..... FAILURE [7.717s]
[INFO] Apache cTAKES ctakes-clinical-pipeline ............ SKIPPED
[INFO] Apache cTAKES Distribution ........................ SKIPPED
[INFO] Apache cTAKES Regression-test ..................... SKIPPED
[INFO] ------------------------------------------------------------------------
[INFO] BUILD FAILURE
[INFO] ------------------------------------------------------------------------
[INFO] Total time: 2:16.293s
[INFO] Finished at: Mon Apr 29 23:33:30 UTC 2013
[INFO] Final Memory: 41M/293M
[INFO] ------------------------------------------------------------------------
[JENKINS] Archiving disabled
[JENKINS] Archiving disabled
[JENKINS] Archiving disabled
[JENKINS] Archiving disabled
[JENKINS] Archiving disabled
[JENKINS] Archiving disabled
[JENKINS] Archiving disabled
[JENKINS] Archiving disabled
[JENKINS] Archiving disabled
[JENKINS] Archiving disabled
[JENKINS] Archiving disabled
[JENKINS] Archiving disabled
[JENKINS] Archiving disabled
[JENKINS] Archiving disabled
[JENKINS] Archiving disabled
[JENKINS] Archiving disabled
[JENKINS] Archiving disabled
[JENKINS] Archiving disabled
[JENKINS] Archiving disabled
[JENKINS] Archiving disabled
[JENKINS] Archiving disabled
[JENKINS] Archiving disabled
[JENKINS] Archiving disabled
[JENKINS] Archiving disabled
[JENKINS] Archiving disabled
[JENKINS] Archiving disabled
[JENKINS] Archiving disabled
[JENKINS] Archiving disabled
[JENKINS] Archiving disabled
[JENKINS] Archiving disabled
[JENKINS] Archiving disabled
[JENKINS] Archiving disabled
[JENKINS] Archiving disabled
[JENKINS] Archiving disabled
[JENKINS] Archiving disabled
[JENKINS] Archiving disabled
[JENKINS] Archiving disabled
[JENKINS] Archiving disabled
[JENKINS] Archiving disabled
[JENKINS] Archiving disabled
[JENKINS] Archiving disabled
[JENKINS] Archiving disabled
Waiting for Jenkins to finish collecting data
mavenExecutionResult exceptions not empty
message : Failed to execute goal org.apache.maven.plugins:maven-compiler-plugin:2.4:compile (default-compile) on project ctakes-temporal: Compilation failure
<https://builds.apache.org/job/ctakes-trunk-compiletest/ws/ctakes-temporal/src/main/java/org/apache/ctakes/temporal/ae/feature/TemporalFTExtractor.java>:[78,22] moveTimexDownToNP(org.apache.ctakes.utils.tree.SimpleTree) has private access in org.apache.ctakes.temporal.ae.feature.TemporalPETExtractor

cause : Compilation failure
<https://builds.apache.org/job/ctakes-trunk-compiletest/ws/ctakes-temporal/src/main/java/org/apache/ctakes/temporal/ae/feature/TemporalFTExtractor.java>:[78,22] moveTimexDownToNP(org.apache.ctakes.utils.tree.SimpleTree) has private access in org.apache.ctakes.temporal.ae.feature.TemporalPETExtractor

Stack trace : 
org.apache.maven.lifecycle.LifecycleExecutionException: Failed to execute goal org.apache.maven.plugins:maven-compiler-plugin:2.4:compile (default-compile) on project ctakes-temporal: Compilation failure
<https://builds.apache.org/job/ctakes-trunk-compiletest/ws/ctakes-temporal/src/main/java/org/apache/ctakes/temporal/ae/feature/TemporalFTExtractor.java>:[78,22] moveTimexDownToNP(org.apache.ctakes.utils.tree.SimpleTree) has private access in org.apache.ctakes.temporal.ae.feature.TemporalPETExtractor

	at org.apache.maven.lifecycle.internal.MojoExecutor.execute(MojoExecutor.java:213)
	at org.apache.maven.lifecycle.internal.MojoExecutor.execute(MojoExecutor.java:153)
	at org.apache.maven.lifecycle.internal.MojoExecutor.execute(MojoExecutor.java:145)
	at org.apache.maven.lifecycle.internal.LifecycleModuleBuilder.buildProject(LifecycleModuleBuilder.java:84)
	at org.apache.maven.lifecycle.internal.LifecycleModuleBuilder.buildProject(LifecycleModuleBuilder.java:59)
	at org.apache.maven.lifecycle.internal.LifecycleStarter.singleThreadedBuild(LifecycleStarter.java:183)
	at org.apache.maven.lifecycle.internal.LifecycleStarter.execute(LifecycleStarter.java:161)
	at org.apache.maven.DefaultMaven.doExecute(DefaultMaven.java:320)
	at org.apache.maven.DefaultMaven.execute(DefaultMaven.java:156)
	at org.jvnet.hudson.maven3.launcher.Maven3Launcher.main(Maven3Launcher.java:79)
	at sun.reflect.NativeMethodAccessorImpl.invoke0(Native Method)
	at sun.reflect.NativeMethodAccessorImpl.invoke(NativeMethodAccessorImpl.java:39)
	at sun.reflect.DelegatingMethodAccessorImpl.invoke(DelegatingMethodAccessorImpl.java:25)
	at java.lang.reflect.Method.invoke(Method.java:597)
	at org.codehaus.plexus.classworlds.launcher.Launcher.launchStandard(Launcher.java:329)
	at org.codehaus.plexus.classworlds.launcher.Launcher.launch(Launcher.java:239)
	at org.jvnet.hudson.maven3.agent.Maven3Main.launch(Maven3Main.java:158)
	at hudson.maven.Maven3Builder.call(Maven3Builder.java:100)
	at hudson.maven.Maven3Builder.call(Maven3Builder.java:66)
	at hudson.remoting.UserRequest.perform(UserRequest.java:118)
	at hudson.remoting.UserRequest.perform(UserRequest.java:48)
	at hudson.remoting.Request$2.run(Request.java:326)
	at hudson.remoting.InterceptingExecutorService$1.call(InterceptingExecutorService.java:72)
	at java.util.concurrent.FutureTask$Sync.innerRun(FutureTask.java:303)
	at java.util.concurrent.FutureTask.run(FutureTask.java:138)
	at java.util.concurrent.ThreadPoolExecutor$Worker.runTask(ThreadPoolExecutor.java:886)
	at java.util.concurrent.ThreadPoolExecutor$Worker.run(ThreadPoolExecutor.java:908)
	at java.lang.Thread.run(Thread.java:662)
Caused by: org.apache.maven.plugin.CompilationFailureException: Compilation failure
<https://builds.apache.org/job/ctakes-trunk-compiletest/ws/ctakes-temporal/src/main/java/org/apache/ctakes/temporal/ae/feature/TemporalFTExtractor.java>:[78,22] moveTimexDownToNP(org.apache.ctakes.utils.tree.SimpleTree) has private access in org.apache.ctakes.temporal.ae.feature.TemporalPETExtractor

	at org.apache.maven.plugin.AbstractCompilerMojo.execute(AbstractCompilerMojo.java:678)
	at org.apache.maven.plugin.CompilerMojo.execute(CompilerMojo.java:128)
	at org.apache.maven.plugin.DefaultBuildPluginManager.executeMojo(DefaultBuildPluginManager.java:101)
	at org.apache.maven.lifecycle.internal.MojoExecutor.execute(MojoExecutor.java:209)
	... 27 more
Sending e-mails to: ctakes-notifications@incubator.apache.org
channel stopped

Jenkins build is back to normal : ctakes-trunk-compiletest #239

Posted by Apache Jenkins Server <je...@builds.apache.org>.
See <https://builds.apache.org/job/ctakes-trunk-compiletest/239/changes>