You are viewing a plain text version of this content. The canonical link for it is here.
Posted to builds@beam.apache.org by Apache Jenkins Server <je...@builds.apache.org> on 2022/06/24 21:20:56 UTC

Build failed in Jenkins: beam_PostCommit_Go #9995

See <https://ci-beam.apache.org/job/beam_PostCommit_Go/9995/display/redirect?page=changes>

Changes:

[Robert Bradshaw] Use WindowedValue.withValue rather than WindowedValue.of in

[Robert Bradshaw] [BEAM-14464] More efficient grouping keys in precombiner table.

[Robert Bradshaw] fix compile after merge

[Robert Bradshaw] spotless

[Robert Bradshaw] Only flush every Nth element.

[Robert Bradshaw] spotless

[Robert Bradshaw] Post-merge fix.

[Robert Bradshaw] Fix test expectations.

[bulat.safiullin] [Website] add guard expressions to fix-menu and page-nav

[noreply] Removes examples of unscalable sinks from documentation. (#22020)

[noreply] Unify to a single issue report (#22045)

[noreply] Remove colon in issue report

[noreply] Bump cloud.google.com/go/pubsub from 1.22.2 to 1.23.0 in /sdks (#22036)

[noreply] Fix vendored dependency issue and other style checks (#22046)

[noreply] Bump shell-quote (#21983)

[noreply] Bump cloud.google.com/go/bigquery from 1.32.0 to 1.34.1 in /sdks


------------------------------------------
[...truncated 840.47 KB...]
      capabilities: "beam:transform:sdf_truncate_sized_restrictions:v1"
      capabilities: "beam:protocol:worker_status:v1"
      capabilities: "beam:protocol:monitoring_info_short_ids:v1"
      capabilities: "beam:version:sdk_base:go"
      capabilities: "beam:coder:bytes:v1"
      capabilities: "beam:coder:bool:v1"
      capabilities: "beam:coder:varint:v1"
      capabilities: "beam:coder:double:v1"
      capabilities: "beam:coder:string_utf8:v1"
      capabilities: "beam:coder:length_prefix:v1"
      capabilities: "beam:coder:kv:v1"
      capabilities: "beam:coder:iterable:v1"
      capabilities: "beam:coder:state_backed_iterable:v1"
      capabilities: "beam:coder:windowed_value:v1"
      capabilities: "beam:coder:global_window:v1"
      capabilities: "beam:coder:interval_window:v1"
      capabilities: "beam:coder:row:v1"
      capabilities: "beam:coder:nullable:v1"
      dependencies: <
        type_urn: "beam:artifact:type:url:v1"
        type_payload: "\ndgs://temp-storage-for-end-to-end-tests/staging-validatesrunner-test/go-13-1656105495107732739/worker\022@47e98480fc3d138ed09fa2b8da5b1341f3cc87a50ff468b7eeab3dc5bfdc18ba"
        role_urn: "beam:artifact:role:go_worker_binary:v1"
      >
    >
  >
>
root_transform_ids: "e1"
root_transform_ids: "e2"
root_transform_ids: "e3"
root_transform_ids: "e4"
root_transform_ids: "e5"
root_transform_ids: "e6"
root_transform_ids: "e7"
root_transform_ids: "s1"
2022/06/24 21:18:19 Staged model pipeline: gs://temp-storage-for-end-to-end-tests/staging-validatesrunner-test/go-13-1656105495107732739/model
2022/06/24 21:18:19 {
  "environment": {
    "debugOptions": {},
    "experiments": [
      "use_unified_worker",
      "use_portable_job_submission",
      "beam_fn_api",
      "use_staged_dataflow_worker_jar"
    ],
    "sdkPipelineOptions": {
      "display_data": [
        {
          "key": "name",
          "namespace": "options",
          "type": "STRING",
          "value": "go-testemitpardoaftergbk"
        },
        {
          "key": "experiments",
          "namespace": "options",
          "type": "STRING",
          "value": "use_unified_worker,use_portable_job_submission"
        },
        {
          "key": "project",
          "namespace": "options",
          "type": "STRING",
          "value": "apache-beam-testing"
        },
        {
          "key": "region",
          "namespace": "options",
          "type": "STRING",
          "value": "us-central1"
        },
        {
          "key": "container_images",
          "namespace": "options",
          "type": "STRING",
          "value": "us.gcr.io/apache-beam-testing/jenkins/beam_go_sdk:20220624-204005"
        },
        {
          "key": "temp_location",
          "namespace": "options",
          "type": "STRING",
          "value": "gs://temp-storage-for-end-to-end-tests/temp-validatesrunner-test"
        },
        {
          "key": "hookOrder",
          "namespace": "go_options",
          "type": "STRING",
          "value": "[\"default_remote_logging\"]"
        },
        {
          "key": "test.paniconexit0",
          "namespace": "go_options",
          "type": "STRING",
          "value": "true"
        },
        {
          "key": "test.timeout",
          "namespace": "go_options",
          "type": "STRING",
          "value": "2h0m0s"
        },
        {
          "key": "test.v",
          "namespace": "go_options",
          "type": "STRING",
          "value": "true"
        },
        {
          "key": "hooks",
          "namespace": "go_options",
          "type": "STRING",
          "value": "{\"default_remote_logging\":null}"
        }
      ],
      "options": {
        "experiments": [
          "use_unified_worker",
          "use_portable_job_submission",
          "beam_fn_api",
          "use_staged_dataflow_worker_jar"
        ],
        "pipelineUrl": "gs://temp-storage-for-end-to-end-tests/staging-validatesrunner-test/go-13-1656105495107732739/model",
        "region": "us-central1",
        "tempLocation": "gs://temp-storage-for-end-to-end-tests/temp-validatesrunner-test"
      },
      "beam:option:go_options:v1": {
        "options": {
          "hookOrder": "[\"default_remote_logging\"]",
          "hooks": "{\"default_remote_logging\":null}",
          "test.paniconexit0": "true",
          "test.timeout": "2h0m0s",
          "test.v": "true"
        }
      }
    },
    "tempStoragePrefix": "gs://temp-storage-for-end-to-end-tests/temp-validatesrunner-test",
    "userAgent": {
      "name": "Apache Beam SDK for Go",
      "version": "2.41.0.dev"
    },
    "version": {
      "job_type": "FNAPI_BATCH",
      "major": "6"
    },
    "workerPools": [
      {
        "autoscalingSettings": {},
        "ipConfiguration": "WORKER_IP_UNSPECIFIED",
        "kind": "harness",
        "numWorkers": 1,
        "packages": [
          {
            "location": "gs://temp-storage-for-end-to-end-tests/staging-validatesrunner-test/go-13-1656105495107732739/worker",
            "name": "worker"
          },
          {
            "location": "gs://temp-storage-for-end-to-end-tests/staging-validatesrunner-test/go-13-1656105495107732739/dataflow-worker.jar",
            "name": "dataflow-worker.jar"
          }
        ],
        "sdkHarnessContainerImages": [
          {
            "containerImage": "us.gcr.io/apache-beam-testing/jenkins/beam_go_sdk:20220624-204005"
          }
        ],
        "workerHarnessContainerImage": "us.gcr.io/apache-beam-testing/jenkins/beam_go_sdk:20220624-204005"
      }
    ]
  },
  "name": "go-testemitpardoaftergbk",
  "projectId": "apache-beam-testing",
  "type": "JOB_TYPE_BATCH"
}
2022/06/24 21:18:20 Submitted job: 2022-06-24_14_18_19-11858601610896600039
2022/06/24 21:18:20 Console: https://console.cloud.google.com/dataflow/jobs/us-central1/2022-06-24_14_18_19-11858601610896600039?project=apache-beam-testing
2022/06/24 21:18:20 Logs: https://console.cloud.google.com/logs/viewer?project=apache-beam-testing&resource=dataflow_step%2Fjob_id%2F2022-06-24_14_18_19-11858601610896600039
2022/06/24 21:18:20 Job state: JOB_STATE_PENDING ...
2022/06/24 21:18:50 Job still running ...
2022/06/24 21:19:20 Job still running ...
2022/06/24 21:19:50 Job still running ...
2022/06/24 21:20:20 Job still running ...
2022/06/24 21:20:50 Job 2022-06-24_14_18_19-11858601610896600039 succeeded!
--- PASS: TestEmitParDoAfterGBK (155.83s)
FAIL
FAIL	github.com/apache/beam/sdks/v2/go/test/regression	1916.466s
FAIL
$ TEST_EXIT_CODE=0
$ cd ../..
$ docker rmi us.gcr.io/apache-beam-testing/jenkins/beam_go_sdk:20220624-204005
Untagged: us.gcr.io/apache-beam-testing/jenkins/beam_go_sdk:20220624-204005
Untagged: us.gcr.io/apache-beam-testing/jenkins/beam_go_sdk@sha256:d25a58f530354aaa52281d67584ccc39f9f342a269cca2440cc982999f953170
Deleted: sha256:f34907776279648997b68986d2dbd9acbedb7d2cf49e72225b405152dfa5317f
Deleted: sha256:433e770f8d8ef3971a51a925c6ddd8873d6494eda989a1a75e0060d66948a5a7
Deleted: sha256:b662e1aab3eec501f1504b9a5f67eb69f1959479fe01ee49d56412f026a489c4
Deleted: sha256:27d555d004bd0165b2642c150f7c9c1462636f5625ea0f76779614bf22a9e3ad
Deleted: sha256:a2ef70a0be63412d64aba0ebcbe14376ccb27d3e9629b93c36086bc4480c9ab9
Deleted: sha256:5e939b71b2a37b3413c72ef1b9b477431b5108cd3c0107e98e6058135f81b9d6
Deleted: sha256:896a9e9e4a1461765771f6c7dfc846f61a5115c737f559eb8e9b6acb70d99f25
Deleted: sha256:4348ee9c3d1548959d15499fa7729c14a0b14043b5f8b6cc10d4ce74353e8535
Deleted: sha256:dbf25b142beb2219785dc7c146b58310b8bf10029885cacc6fd46ee75b02e172
Deleted: sha256:ba4968a5e0fac59bf068ad923ade4b644584ab58043d8acd048e15f39d7159ac
Deleted: sha256:1c4e1021aa027c84af4a2a8377cf4c30ce58f81b0ae35d14145cd6b08926ddeb
Deleted: sha256:3ba4310a3c9ec8ef38b857083301ed8b1c7d4aacceec127b1d20f0de8a693d3b
Deleted: sha256:936646a4e0ccf73a7876c514a79dc584e2a30e57d4c4f6330bdfa2496834ac03
Deleted: sha256:18defd694b6cf7d61a841ee058e0cce99c4afd95278b81666d715c67956e3449
Deleted: sha256:7326e26fe9dd58a138f08cb5def21b759ee6701b90aaa05b928b52a5198a47ad
Deleted: sha256:7e91c10c0dce3ef2178bbca9d81afac145e1f3ce7b4c953607156710524a46ad
Deleted: sha256:db593dd43aeab7d7cc40c3250cb7842b9d7ec198b2616742b09e7f372245d81c
$ gcloud --quiet container images delete us.gcr.io/apache-beam-testing/jenkins/beam_go_sdk:20220624-204005
Digests:
- us.gcr.io/apache-beam-testing/jenkins/beam_go_sdk@sha256:d25a58f530354aaa52281d67584ccc39f9f342a269cca2440cc982999f953170
  Associated tags:
 - 20220624-204005
Tags:
- us.gcr.io/apache-beam-testing/jenkins/beam_go_sdk:20220624-204005
Deleted [us.gcr.io/apache-beam-testing/jenkins/beam_go_sdk:20220624-204005].
Deleted [us.gcr.io/apache-beam-testing/jenkins/beam_go_sdk@sha256:d25a58f530354aaa52281d67584ccc39f9f342a269cca2440cc982999f953170].
$ rm -rf /tmp/tmp.lYuP3wFlQZ
$ exit 1
$ exit 1

> Task :goIntegrationTests FAILED

FAILURE: Build failed with an exception.

* What went wrong:
Execution failed for task ':goIntegrationTests'.
> Process 'command 'sh'' finished with non-zero exit value 1

* Try:
> Run with --stacktrace option to get the stack trace.
> Run with --info or --debug option to get more log output.
> Run with --scan to get full insights.

* Get more help at https://help.gradle.org

Deprecated Gradle features were used in this build, making it incompatible with Gradle 8.0.

You can use '--warning-mode all' to show the individual deprecation warnings and determine if they come from your own scripts or plugins.

See https://docs.gradle.org/7.4/userguide/command_line_interface.html#sec:command_line_warnings

BUILD FAILED in 41m 42s
88 actionable tasks: 54 executed, 32 from cache, 2 up-to-date

Publishing build scan...
https://gradle.com/s/gk5mqvesldsja

Build step 'Invoke Gradle script' changed build result to FAILURE
Build step 'Invoke Gradle script' marked build as failure

---------------------------------------------------------------------
To unsubscribe, e-mail: builds-unsubscribe@beam.apache.org
For additional commands, e-mail: builds-help@beam.apache.org


Jenkins build is back to normal : beam_PostCommit_Go #9996

Posted by Apache Jenkins Server <je...@builds.apache.org>.
See <https://ci-beam.apache.org/job/beam_PostCommit_Go/9996/display/redirect?page=changes>


---------------------------------------------------------------------
To unsubscribe, e-mail: builds-unsubscribe@beam.apache.org
For additional commands, e-mail: builds-help@beam.apache.org