You are viewing a plain text version of this content. The canonical link for it is here.
Posted to builds@cassandra.apache.org by Apache Jenkins Server <je...@builds.apache.org> on 2021/05/18 21:15:49 UTC

Build complete: Cassandra-3.11 #166 [UNSTABLE] 24bd7d60aa0444ccdf072c5b5157738c7a8ddf0c

-------------------------------------------------------------------------------
Build Cassandra-3.11 #166 Unstable
URL: https://ci-cassandra.apache.org/job/Cassandra-3.11/166/
-------------------------------------------------------------------------------
Changes:
[Brandon Williams] Bloom false positive rate includes true negatives


-------------------------------------------------------------------------------
Failed Tests:
296 tests failed.
FAILED:  cqlshlib.python2.jdk8.no_cython.test.test_cqlsh_completion.TestCqlshCompletion.test_complete_in_insert
FAILED:  dtest-large-novnode.jmx_test
FAILED:  dtest-large-novnode.jmx_test
FAILED:  dtest-large-novnode.jmx_test
FAILED:  dtest-large-novnode.jmx_test
FAILED:  dtest-large-novnode.jmx_test
FAILED:  dtest-large-novnode.jmx_test
FAILED:  dtest-large-novnode.jmx_test
FAILED:  dtest-large-novnode.jmx_test
FAILED:  dtest-large.jmx_test
FAILED:  dtest-large.jmx_test
FAILED:  dtest-large.jmx_test
FAILED:  dtest-large.jmx_test
FAILED:  dtest-large.jmx_test
FAILED:  dtest-large.jmx_test
FAILED:  dtest-large.jmx_test
FAILED:  dtest-large.jmx_test
FAILED:  dtest-novnode.jmx_test
FAILED:  dtest-novnode.jmx_test
FAILED:  dtest-novnode.jmx_test
FAILED:  dtest-novnode.jmx_test
FAILED:  dtest-novnode.jmx_test
FAILED:  dtest-novnode.jmx_test
FAILED:  dtest-novnode.jmx_test
FAILED:  dtest-novnode.jmx_test
FAILED:  dtest-novnode.jmx_test
FAILED:  dtest-novnode.jmx_test
FAILED:  dtest-novnode.jmx_test
FAILED:  dtest-novnode.jmx_test
FAILED:  dtest-novnode.jmx_test
FAILED:  dtest-novnode.jmx_test
FAILED:  dtest-novnode.jmx_test
FAILED:  dtest-novnode.jmx_test
FAILED:  dtest-novnode.jmx_test
FAILED:  dtest-novnode.jmx_test
FAILED:  dtest-novnode.jmx_test
FAILED:  dtest-novnode.jmx_test
FAILED:  dtest-novnode.jmx_test
FAILED:  dtest-novnode.jmx_test
FAILED:  dtest-novnode.jmx_test
FAILED:  dtest-novnode.jmx_test
FAILED:  dtest-novnode.jmx_test
FAILED:  dtest-novnode.jmx_test
FAILED:  dtest-novnode.jmx_test
FAILED:  dtest-novnode.jmx_test
FAILED:  dtest-novnode.jmx_test
FAILED:  dtest-novnode.jmx_test
FAILED:  dtest-novnode.jmx_test
FAILED:  dtest-novnode.jmx_test
FAILED:  dtest-novnode.jmx_test
FAILED:  dtest-novnode.jmx_test
FAILED:  dtest-novnode.jmx_test
FAILED:  dtest-novnode.jmx_test
FAILED:  dtest-novnode.jmx_test
FAILED:  dtest-novnode.jmx_test
FAILED:  dtest-novnode.jmx_test
FAILED:  dtest-novnode.jmx_test
FAILED:  dtest-novnode.jmx_test
FAILED:  dtest-novnode.jmx_test
FAILED:  dtest-novnode.jmx_test
FAILED:  dtest-novnode.jmx_test
FAILED:  dtest-novnode.jmx_test
FAILED:  dtest-novnode.jmx_test
FAILED:  dtest-novnode.jmx_test
FAILED:  dtest-novnode.jmx_test
FAILED:  dtest-novnode.jmx_test
FAILED:  dtest-novnode.jmx_test
FAILED:  dtest-novnode.jmx_test
FAILED:  dtest-novnode.jmx_test
FAILED:  dtest-novnode.jmx_test
FAILED:  dtest-novnode.jmx_test
FAILED:  dtest-novnode.jmx_test
FAILED:  dtest-novnode.jmx_test
FAILED:  dtest-novnode.jmx_test
FAILED:  dtest-novnode.jmx_test
FAILED:  dtest-novnode.jmx_test
FAILED:  dtest-novnode.jmx_test
FAILED:  dtest-novnode.jmx_test
FAILED:  dtest-novnode.jmx_test
FAILED:  dtest-novnode.jmx_test
FAILED:  dtest-novnode.jmx_test
FAILED:  dtest-offheap.jmx_test
FAILED:  dtest-offheap.jmx_test
FAILED:  dtest-offheap.jmx_test
FAILED:  dtest-offheap.jmx_test
FAILED:  dtest-offheap.jmx_test
FAILED:  dtest-offheap.jmx_test
FAILED:  dtest-offheap.jmx_test
FAILED:  dtest-offheap.jmx_test
FAILED:  dtest-offheap.jmx_test
FAILED:  dtest-offheap.jmx_test
FAILED:  dtest-offheap.jmx_test
FAILED:  dtest-offheap.jmx_test
FAILED:  dtest-offheap.jmx_test
FAILED:  dtest-offheap.jmx_test
FAILED:  dtest-offheap.jmx_test
FAILED:  dtest-offheap.jmx_test
FAILED:  dtest-offheap.jmx_test
FAILED:  dtest-offheap.jmx_test
FAILED:  dtest-offheap.jmx_test
FAILED:  dtest-offheap.jmx_test
FAILED:  dtest-offheap.jmx_test
FAILED:  dtest-offheap.jmx_test
FAILED:  dtest-offheap.jmx_test
FAILED:  dtest-offheap.jmx_test
FAILED:  dtest-offheap.jmx_test
FAILED:  dtest-offheap.jmx_test
FAILED:  dtest-offheap.jmx_test
FAILED:  dtest-offheap.jmx_test
FAILED:  dtest-offheap.jmx_test
FAILED:  dtest-offheap.jmx_test
FAILED:  dtest-offheap.jmx_test
FAILED:  dtest-offheap.jmx_test
FAILED:  dtest-offheap.jmx_test
FAILED:  dtest-offheap.jmx_test
FAILED:  dtest-offheap.jmx_test
FAILED:  dtest-offheap.jmx_test
FAILED:  dtest-offheap.jmx_test
FAILED:  dtest-offheap.jmx_test
FAILED:  dtest-offheap.jmx_test
FAILED:  dtest-offheap.jmx_test
FAILED:  dtest-offheap.jmx_test
FAILED:  dtest-offheap.jmx_test
FAILED:  dtest-offheap.jmx_test
FAILED:  dtest-offheap.jmx_test
FAILED:  dtest-offheap.jmx_test
FAILED:  dtest-offheap.jmx_test
FAILED:  dtest-offheap.jmx_test
FAILED:  dtest-offheap.jmx_test
FAILED:  dtest-offheap.jmx_test
FAILED:  dtest-offheap.jmx_test
FAILED:  dtest-offheap.jmx_test
FAILED:  dtest-offheap.jmx_test
FAILED:  dtest-offheap.jmx_test
FAILED:  dtest-offheap.jmx_test
FAILED:  dtest-offheap.jmx_test
FAILED:  dtest-offheap.jmx_test
FAILED:  dtest-offheap.jmx_test
FAILED:  dtest-offheap.jmx_test
FAILED:  dtest-offheap.jmx_test
FAILED:  dtest-offheap.jmx_test
FAILED:  dtest-offheap.jmx_test
FAILED:  dtest-offheap.jmx_test
FAILED:  dtest-offheap.jmx_test
FAILED:  dtest-offheap.jmx_test
FAILED:  dtest-upgrade.jmx_test
FAILED:  dtest-upgrade.jmx_test
FAILED:  dtest-upgrade.jmx_test
FAILED:  dtest-upgrade.jmx_test
FAILED:  dtest-upgrade.jmx_test
FAILED:  dtest-upgrade.jmx_test
FAILED:  dtest-upgrade.jmx_test
FAILED:  dtest-upgrade.jmx_test
FAILED:  dtest-upgrade.jmx_test
FAILED:  dtest-upgrade.jmx_test
FAILED:  dtest-upgrade.jmx_test
FAILED:  dtest-upgrade.jmx_test
FAILED:  dtest-upgrade.jmx_test
FAILED:  dtest-upgrade.jmx_test
FAILED:  dtest-upgrade.jmx_test
FAILED:  dtest-upgrade.jmx_test
FAILED:  dtest-upgrade.jmx_test
FAILED:  dtest-upgrade.jmx_test
FAILED:  dtest-upgrade.jmx_test
FAILED:  dtest-upgrade.jmx_test
FAILED:  dtest-upgrade.jmx_test
FAILED:  dtest-upgrade.jmx_test
FAILED:  dtest-upgrade.jmx_test
FAILED:  dtest-upgrade.jmx_test
FAILED:  dtest-upgrade.jmx_test
FAILED:  dtest-upgrade.jmx_test
FAILED:  dtest-upgrade.jmx_test
FAILED:  dtest-upgrade.jmx_test
FAILED:  dtest-upgrade.jmx_test
FAILED:  dtest-upgrade.jmx_test
FAILED:  dtest-upgrade.jmx_test
FAILED:  dtest-upgrade.jmx_test
FAILED:  dtest-upgrade.jmx_test
FAILED:  dtest-upgrade.jmx_test
FAILED:  dtest-upgrade.jmx_test
FAILED:  dtest-upgrade.jmx_test
FAILED:  dtest-upgrade.jmx_test
FAILED:  dtest-upgrade.jmx_test
FAILED:  dtest-upgrade.jmx_test
FAILED:  dtest-upgrade.jmx_test
FAILED:  dtest-upgrade.jmx_test
FAILED:  dtest-upgrade.jmx_test
FAILED:  dtest-upgrade.jmx_test
FAILED:  dtest-upgrade.jmx_test
FAILED:  dtest-upgrade.jmx_test
FAILED:  dtest-upgrade.jmx_test
FAILED:  dtest-upgrade.jmx_test
FAILED:  dtest-upgrade.jmx_test
FAILED:  dtest-upgrade.jmx_test
FAILED:  dtest-upgrade.jmx_test
FAILED:  dtest-upgrade.jmx_test
FAILED:  dtest-upgrade.jmx_test
FAILED:  dtest-upgrade.jmx_test
FAILED:  dtest-upgrade.jmx_test
FAILED:  dtest-upgrade.jmx_test
FAILED:  dtest-upgrade.jmx_test
FAILED:  dtest-upgrade.jmx_test
FAILED:  dtest-upgrade.jmx_test
FAILED:  dtest-upgrade.jmx_test
FAILED:  dtest-upgrade.jmx_test
FAILED:  dtest-upgrade.jmx_test
FAILED:  dtest-upgrade.jmx_test
FAILED:  dtest-upgrade.jmx_test
FAILED:  dtest-upgrade.jmx_test
FAILED:  dtest.jmx_test
FAILED:  dtest.jmx_test
FAILED:  dtest.jmx_test
FAILED:  dtest.jmx_test
FAILED:  dtest.jmx_test
FAILED:  dtest.jmx_test
FAILED:  dtest.jmx_test
FAILED:  dtest.jmx_test
FAILED:  dtest.jmx_test
FAILED:  dtest.jmx_test
FAILED:  dtest.jmx_test
FAILED:  dtest.jmx_test
FAILED:  dtest.jmx_test
FAILED:  dtest.jmx_test
FAILED:  dtest.jmx_test
FAILED:  dtest.jmx_test
FAILED:  dtest.jmx_test
FAILED:  dtest.jmx_test
FAILED:  dtest.jmx_test
FAILED:  dtest.jmx_test
FAILED:  dtest.jmx_test
FAILED:  dtest.jmx_test
FAILED:  dtest.jmx_test
FAILED:  dtest.jmx_test
FAILED:  dtest.jmx_test
FAILED:  dtest.jmx_test
FAILED:  dtest.jmx_test
FAILED:  dtest.jmx_test
FAILED:  dtest.jmx_test
FAILED:  dtest.jmx_test
FAILED:  dtest.jmx_test
FAILED:  dtest.jmx_test
FAILED:  dtest.jmx_test
FAILED:  dtest.jmx_test
FAILED:  dtest.jmx_test
FAILED:  dtest.jmx_test
FAILED:  dtest.jmx_test
FAILED:  dtest.jmx_test
FAILED:  dtest.jmx_test
FAILED:  dtest.jmx_test
FAILED:  dtest.jmx_test
FAILED:  dtest.jmx_test
FAILED:  dtest.jmx_test
FAILED:  dtest.jmx_test
FAILED:  dtest.jmx_test
FAILED:  dtest.jmx_test
FAILED:  dtest.jmx_test
FAILED:  dtest.jmx_test
FAILED:  dtest.jmx_test
FAILED:  dtest.jmx_test
FAILED:  dtest.jmx_test
FAILED:  dtest.jmx_test
FAILED:  dtest.jmx_test
FAILED:  dtest.jmx_test
FAILED:  dtest.jmx_test
FAILED:  dtest.jmx_test
FAILED:  dtest.jmx_test
FAILED:  dtest.jmx_test
FAILED:  dtest.jmx_test
FAILED:  dtest.jmx_test
FAILED:  dtest.jmx_test
FAILED:  dtest.jmx_test
FAILED:  dtest.jmx_test
FAILED:  dtest.jmx_test
FAILED:  org.apache.cassandra.distributed.test.GossipTest.nodeDownDuringMove
FAILED:  org.apache.cassandra.repair.CompactionValidationTest.throttledValidationIsSlowerThanUnthrottledValidationTest
FAILED:  org.apache.cassandra.cql3.ViewComplexTest.testExpiredLivenessLimitWithoutFlush
FAILED:  org.apache.cassandra.cql3.validation.operations.TTLTest.testCapWarnExpirationOverflowPolicy-compression
FAILED:  org.apache.cassandra.concurrent.LongSharedExecutorPoolTest.testPromptnessOfExecution
FAILED:  org.apache.cassandra.concurrent.LongSharedExecutorPoolTest.testPromptnessOfExecution
FAILED:  org.apache.cassandra.concurrent.LongSharedExecutorPoolTest.testPromptnessOfExecution
FAILED:  org.apache.cassandra.concurrent.LongSharedExecutorPoolTest.testPromptnessOfExecution
FAILED:  org.apache.cassandra.utils.memory.LongBufferPoolTest.testAllocate
FAILED:  cqlshlib.python2.jdk8.no_cython.test.test_cqlsh_output.TestCqlshOutput.test_boolean_output
FAILED:  cqlshlib.python2.jdk8.no_cython.test.test_cqlsh_output.TestCqlshOutput.test_columnless_key_output
FAILED:  cqlshlib.python2.jdk8.no_cython.test.test_cqlsh_output.TestCqlshOutput.test_count_output
FAILED:  cqlshlib.python2.jdk8.no_cython.test.test_cqlsh_output.TestCqlshOutput.test_null_output
FAILED:  cqlshlib.python2.jdk8.no_cython.test.test_cqlsh_output.TestCqlshOutput.test_numeric_output
FAILED:  cqlshlib.python2.jdk8.no_cython.test.test_cqlsh_output.TestCqlshOutput.test_static_cf_output
FAILED:  cqlshlib.python2.jdk8.no_cython.test.test_cqlsh_output.TestCqlshOutput.test_string_output_ascii
FAILED:  cqlshlib.python2.jdk8.cython.test.test_cqlsh_output.TestCqlshOutput.test_boolean_output
FAILED:  cqlshlib.python2.jdk8.cython.test.test_cqlsh_output.TestCqlshOutput.test_columnless_key_output
FAILED:  cqlshlib.python2.jdk8.cython.test.test_cqlsh_output.TestCqlshOutput.test_count_output
FAILED:  cqlshlib.python2.jdk8.cython.test.test_cqlsh_output.TestCqlshOutput.test_null_output
FAILED:  cqlshlib.python2.jdk8.cython.test.test_cqlsh_output.TestCqlshOutput.test_numeric_output
FAILED:  cqlshlib.python2.jdk8.cython.test.test_cqlsh_output.TestCqlshOutput.test_static_cf_output
FAILED:  cqlshlib.python2.jdk8.cython.test.test_cqlsh_output.TestCqlshOutput.test_string_output_ascii

-------------------------------------------------------------------------------
For complete test report and logs see https://nightlies.apache.org/cassandra/Cassandra-3.11/166/