You are viewing a plain text version of this content. The canonical link for it is here.
Posted to builds@beam.apache.org by Apache Jenkins Server <je...@builds.apache.org> on 2021/03/18 07:28:03 UTC

Build failed in Jenkins: beam_PostCommit_Python38 #987

See <https://ci-beam.apache.org/job/beam_PostCommit_Python38/987/display/redirect?page=changes>

Changes:

[Kyle Weaver] Add example of Spark rest URL.

[zyichi] [BEAM-11979] Ignore not serializable filter fields in python MongoDBIO

[Kenneth Knowles] Add script to tag a commit for building RC

[Kenneth Knowles] Adjust build_release_candidate.sh to use existing tag

[Kenneth Knowles] Update instructions to include tagging an RC commit

[Robert Bradshaw] Better error for missing java.

[noreply] Revert "Add License file for the Go SDK  for pkg.go.dev"


------------------------------------------
[...truncated 40.66 MB...]
DEBUG:urllib3.connectionpool:Starting new HTTP connection (1): metadata.google.internal:80
DEBUG:urllib3.connectionpool:http://metadata.google.internal:80 "GET /computeMetadata/v1/instance/service-accounts/default/?recursive=true HTTP/1.1" 200 144
DEBUG:google.auth.transport.requests:Making request: GET http://metadata.google.internal/computeMetadata/v1/instance/service-accounts/844138762903-compute@developer.gserviceaccount.com/token?scopes=https%3A%2F%2Fwww.googleapis.com%2Fauth%2Fbigquery%2Chttps%3A%2F%2Fwww.googleapis.com%2Fauth%2Fcloud-platform
DEBUG:urllib3.connectionpool:http://metadata.google.internal:80 "GET /computeMetadata/v1/instance/service-accounts/844138762903-compute@developer.gserviceaccount.com/token?scopes=https%3A%2F%2Fwww.googleapis.com%2Fauth%2Fbigquery%2Chttps%3A%2F%2Fwww.googleapis.com%2Fauth%2Fcloud-platform HTTP/1.1" 200 244
DEBUG:urllib3.connectionpool:Starting new HTTPS connection (1): bigquery.googleapis.com:443
DEBUG:urllib3.connectionpool:https://bigquery.googleapis.com:443 "POST /bigquery/v2/projects/apache-beam-testing/jobs?prettyPrint=false HTTP/1.1" 200 None
DEBUG:urllib3.connectionpool:https://bigquery.googleapis.com:443 "GET /bigquery/v2/projects/apache-beam-testing/queries/a31da228-b5ee-4e00-904b-1c0ea8c85462?maxResults=0&location=US&prettyPrint=false HTTP/1.1" 200 None
DEBUG:urllib3.connectionpool:https://bigquery.googleapis.com:443 "GET /bigquery/v2/projects/apache-beam-testing/datasets/_7357fab0f784d2a7327ddbe81cdd1f4ca7e429cd/tables/anon5aca8c6f_eced_4e0f_8868_01132bf44fe9/data?prettyPrint=false HTTP/1.1" 200 None
INFO:apache_beam.io.gcp.tests.bigquery_matcher:Result of query is: [(3,), (1,), (2,), (0,)]
INFO:apache_beam.runners.dataflow.dataflow_runner:2021-03-18T07:21:39.955Z: JOB_MESSAGE_BASIC: Executing BigQuery import job "dataflow_job_10297852226960102397". You can check its status with the bq tool: "bq show -j --project_id=apache-beam-testing dataflow_job_10297852226960102397".
INFO:apache_beam.runners.dataflow.dataflow_runner:2021-03-18T07:21:43.795Z: JOB_MESSAGE_BASIC: Finished operation read/ReadFromBigQuery/FilesToRemoveImpulse/Read+read/ReadFromBigQuery/MapFilesToRemove
INFO:apache_beam.runners.dataflow.dataflow_runner:2021-03-18T07:21:43.981Z: JOB_MESSAGE_DEBUG: Value "read/ReadFromBigQuery/MapFilesToRemove.out" materialized.
INFO:apache_beam.runners.dataflow.dataflow_runner:2021-03-18T07:21:44.158Z: JOB_MESSAGE_BASIC: Executing operation read/ReadFromBigQuery/_PassThroughThenCleanup/ParDo(RemoveExtractedFiles)/_UnpickledSideInput(MapFilesToRemove.out.0)
INFO:apache_beam.runners.dataflow.dataflow_runner:2021-03-18T07:21:44.213Z: JOB_MESSAGE_BASIC: Finished operation read/ReadFromBigQuery/_PassThroughThenCleanup/ParDo(RemoveExtractedFiles)/_UnpickledSideInput(MapFilesToRemove.out.0)
INFO:apache_beam.runners.dataflow.dataflow_runner:2021-03-18T07:21:44.295Z: JOB_MESSAGE_DEBUG: Value "read/ReadFromBigQuery/_PassThroughThenCleanup/ParDo(RemoveExtractedFiles)/_UnpickledSideInput(MapFilesToRemove.out.0).output" materialized.
INFO:apache_beam.runners.dataflow.dataflow_runner:2021-03-18T07:21:51.225Z: JOB_MESSAGE_BASIC: BigQuery import job "dataflow_job_10297852226960102397" done.
INFO:apache_beam.runners.dataflow.dataflow_runner:2021-03-18T07:21:51.949Z: JOB_MESSAGE_BASIC: Finished operation read/ReadFromBigQuery/Read+read/ReadFromBigQuery/_PassThroughThenCleanup/ParDo(PassThrough)/ParDo(PassThrough)+write/Write/NativeWrite
INFO:apache_beam.runners.dataflow.dataflow_runner:2021-03-18T07:21:52.051Z: JOB_MESSAGE_DEBUG: Value "read/ReadFromBigQuery/_PassThroughThenCleanup/ParDo(PassThrough)/ParDo(PassThrough).cleanup_signal" materialized.
INFO:apache_beam.runners.dataflow.dataflow_runner:2021-03-18T07:21:52.136Z: JOB_MESSAGE_BASIC: Executing operation read/ReadFromBigQuery/_PassThroughThenCleanup/ParDo(RemoveExtractedFiles)/_UnpickledSideInput(ParDo(PassThrough).cleanup_signal.0)
INFO:apache_beam.runners.dataflow.dataflow_runner:2021-03-18T07:21:52.187Z: JOB_MESSAGE_BASIC: Finished operation read/ReadFromBigQuery/_PassThroughThenCleanup/ParDo(RemoveExtractedFiles)/_UnpickledSideInput(ParDo(PassThrough).cleanup_signal.0)
INFO:apache_beam.runners.dataflow.dataflow_runner:2021-03-18T07:21:52.246Z: JOB_MESSAGE_DEBUG: Value "read/ReadFromBigQuery/_PassThroughThenCleanup/ParDo(RemoveExtractedFiles)/_UnpickledSideInput(ParDo(PassThrough).cleanup_signal.0).output" materialized.
INFO:apache_beam.runners.dataflow.dataflow_runner:2021-03-18T07:21:52.319Z: JOB_MESSAGE_BASIC: Executing operation read/ReadFromBigQuery/_PassThroughThenCleanup/Create/Read+read/ReadFromBigQuery/_PassThroughThenCleanup/ParDo(RemoveExtractedFiles)/ParDo(RemoveExtractedFiles)
INFO:apache_beam.runners.dataflow.dataflow_runner:2021-03-18T07:21:54.115Z: JOB_MESSAGE_DETAILED: Autoscaling: Resized worker pool from 1 to 0.
INFO:apache_beam.runners.dataflow.dataflow_runner:2021-03-18T07:21:54.217Z: JOB_MESSAGE_BASIC: Worker pool stopped.
INFO:apache_beam.runners.dataflow.dataflow_runner:2021-03-18T07:21:54.272Z: JOB_MESSAGE_DEBUG: Tearing down pending resources...
INFO:apache_beam.runners.dataflow.dataflow_runner:2021-03-18T07:21:58.249Z: JOB_MESSAGE_BASIC: Finished operation read/ReadFromBigQuery/_PassThroughThenCleanup/Create/Read+read/ReadFromBigQuery/_PassThroughThenCleanup/ParDo(RemoveExtractedFiles)/ParDo(RemoveExtractedFiles)
INFO:apache_beam.runners.dataflow.dataflow_runner:2021-03-18T07:21:58.313Z: JOB_MESSAGE_DEBUG: Executing success step success3
INFO:apache_beam.runners.dataflow.dataflow_runner:2021-03-18T07:21:58.391Z: JOB_MESSAGE_DETAILED: Cleaning up.
INFO:apache_beam.runners.dataflow.dataflow_runner:2021-03-18T07:21:58.469Z: JOB_MESSAGE_DEBUG: Starting worker pool teardown.
INFO:apache_beam.runners.dataflow.dataflow_runner:2021-03-18T07:21:58.508Z: JOB_MESSAGE_BASIC: Stopping worker pool...
INFO:apache_beam.runners.dataflow.dataflow_runner:Job 2021-03-18_00_14_17-6247497781292351523 is in state JOB_STATE_DONE
INFO:apache_beam.runners.dataflow.dataflow_runner:2021-03-18T07:22:44.859Z: JOB_MESSAGE_DETAILED: Autoscaling: Resized worker pool from 1 to 0.
INFO:apache_beam.runners.dataflow.dataflow_runner:2021-03-18T07:22:44.898Z: JOB_MESSAGE_BASIC: Worker pool stopped.
INFO:apache_beam.runners.dataflow.dataflow_runner:2021-03-18T07:22:44.933Z: JOB_MESSAGE_DEBUG: Tearing down pending resources...
INFO:apache_beam.runners.dataflow.dataflow_runner:Job 2021-03-18_00_14_35-14235673357999207715 is in state JOB_STATE_DONE
INFO:apache_beam.io.gcp.tests.bigquery_matcher:Attempting to perform query SELECT fruit from `python_query_to_table_16160516585814.output_table`; to BQ
DEBUG:google.auth._default:Checking None for explicit credentials as part of auth process...
DEBUG:google.auth._default:Checking Cloud SDK credentials as part of auth process...
DEBUG:google.auth._default:Cloud SDK credentials not found on disk; not using them
DEBUG:google.auth._default:Checking for App Engine runtime as part of auth process...
DEBUG:google.auth._default:No App Engine library was found so cannot authentication via App Engine Identity Credentials.
DEBUG:google.auth.transport._http_client:Making request: GET http://169.254.169.254
DEBUG:google.auth.transport._http_client:Making request: GET http://metadata.google.internal/computeMetadata/v1/project/project-id
DEBUG:urllib3.util.retry:Converted retries value: 3 -> Retry(total=3, connect=None, read=None, redirect=None, status=None)
DEBUG:google.auth.transport.requests:Making request: GET http://metadata.google.internal/computeMetadata/v1/instance/service-accounts/default/?recursive=true
DEBUG:urllib3.connectionpool:Starting new HTTP connection (1): metadata.google.internal:80
DEBUG:urllib3.connectionpool:http://metadata.google.internal:80 "GET /computeMetadata/v1/instance/service-accounts/default/?recursive=true HTTP/1.1" 200 144
DEBUG:google.auth.transport.requests:Making request: GET http://metadata.google.internal/computeMetadata/v1/instance/service-accounts/844138762903-compute@developer.gserviceaccount.com/token?scopes=https%3A%2F%2Fwww.googleapis.com%2Fauth%2Fbigquery%2Chttps%3A%2F%2Fwww.googleapis.com%2Fauth%2Fcloud-platform
DEBUG:urllib3.connectionpool:http://metadata.google.internal:80 "GET /computeMetadata/v1/instance/service-accounts/844138762903-compute@developer.gserviceaccount.com/token?scopes=https%3A%2F%2Fwww.googleapis.com%2Fauth%2Fbigquery%2Chttps%3A%2F%2Fwww.googleapis.com%2Fauth%2Fcloud-platform HTTP/1.1" 200 244
DEBUG:urllib3.connectionpool:Starting new HTTPS connection (1): bigquery.googleapis.com:443
DEBUG:urllib3.connectionpool:https://bigquery.googleapis.com:443 "POST /bigquery/v2/projects/apache-beam-testing/jobs?prettyPrint=false HTTP/1.1" 200 None
DEBUG:urllib3.connectionpool:https://bigquery.googleapis.com:443 "GET /bigquery/v2/projects/apache-beam-testing/queries/34223508-df01-4758-a1b4-1da222f0c933?maxResults=0&location=US&prettyPrint=false HTTP/1.1" 200 None
DEBUG:urllib3.connectionpool:https://bigquery.googleapis.com:443 "GET /bigquery/v2/projects/apache-beam-testing/datasets/_7357fab0f784d2a7327ddbe81cdd1f4ca7e429cd/tables/anone3e7c45cfe4501c221f3460fad759d21d554097e/data?prettyPrint=false HTTP/1.1" 200 None
INFO:apache_beam.io.gcp.tests.bigquery_matcher:Read from given query (SELECT fruit from `python_query_to_table_16160516585814.output_table`;), total rows 2
INFO:apache_beam.io.gcp.tests.bigquery_matcher:Generate checksum: 158a8ea1c254fcf40d4ed3e7c0242c3ea0a29e72
DEBUG:google.auth._default:Checking None for explicit credentials as part of auth process...
DEBUG:google.auth._default:Checking Cloud SDK credentials as part of auth process...
DEBUG:google.auth._default:Cloud SDK credentials not found on disk; not using them
DEBUG:google.auth._default:Checking for App Engine runtime as part of auth process...
DEBUG:google.auth._default:No App Engine library was found so cannot authentication via App Engine Identity Credentials.
DEBUG:google.auth.transport._http_client:Making request: GET http://169.254.169.254
DEBUG:google.auth.transport._http_client:Making request: GET http://metadata.google.internal/computeMetadata/v1/project/project-id
DEBUG:urllib3.util.retry:Converted retries value: 3 -> Retry(total=3, connect=None, read=None, redirect=None, status=None)
DEBUG:google.auth.transport.requests:Making request: GET http://metadata.google.internal/computeMetadata/v1/instance/service-accounts/default/?recursive=true
DEBUG:urllib3.connectionpool:Starting new HTTP connection (1): metadata.google.internal:80
DEBUG:urllib3.connectionpool:http://metadata.google.internal:80 "GET /computeMetadata/v1/instance/service-accounts/default/?recursive=true HTTP/1.1" 200 144
DEBUG:google.auth.transport.requests:Making request: GET http://metadata.google.internal/computeMetadata/v1/instance/service-accounts/844138762903-compute@developer.gserviceaccount.com/token?scopes=https%3A%2F%2Fwww.googleapis.com%2Fauth%2Fbigquery%2Chttps%3A%2F%2Fwww.googleapis.com%2Fauth%2Fcloud-platform
DEBUG:urllib3.connectionpool:http://metadata.google.internal:80 "GET /computeMetadata/v1/instance/service-accounts/844138762903-compute@developer.gserviceaccount.com/token?scopes=https%3A%2F%2Fwww.googleapis.com%2Fauth%2Fbigquery%2Chttps%3A%2F%2Fwww.googleapis.com%2Fauth%2Fcloud-platform HTTP/1.1" 200 244
DEBUG:urllib3.connectionpool:Starting new HTTPS connection (1): bigquery.googleapis.com:443
DEBUG:urllib3.connectionpool:https://bigquery.googleapis.com:443 "DELETE /bigquery/v2/projects/apache-beam-testing/datasets/python_pubsub_bq_16160511707516?deleteContents=true&prettyPrint=false HTTP/1.1" 200 None
INFO:apache_beam.runners.dataflow.dataflow_runner:2021-03-18T07:26:41.960Z: JOB_MESSAGE_BASIC: Finished operation Create/Read+metrics+map_to_common_key+GroupByKey/Reify+GroupByKey/Write
INFO:apache_beam.runners.dataflow.dataflow_runner:2021-03-18T07:26:42.045Z: JOB_MESSAGE_BASIC: Executing operation GroupByKey/Close
INFO:apache_beam.runners.dataflow.dataflow_runner:2021-03-18T07:26:42.125Z: JOB_MESSAGE_BASIC: Finished operation GroupByKey/Close
INFO:apache_beam.runners.dataflow.dataflow_runner:2021-03-18T07:26:42.186Z: JOB_MESSAGE_BASIC: Executing operation GroupByKey/Read+GroupByKey/GroupByWindow+m_out
INFO:apache_beam.runners.dataflow.dataflow_runner:2021-03-18T07:26:51.441Z: JOB_MESSAGE_BASIC: Finished operation GroupByKey/Read+GroupByKey/GroupByWindow+m_out
INFO:apache_beam.runners.dataflow.dataflow_runner:2021-03-18T07:26:51.504Z: JOB_MESSAGE_DEBUG: Executing success step success11
INFO:apache_beam.runners.dataflow.dataflow_runner:2021-03-18T07:26:51.569Z: JOB_MESSAGE_DETAILED: Cleaning up.
INFO:apache_beam.runners.dataflow.dataflow_runner:2021-03-18T07:26:51.615Z: JOB_MESSAGE_DEBUG: Starting worker pool teardown.
INFO:apache_beam.runners.dataflow.dataflow_runner:2021-03-18T07:26:51.637Z: JOB_MESSAGE_BASIC: Stopping worker pool...
INFO:apache_beam.runners.dataflow.dataflow_runner:2021-03-18T07:27:50.507Z: JOB_MESSAGE_DETAILED: Autoscaling: Resized worker pool from 1 to 0.
INFO:apache_beam.runners.dataflow.dataflow_runner:2021-03-18T07:27:50.538Z: JOB_MESSAGE_BASIC: Worker pool stopped.
INFO:apache_beam.runners.dataflow.dataflow_runner:2021-03-18T07:27:50.570Z: JOB_MESSAGE_DEBUG: Tearing down pending resources...
INFO:apache_beam.runners.dataflow.dataflow_runner:Job 2021-03-18_00_18_46-7344247295745366709 is in state JOB_STATE_DONE
Worker logs: https://console.cloud.google.com/dataflow/jobs/us-central1/2021-03-17_23_06_43-11709157947495577191?project=apache-beam-testing
Worker logs: https://console.cloud.google.com/dataflow/jobs/us-central1/2021-03-17_23_20_43-10033536399865452716?project=apache-beam-testing
Worker logs: https://console.cloud.google.com/dataflow/jobs/us-central1/2021-03-17_23_30_09-6313058119908799337?project=apache-beam-testing
Worker logs: https://console.cloud.google.com/dataflow/jobs/us-central1/2021-03-17_23_38_53-823300961425338442?project=apache-beam-testing
Worker logs: https://console.cloud.google.com/dataflow/jobs/us-central1/2021-03-17_23_47_17-5761943403327742652?project=apache-beam-testing
Worker logs: https://console.cloud.google.com/dataflow/jobs/us-central1/2021-03-17_23_56_02-10450327175740497948?project=apache-beam-testing
Worker logs: https://console.cloud.google.com/dataflow/jobs/us-central1/2021-03-18_00_04_27-650637170086332507?project=apache-beam-testing
Worker logs: https://console.cloud.google.com/dataflow/jobs/us-central1/2021-03-18_00_14_04-11125393277616945329?project=apache-beam-testing
Worker logs: https://console.cloud.google.com/dataflow/jobs/us-central1/2021-03-17_23_06_42-6063146668225256271?project=apache-beam-testing
Worker logs: https://console.cloud.google.com/dataflow/jobs/us-central1/2021-03-17_23_27_07-17083193499805032363?project=apache-beam-testing
Worker logs: https://console.cloud.google.com/dataflow/jobs/us-central1/2021-03-17_23_36_07-3360412191967529362?project=apache-beam-testing
Worker logs: https://console.cloud.google.com/dataflow/jobs/us-central1/2021-03-17_23_44_47-4388591686195192222?project=apache-beam-testing
Worker logs: https://console.cloud.google.com/dataflow/jobs/us-central1/2021-03-17_23_53_42-15020361504103300071?project=apache-beam-testing
Worker logs: https://console.cloud.google.com/dataflow/jobs/us-central1/2021-03-18_00_02_12-9271867091556846701?project=apache-beam-testing
Worker logs: https://console.cloud.google.com/dataflow/jobs/us-central1/2021-03-18_00_10_30-3366023559692968432?project=apache-beam-testing
Worker logs: https://console.cloud.google.com/dataflow/jobs/us-central1/2021-03-17_23_06_39-5654601144684864423?project=apache-beam-testing
Worker logs: https://console.cloud.google.com/dataflow/jobs/us-central1/2021-03-17_23_18_31-6935886234198199495?project=apache-beam-testing
Worker logs: https://console.cloud.google.com/dataflow/jobs/us-central1/2021-03-17_23_28_23-2543179310479821298?project=apache-beam-testing
Worker logs: https://console.cloud.google.com/dataflow/jobs/us-central1/2021-03-17_23_38_26-17401172222733682290?project=apache-beam-testing
Worker logs: https://console.cloud.google.com/dataflow/jobs/us-central1/2021-03-17_23_46_57-17431743990558730922?project=apache-beam-testing
Worker logs: https://console.cloud.google.com/dataflow/jobs/us-central1/2021-03-17_23_55_19-11340859551683726153?project=apache-beam-testing
Worker logs: https://console.cloud.google.com/dataflow/jobs/us-central1/2021-03-18_00_04_21-15334758857993456772?project=apache-beam-testing
Worker logs: https://console.cloud.google.com/dataflow/jobs/us-central1/2021-03-18_00_12_26-3031729645534787795?project=apache-beam-testing
Worker logs: https://console.cloud.google.com/dataflow/jobs/us-central1/2021-03-17_23_06_34-1935139675349291177?project=apache-beam-testing
Worker logs: https://console.cloud.google.com/dataflow/jobs/us-central1/2021-03-17_23_26_28-1232225723582931916?project=apache-beam-testing
Worker logs: https://console.cloud.google.com/dataflow/jobs/us-central1/2021-03-17_23_36_16-554265750456002881?project=apache-beam-testing
Worker logs: https://console.cloud.google.com/dataflow/jobs/us-central1/2021-03-17_23_45_26-3978433884618816587?project=apache-beam-testing
Worker logs: https://console.cloud.google.com/dataflow/jobs/us-central1/2021-03-17_23_55_15-7653422436367361527?project=apache-beam-testing
Worker logs: https://console.cloud.google.com/dataflow/jobs/us-central1/2021-03-18_00_05_20-2035183687370102909?project=apache-beam-testing
Worker logs: https://console.cloud.google.com/dataflow/jobs/us-central1/2021-03-18_00_14_35-14235673357999207715?project=apache-beam-testing
Worker logs: https://console.cloud.google.com/dataflow/jobs/us-central1/2021-03-17_23_13_59-8018865437525836561?project=apache-beam-testing
Worker logs: https://console.cloud.google.com/dataflow/jobs/us-central1/2021-03-17_23_23_54-5716038641778852763?project=apache-beam-testing
Worker logs: https://console.cloud.google.com/dataflow/jobs/us-central1/2021-03-17_23_32_05-16068661677608321123?project=apache-beam-testing
Worker logs: https://console.cloud.google.com/dataflow/jobs/us-central1/2021-03-17_23_40_29-269811369252302041?project=apache-beam-testing
Worker logs: https://console.cloud.google.com/dataflow/jobs/us-central1/2021-03-17_23_49_48-12615097269763729735?project=apache-beam-testing
Worker logs: https://console.cloud.google.com/dataflow/jobs/us-central1/2021-03-18_00_06_24-13515130840068419965?project=apache-beam-testing
Worker logs: https://console.cloud.google.com/dataflow/jobs/us-central1/2021-03-17_23_06_39-4328909332871049295?project=apache-beam-testing
Worker logs: https://console.cloud.google.com/dataflow/jobs/us-central1/2021-03-17_23_16_20-1035943864513520289?project=apache-beam-testing
Worker logs: https://console.cloud.google.com/dataflow/jobs/us-central1/2021-03-17_23_26_43-5330576466850976086?project=apache-beam-testing
Worker logs: https://console.cloud.google.com/dataflow/jobs/us-central1/2021-03-17_23_37_29-6159452547752909960?project=apache-beam-testing
Worker logs: https://console.cloud.google.com/dataflow/jobs/us-central1/2021-03-17_23_46_19-607267402400607246?project=apache-beam-testing
Worker logs: https://console.cloud.google.com/dataflow/jobs/us-central1/2021-03-17_23_55_08-5615801547908579811?project=apache-beam-testing
Worker logs: https://console.cloud.google.com/dataflow/jobs/us-central1/2021-03-18_00_02_32-1733422815481432023?project=apache-beam-testing
Worker logs: https://console.cloud.google.com/dataflow/jobs/us-central1/2021-03-18_00_10_35-7000396105017429503?project=apache-beam-testing
Worker logs: https://console.cloud.google.com/dataflow/jobs/us-central1/2021-03-18_00_18_46-7344247295745366709?project=apache-beam-testing
Worker logs: https://console.cloud.google.com/dataflow/jobs/us-central1/2021-03-17_23_06_45-6774641710171729549?project=apache-beam-testing
Worker logs: https://console.cloud.google.com/dataflow/jobs/us-central1/2021-03-17_23_15_50-9888716103230142954?project=apache-beam-testing
Worker logs: https://console.cloud.google.com/dataflow/jobs/us-central1/2021-03-17_23_26_32-10327544600658856959?project=apache-beam-testing
Worker logs: https://console.cloud.google.com/dataflow/jobs/us-central1/2021-03-17_23_37_03-13821940308014619125?project=apache-beam-testing
Worker logs: https://console.cloud.google.com/dataflow/jobs/us-central1/2021-03-17_23_45_53-6997378006718614199?project=apache-beam-testing
Worker logs: https://console.cloud.google.com/dataflow/jobs/us-central1/2021-03-17_23_55_20-7453219530097325909?project=apache-beam-testing
Worker logs: https://console.cloud.google.com/dataflow/jobs/us-central1/2021-03-18_00_05_01-1637719930826792638?project=apache-beam-testing
Worker logs: https://console.cloud.google.com/dataflow/jobs/us-central1/2021-03-18_00_14_17-6247497781292351523?project=apache-beam-testing
Worker logs: https://console.cloud.google.com/dataflow/jobs/us-central1/2021-03-17_23_06_39-1216710517692784635?project=apache-beam-testing
Worker logs: https://console.cloud.google.com/dataflow/jobs/us-central1/2021-03-17_23_16_15-12925371652828414451?project=apache-beam-testing
Worker logs: https://console.cloud.google.com/dataflow/jobs/us-central1/2021-03-17_23_26_00-9696051559720542356?project=apache-beam-testing
Worker logs: https://console.cloud.google.com/dataflow/jobs/us-central1/2021-03-17_23_34_21-4994478453812626205?project=apache-beam-testing
Worker logs: https://console.cloud.google.com/dataflow/jobs/us-central1/2021-03-17_23_42_57-5922749915757927840?project=apache-beam-testing
Worker logs: https://console.cloud.google.com/dataflow/jobs/us-central1/2021-03-17_23_51_07-10683982840185193617?project=apache-beam-testing
Worker logs: https://console.cloud.google.com/dataflow/jobs/us-central1/2021-03-18_00_00_29-1524461903785950488?project=apache-beam-testing
Worker logs: https://console.cloud.google.com/dataflow/jobs/us-central1/2021-03-18_00_10_09-1197630641992410268?project=apache-beam-testing
test_bigquery_tornadoes_it (apache_beam.examples.cookbook.bigquery_tornadoes_it_test.BigqueryTornadoesIT) ... ok
test_datastore_wordcount_it (apache_beam.examples.cookbook.datastore_wordcount_it_test.DatastoreWordCountIT) ... ok
test_streaming_wordcount_debugging_it (apache_beam.examples.streaming_wordcount_debugging_it_test.StreamingWordcountDebuggingIT) ... SKIP: Skipped due to [BEAM-3377]: assert_that not working for streaming
test_autocomplete_it (apache_beam.examples.complete.autocomplete_test.AutocompleteTest) ... ok
test_leader_board_it (apache_beam.examples.complete.game.leader_board_it_test.LeaderBoardIT) ... ok
test_game_stats_it (apache_beam.examples.complete.game.game_stats_it_test.GameStatsIT) ... ok
test_run_example_with_setup_file (apache_beam.examples.complete.juliaset.juliaset.juliaset_test_it.JuliaSetTestIT) ... ok
test_streaming_wordcount_it (apache_beam.examples.streaming_wordcount_it_test.StreamingWordCountIT) ... ok
test_user_score_it (apache_beam.examples.complete.game.user_score_it_test.UserScoreIT) ... ok
test_wordcount_fnapi_it (apache_beam.examples.wordcount_it_test.WordCountIT) ... ok
test_hourly_team_score_it (apache_beam.examples.complete.game.hourly_team_score_it_test.HourlyTeamScoreIT) ... ok
test_wordcount_it (apache_beam.examples.wordcount_it_test.WordCountIT) ... ok
test_avro_it (apache_beam.examples.fastavro_it_test.FastavroIT) ... ok
test_read_queries (apache_beam.io.gcp.bigquery_read_it_test.ReadAllBQTests) ... ok
test_read_via_sql (apache_beam.io.gcp.experimental.spannerio_read_it_test.SpannerReadIntegrationTest) ... ok
test_read_via_table (apache_beam.io.gcp.experimental.spannerio_read_it_test.SpannerReadIntegrationTest) ... ok
test_bigquery_read_1M_python (apache_beam.io.gcp.bigquery_io_read_it_test.BigqueryIOReadIT) ... ok
test_bigquery_read_custom_1M_python (apache_beam.io.gcp.bigquery_io_read_it_test.BigqueryIOReadIT) ... ok
test_bqfl_streaming (apache_beam.io.gcp.bigquery_file_loads_test.BigQueryFileLoadsIT) ... SKIP: TestStream is not supported on TestDataflowRunner
test_multiple_destinations_transform (apache_beam.io.gcp.bigquery_file_loads_test.BigQueryFileLoadsIT) ... ok
test_one_job_fails_all_jobs_fail (apache_beam.io.gcp.bigquery_file_loads_test.BigQueryFileLoadsIT) ... ok
test_avro_file_load (apache_beam.io.gcp.bigquery_test.BigQueryFileLoadsIntegrationTests) ... ok
test_spanner_error (apache_beam.io.gcp.experimental.spannerio_write_it_test.SpannerWriteIntegrationTest) ... ok
test_spanner_update (apache_beam.io.gcp.experimental.spannerio_write_it_test.SpannerWriteIntegrationTest) ... ok
test_write_batches (apache_beam.io.gcp.experimental.spannerio_write_it_test.SpannerWriteIntegrationTest) ... ok
test_multiple_destinations_transform (apache_beam.io.gcp.bigquery_test.BigQueryStreamingInsertTransformIntegrationTests) ... ok
test_iobase_source (apache_beam.io.gcp.bigquery_read_it_test.ReadNewTypesTests) ... ok
test_native_source (apache_beam.io.gcp.bigquery_read_it_test.ReadNewTypesTests) ... ok
test_value_provider_transform (apache_beam.io.gcp.bigquery_test.BigQueryStreamingInsertTransformIntegrationTests) ... ok
test_iobase_source (apache_beam.io.gcp.bigquery_read_it_test.ReadTests) ... ok
test_native_source (apache_beam.io.gcp.bigquery_read_it_test.ReadTests) ... ok
test_copy (apache_beam.io.gcp.gcsio_integration_test.GcsIOIntegrationTest) ... ok
test_copy_batch (apache_beam.io.gcp.gcsio_integration_test.GcsIOIntegrationTest) ... ok
test_copy_batch_kms (apache_beam.io.gcp.gcsio_integration_test.GcsIOIntegrationTest) ... ok
test_copy_batch_rewrite_token (apache_beam.io.gcp.gcsio_integration_test.GcsIOIntegrationTest) ... ok
test_copy_kms (apache_beam.io.gcp.gcsio_integration_test.GcsIOIntegrationTest) ... ok
test_copy_rewrite_token (apache_beam.io.gcp.gcsio_integration_test.GcsIOIntegrationTest) ... ok
test_transform_on_gcs (apache_beam.io.fileio_test.MatchIntegrationTest) ... ok
test_datastore_write_limit (apache_beam.io.gcp.datastore.v1new.datastore_write_it_test.DatastoreWriteIT) ... ok
test_parquetio_it (apache_beam.io.parquetio_it_test.TestParquetIT) ... ok
test_dicom_search_instances (apache_beam.io.gcp.dicomio_integration_test.DICOMIoIntegrationTest) ... ok
test_dicom_store_instance_from_gcs (apache_beam.io.gcp.dicomio_integration_test.DICOMIoIntegrationTest) ... ok
test_streaming_data_only (apache_beam.io.gcp.pubsub_integration_test.PubSubIntegrationTest) ... ok
test_streaming_with_attributes (apache_beam.io.gcp.pubsub_integration_test.PubSubIntegrationTest) ... ok
test_analyzing_syntax (apache_beam.ml.gcp.naturallanguageml_test_it.NaturalLanguageMlTestIT) ... ok
test_label_detection_with_video_context (apache_beam.ml.gcp.videointelligenceml_test_it.VideoIntelligenceMlTestIT) ... ok
test_text_detection_with_language_hint (apache_beam.ml.gcp.visionml_test_it.VisionMlTestIT) ... ok
test_basic_execution (apache_beam.testing.test_stream_it_test.TestStreamIntegrationTests) ... SKIP: The "TestDataflowRunner", does not support the TestStream transform. Supported runners: ['DirectRunner', 'SwitchingDirectRunner']
Tests that the TestStream supports emitting to multiple PCollections. ... SKIP: The "TestDataflowRunner", does not support the TestStream transform. Supported runners: ['DirectRunner', 'SwitchingDirectRunner']
Tests that the TestStream can independently control output watermarks. ... SKIP: The "TestDataflowRunner", does not support the TestStream transform. Supported runners: ['DirectRunner', 'SwitchingDirectRunner']
test_big_query_write (apache_beam.io.gcp.bigquery_write_it_test.BigQueryWriteIntegrationTests) ... ok
test_big_query_write_new_types (apache_beam.io.gcp.bigquery_write_it_test.BigQueryWriteIntegrationTests) ... ok
test_big_query_write_schema_autodetect (apache_beam.io.gcp.bigquery_write_it_test.BigQueryWriteIntegrationTests) ... SKIP: DataflowRunner does not support schema autodetection
test_big_query_write_without_schema (apache_beam.io.gcp.bigquery_write_it_test.BigQueryWriteIntegrationTests) ... ok
test_deidentification (apache_beam.ml.gcp.cloud_dlp_it_test.CloudDLPIT) ... ok
test_inspection (apache_beam.ml.gcp.cloud_dlp_it_test.CloudDLPIT) ... ok
Runs streaming Dataflow job and verifies that user metrics are reported ... ok
test_job_python_from_python_it (apache_beam.transforms.external_it_test.ExternalTransformIT) ... ok
test_big_query_legacy_sql (apache_beam.io.gcp.big_query_query_to_table_it_test.BigQueryQueryToTableIT) ... ok
test_big_query_new_types (apache_beam.io.gcp.big_query_query_to_table_it_test.BigQueryQueryToTableIT) ... ok
test_big_query_new_types_avro (apache_beam.io.gcp.big_query_query_to_table_it_test.BigQueryQueryToTableIT) ... ok
test_big_query_new_types_native (apache_beam.io.gcp.big_query_query_to_table_it_test.BigQueryQueryToTableIT) ... ok
test_big_query_standard_sql (apache_beam.io.gcp.big_query_query_to_table_it_test.BigQueryQueryToTableIT) ... ok
test_big_query_standard_sql_kms_key_native (apache_beam.io.gcp.big_query_query_to_table_it_test.BigQueryQueryToTableIT) ... ok
test_file_loads (apache_beam.io.gcp.bigquery_test.PubSubBigQueryIT) ... ok
test_streaming_inserts (apache_beam.io.gcp.bigquery_test.PubSubBigQueryIT) ... ok
test_metrics_fnapi_it (apache_beam.runners.dataflow.dataflow_exercise_metrics_pipeline_test.ExerciseMetricsPipelineTest) ... ok
test_metrics_it (apache_beam.runners.dataflow.dataflow_exercise_metrics_pipeline_test.ExerciseMetricsPipelineTest) ... ok

----------------------------------------------------------------------
XML: nosetests-postCommitIT-df-py38.xml
----------------------------------------------------------------------
XML: <https://ci-beam.apache.org/job/beam_PostCommit_Python38/ws/src/sdks/python/nosetests.xml>
----------------------------------------------------------------------
Ran 68 tests in 4953.450s

OK (SKIP=6)

FAILURE: Build failed with an exception.

* Where:
Script '<https://ci-beam.apache.org/job/beam_PostCommit_Python38/ws/src/sdks/python/test-suites/portable/common.gradle'> line: 197

* What went wrong:
Execution failed for task ':sdks:python:test-suites:portable:py38:postCommitPy38IT'.
> Process 'command 'sh'' finished with non-zero exit value 1

* Try:
Run with --stacktrace option to get the stack trace. Run with --info or --debug option to get more log output. Run with --scan to get full insights.

* Get more help at https://help.gradle.org

Deprecated Gradle features were used in this build, making it incompatible with Gradle 7.0.
Use '--warning-mode all' to show the individual deprecation warnings.
See https://docs.gradle.org/6.8/userguide/command_line_interface.html#sec:command_line_warnings

BUILD FAILED in 1h 27m 28s
206 actionable tasks: 161 executed, 41 from cache, 4 up-to-date
Gradle was unable to watch the file system for changes. The inotify watches limit is too low.

Publishing build scan...
https://gradle.com/s/jgz7tyhl3viry

Build step 'Invoke Gradle script' changed build result to FAILURE
Build step 'Invoke Gradle script' marked build as failure

---------------------------------------------------------------------
To unsubscribe, e-mail: builds-unsubscribe@beam.apache.org
For additional commands, e-mail: builds-help@beam.apache.org


Jenkins build is back to normal : beam_PostCommit_Python38 #988

Posted by Apache Jenkins Server <je...@builds.apache.org>.
See <https://ci-beam.apache.org/job/beam_PostCommit_Python38/988/display/redirect?page=changes>


---------------------------------------------------------------------
To unsubscribe, e-mail: builds-unsubscribe@beam.apache.org
For additional commands, e-mail: builds-help@beam.apache.org