You are viewing a plain text version of this content. The canonical link for it is here.
Posted to notifications@maven.apache.org by Apache Jenkins Server <je...@builds.apache.org> on 2017/12/11 10:50:45 UTC

maven-wip/maven/master - build #3 - null

See https://builds.apache.org/job/maven-wip/job/maven/job/master/3/

Build failed in Jenkins: Maven TLP (wip) » maven » master #15

Posted by Apache Jenkins Server <je...@builds.apache.org>.
See https://builds.apache.org/job/maven-wip/job/maven/job/master/15/

Changes:

* Noting INFRA-15651
* Typowq
* Ensure any forked Maven executions are not spied on by Jenkins

No tests ran.

Build log:
[...truncated 335.92 KB...]
    at java.lang.reflect.Method.invoke (Method.java:606)
    at org.codehaus.plexus.classworlds.launcher.Launcher.launchEnhanced (Launcher.java:289)
    at org.codehaus.plexus.classworlds.launcher.Launcher.launch (Launcher.java:229)
    at org.codehaus.plexus.classworlds.launcher.Launcher.mainWithExitCode (Launcher.java:415)
    at org.codehaus.plexus.classworlds.launcher.Launcher.main (Launcher.java:356)
Caused by: org.codehaus.plexus.component.configurator.ComponentConfigurationException: Cannot assign configuration entry 'environmentVariables' with value 'JENKINS_MAVEN_AGENT_DISABLED=true' of type java.lang.String to property of type java.util.Map
    at org.codehaus.plexus.component.configurator.converters.AbstractConfigurationConverter.failIfNotTypeCompatible (AbstractConfigurationConverter.java:100)
    at org.codehaus.plexus.component.configurator.converters.AbstractConfigurationConverter.fromExpression (AbstractConfigurationConverter.java:76)
    at org.codehaus.plexus.component.configurator.converters.composite.MapConverter.fromConfiguration (MapConverter.java:54)
    at org.eclipse.sisu.plexus.CompositeBeanHelper.convertProperty (CompositeBeanHelper.java:268)
    at org.eclipse.sisu.plexus.CompositeBeanHelper.setProperty (CompositeBeanHelper.java:174)
    at org.codehaus.plexus.component.configurator.converters.composite.ObjectWithFieldsConverter.processConfiguration (ObjectWithFieldsConverter.java:101)
    at org.codehaus.plexus.component.configurator.BasicComponentConfigurator.configureComponent (BasicComponentConfigurator.java:34)
    at org.apache.maven.plugin.internal.DefaultMavenPluginManager.populatePluginFields (DefaultMavenPluginManager.java:634)
    at org.apache.maven.plugin.internal.DefaultMavenPluginManager.getConfiguredMojo (DefaultMavenPluginManager.java:596)
    at org.apache.maven.plugin.DefaultBuildPluginManager.executeMojo (DefaultBuildPluginManager.java:121)
    at org.apache.maven.lifecycle.internal.MojoExecutor.execute (MojoExecutor.java:208)
    at org.apache.maven.lifecycle.internal.MojoExecutor.execute (MojoExecutor.java:154)
    at org.apache.maven.lifecycle.internal.MojoExecutor.execute (MojoExecutor.java:146)
    at org.apache.maven.lifecycle.internal.LifecycleModuleBuilder.buildProject (LifecycleModuleBuilder.java:117)
    at org.apache.maven.lifecycle.internal.LifecycleModuleBuilder.buildProject (LifecycleModuleBuilder.java:81)
    at org.apache.maven.lifecycle.internal.builder.singlethreaded.SingleThreadedBuilder.build (SingleThreadedBuilder.java:51)
    at org.apache.maven.lifecycle.internal.LifecycleStarter.execute (LifecycleStarter.java:128)
    at org.apache.maven.DefaultMaven.doExecute (DefaultMaven.java:309)
    at org.apache.maven.DefaultMaven.doExecute (DefaultMaven.java:194)
    at org.apache.maven.DefaultMaven.execute (DefaultMaven.java:107)
    at org.apache.maven.cli.MavenCli.execute (MavenCli.java:955)
    at org.apache.maven.cli.MavenCli.doMain (MavenCli.java:290)
    at org.apache.maven.cli.MavenCli.main (MavenCli.java:194)
    at sun.reflect.NativeMethodAccessorImpl.invoke0 (Native Method)
    at sun.reflect.NativeMethodAccessorImpl.invoke (NativeMethodAccessorImpl.java:57)
    at sun.reflect.DelegatingMethodAccessorImpl.invoke (DelegatingMethodAccessorImpl.java:43)
    at java.lang.reflect.Method.invoke (Method.java:606)
    at org.codehaus.plexus.classworlds.launcher.Launcher.launchEnhanced (Launcher.java:289)
    at org.codehaus.plexus.classworlds.launcher.Launcher.launch (Launcher.java:229)
    at org.codehaus.plexus.classworlds.launcher.Launcher.mainWithExitCode (Launcher.java:415)
    at org.codehaus.plexus.classworlds.launcher.Launcher.main (Launcher.java:356)
[ERROR] Failed to execute goal org.apache.maven.plugins:maven-surefire-plugin:2.18.1:test (default-test) on project maven-repository-metadata: Unable to parse configuration of mojo org.apache.maven.plugins:maven-surefire-plugin:2.18.1:test for parameter environmentVariables: Cannot assign configuration entry 'environmentVariables' with value 'JENKINS_MAVEN_AGENT_DISABLED=true' of type java.lang.String to property of type java.util.Map -> [Help 1]
org.apache.maven.lifecycle.LifecycleExecutionException: Failed to execute goal org.apache.maven.plugins:maven-surefire-plugin:2.18.1:test (default-test) on project maven-repository-metadata: Unable to parse configuration of mojo org.apache.maven.plugins:maven-surefire-plugin:2.18.1:test for parameter environmentVariables: Cannot assign configuration entry 'environmentVariables' with value 'JENKINS_MAVEN_AGENT_DISABLED=true' of type java.lang.String to property of type java.util.Map
    at org.apache.maven.lifecycle.internal.MojoExecutor.execute (MojoExecutor.java:213)
    at org.apache.maven.lifecycle.internal.MojoExecutor.execute (MojoExecutor.java:154)
    at org.apache.maven.lifecycle.internal.MojoExecutor.execute (MojoExecutor.java:146)
    at org.apache.maven.lifecycle.internal.LifecycleModuleBuilder.buildProject (LifecycleModuleBuilder.java:117)
    at org.apache.maven.lifecycle.internal.LifecycleModuleBuilder.buildProject (LifecycleModuleBuilder.java:81)
    at org.apache.maven.lifecycle.internal.builder.singlethreaded.SingleThreadedBuilder.build (SingleThreadedBuilder.java:51)
    at org.apache.maven.lifecycle.internal.LifecycleStarter.execute (LifecycleStarter.java:128)
    at org.apache.maven.DefaultMaven.doExecute (DefaultMaven.java:309)
    at org.apache.maven.DefaultMaven.doExecute (DefaultMaven.java:194)
    at org.apache.maven.DefaultMaven.execute (DefaultMaven.java:107)
    at org.apache.maven.cli.MavenCli.execute (MavenCli.java:955)
    at org.apache.maven.cli.MavenCli.doMain (MavenCli.java:290)
    at org.apache.maven.cli.MavenCli.main (MavenCli.java:194)
    at sun.reflect.NativeMethodAccessorImpl.invoke0 (Native Method)
    at sun.reflect.NativeMethodAccessorImpl.invoke (NativeMethodAccessorImpl.java:57)
    at sun.reflect.DelegatingMethodAccessorImpl.invoke (DelegatingMethodAccessorImpl.java:43)
    at java.lang.reflect.Method.invoke (Method.java:606)
    at org.codehaus.plexus.classworlds.launcher.Launcher.launchEnhanced (Launcher.java:289)
    at org.codehaus.plexus.classworlds.launcher.Launcher.launch (Launcher.java:229)
    at org.codehaus.plexus.classworlds.launcher.Launcher.mainWithExitCode (Launcher.java:415)
    at org.codehaus.plexus.classworlds.launcher.Launcher.main (Launcher.java:356)
Caused by: org.apache.maven.plugin.PluginConfigurationException: Unable to parse configuration of mojo org.apache.maven.plugins:maven-surefire-plugin:2.18.1:test for parameter environmentVariables: Cannot assign configuration entry 'environmentVariables' with value 'JENKINS_MAVEN_AGENT_DISABLED=true' of type java.lang.String to property of type java.util.Map
    at org.apache.maven.plugin.internal.DefaultMavenPluginManager.populatePluginFields (DefaultMavenPluginManager.java:664)
    at org.apache.maven.plugin.internal.DefaultMavenPluginManager.getConfiguredMojo (DefaultMavenPluginManager.java:596)
    at org.apache.maven.plugin.DefaultBuildPluginManager.executeMojo (DefaultBuildPluginManager.java:121)
    at org.apache.maven.lifecycle.internal.MojoExecutor.execute (MojoExecutor.java:208)
    at org.apache.maven.lifecycle.internal.MojoExecutor.execute (MojoExecutor.java:154)
    at org.apache.maven.lifecycle.internal.MojoExecutor.execute (MojoExecutor.java:146)
    at org.apache.maven.lifecycle.internal.LifecycleModuleBuilder.buildProject (LifecycleModuleBuilder.java:117)
    at org.apache.maven.lifecycle.internal.LifecycleModuleBuilder.buildProject (LifecycleModuleBuilder.java:81)
    at org.apache.maven.lifecycle.internal.builder.singlethreaded.SingleThreadedBuilder.build (SingleThreadedBuilder.java:51)
    at org.apache.maven.lifecycle.internal.LifecycleStarter.execute (LifecycleStarter.java:128)
    at org.apache.maven.DefaultMaven.doExecute (DefaultMaven.java:309)
    at org.apache.maven.DefaultMaven.doExecute (DefaultMaven.java:194)
    at org.apache.maven.DefaultMaven.execute (DefaultMaven.java:107)
    at org.apache.maven.cli.MavenCli.execute (MavenCli.java:955)
    at org.apache.maven.cli.MavenCli.doMain (MavenCli.java:290)
    at org.apache.maven.cli.MavenCli.main (MavenCli.java:194)
    at sun.reflect.NativeMethodAccessorImpl.invoke0 (Native Method)
    at sun.reflect.NativeMethodAccessorImpl.invoke (NativeMethodAccessorImpl.java:57)
    at sun.reflect.DelegatingMethodAccessorImpl.invoke (DelegatingMethodAccessorImpl.java:43)
    at java.lang.reflect.Method.invoke (Method.java:606)
    at org.codehaus.plexus.classworlds.launcher.Launcher.launchEnhanced (Launcher.java:289)
    at org.codehaus.plexus.classworlds.launcher.Launcher.launch (Launcher.java:229)
    at org.codehaus.plexus.classworlds.launcher.Launcher.mainWithExitCode (Launcher.java:415)
    at org.codehaus.plexus.classworlds.launcher.Launcher.main (Launcher.java:356)
Caused by: org.codehaus.plexus.component.configurator.ComponentConfigurationException: Cannot assign configuration entry 'environmentVariables' with value 'JENKINS_MAVEN_AGENT_DISABLED=true' of type java.lang.String to property of type java.util.Map
    at org.codehaus.plexus.component.configurator.converters.AbstractConfigurationConverter.failIfNotTypeCompatible (AbstractConfigurationConverter.java:100)
    at org.codehaus.plexus.component.configurator.converters.AbstractConfigurationConverter.fromExpression (AbstractConfigurationConverter.java:76)
    at org.codehaus.plexus.component.configurator.converters.composite.MapConverter.fromConfiguration (MapConverter.java:54)
    at org.eclipse.sisu.plexus.CompositeBeanHelper.convertProperty (CompositeBeanHelper.java:268)
    at org.eclipse.sisu.plexus.CompositeBeanHelper.setProperty (CompositeBeanHelper.java:174)
    at org.codehaus.plexus.component.configurator.converters.composite.ObjectWithFieldsConverter.processConfiguration (ObjectWithFieldsConverter.java:101)
    at org.codehaus.plexus.component.configurator.BasicComponentConfigurator.configureComponent (BasicComponentConfigurator.java:34)
    at org.apache.maven.plugin.internal.DefaultMavenPluginManager.populatePluginFields (DefaultMavenPluginManager.java:634)
    at org.apache.maven.plugin.internal.DefaultMavenPluginManager.getConfiguredMojo (DefaultMavenPluginManager.java:596)
    at org.apache.maven.plugin.DefaultBuildPluginManager.executeMojo (DefaultBuildPluginManager.java:121)
    at org.apache.maven.lifecycle.internal.MojoExecutor.execute (MojoExecutor.java:208)
    at org.apache.maven.lifecycle.internal.MojoExecutor.execute (MojoExecutor.java:154)
    at org.apache.maven.lifecycle.internal.MojoExecutor.execute (MojoExecutor.java:146)
    at org.apache.maven.lifecycle.internal.LifecycleModuleBuilder.buildProject (LifecycleModuleBuilder.java:117)
    at org.apache.maven.lifecycle.internal.LifecycleModuleBuilder.buildProject (LifecycleModuleBuilder.java:81)
    at org.apache.maven.lifecycle.internal.builder.singlethreaded.SingleThreadedBuilder.build (SingleThreadedBuilder.java:51)
    at org.apache.maven.lifecycle.internal.LifecycleStarter.execute (LifecycleStarter.java:128)
    at org.apache.maven.DefaultMaven.doExecute (DefaultMaven.java:309)
    at org.apache.maven.DefaultMaven.doExecute (DefaultMaven.java:194)
    at org.apache.maven.DefaultMaven.execute (DefaultMaven.java:107)
    at org.apache.maven.cli.MavenCli.execute (MavenCli.java:955)
    at org.apache.maven.cli.MavenCli.doMain (MavenCli.java:290)
    at org.apache.maven.cli.MavenCli.main (MavenCli.java:194)
    at sun.reflect.NativeMethodAccessorImpl.invoke0 (Native Method)
    at sun.reflect.NativeMethodAccessorImpl.invoke (NativeMethodAccessorImpl.java:57)
    at sun.reflect.DelegatingMethodAccessorImpl.invoke (DelegatingMethodAccessorImpl.java:43)
    at java.lang.reflect.Method.invoke (Method.java:606)
    at org.codehaus.plexus.classworlds.launcher.Launcher.launchEnhanced (Launcher.java:289)
    at org.codehaus.plexus.classworlds.launcher.Launcher.launch (Launcher.java:229)
    at org.codehaus.plexus.classworlds.launcher.Launcher.mainWithExitCode (Launcher.java:415)
    at org.codehaus.plexus.classworlds.launcher.Launcher.main (Launcher.java:356)
[ERROR] Failed to execute goal org.apache.maven.plugins:maven-surefire-plugin:2.18.1:test (default-test) on project maven-slf4j-provider: Unable to parse configuration of mojo org.apache.maven.plugins:maven-surefire-plugin:2.18.1:test for parameter environmentVariables: Cannot assign configuration entry 'environmentVariables' with value 'JENKINS_MAVEN_AGENT_DISABLED=true' of type java.lang.String to property of type java.util.Map -> [Help 1]
org.apache.maven.lifecycle.LifecycleExecutionException: Failed to execute goal org.apache.maven.plugins:maven-surefire-plugin:2.18.1:test (default-test) on project maven-slf4j-provider: Unable to parse configuration of mojo org.apache.maven.plugins:maven-surefire-plugin:2.18.1:test for parameter environmentVariables: Cannot assign configuration entry 'environmentVariables' with value 'JENKINS_MAVEN_AGENT_DISABLED=true' of type java.lang.String to property of type java.util.Map
    at org.apache.maven.lifecycle.internal.MojoExecutor.execute (MojoExecutor.java:213)
    at org.apache.maven.lifecycle.internal.MojoExecutor.execute (MojoExecutor.java:154)
    at org.apache.maven.lifecycle.internal.MojoExecutor.execute (MojoExecutor.java:146)
    at org.apache.maven.lifecycle.internal.LifecycleModuleBuilder.buildProject (LifecycleModuleBuilder.java:117)
    at org.apache.maven.lifecycle.internal.LifecycleModuleBuilder.buildProject (LifecycleModuleBuilder.java:81)
    at org.apache.maven.lifecycle.internal.builder.singlethreaded.SingleThreadedBuilder.build (SingleThreadedBuilder.java:51)
    at org.apache.maven.lifecycle.internal.LifecycleStarter.execute (LifecycleStarter.java:128)
    at org.apache.maven.DefaultMaven.doExecute (DefaultMaven.java:309)
    at org.apache.maven.DefaultMaven.doExecute (DefaultMaven.java:194)
    at org.apache.maven.DefaultMaven.execute (DefaultMaven.java:107)
    at org.apache.maven.cli.MavenCli.execute (MavenCli.java:955)
    at org.apache.maven.cli.MavenCli.doMain (MavenCli.java:290)
    at org.apache.maven.cli.MavenCli.main (MavenCli.java:194)
    at sun.reflect.NativeMethodAccessorImpl.invoke0 (Native Method)
    at sun.reflect.NativeMethodAccessorImpl.invoke (NativeMethodAccessorImpl.java:57)
    at sun.reflect.DelegatingMethodAccessorImpl.invoke (DelegatingMethodAccessorImpl.java:43)
    at java.lang.reflect.Method.invoke (Method.java:606)
    at org.codehaus.plexus.classworlds.launcher.Launcher.launchEnhanced (Launcher.java:289)
    at org.codehaus.plexus.classworlds.launcher.Launcher.launch (Launcher.java:229)
    at org.codehaus.plexus.classworlds.launcher.Launcher.mainWithExitCode (Launcher.java:415)
    at org.codehaus.plexus.classworlds.launcher.Launcher.main (Launcher.java:356)
Caused by: org.apache.maven.plugin.PluginConfigurationException: Unable to parse configuration of mojo org.apache.maven.plugins:maven-surefire-plugin:2.18.1:test for parameter environmentVariables: Cannot assign configuration entry 'environmentVariables' with value 'JENKINS_MAVEN_AGENT_DISABLED=true' of type java.lang.String to property of type java.util.Map
    at org.apache.maven.plugin.internal.DefaultMavenPluginManager.populatePluginFields (DefaultMavenPluginManager.java:664)
    at org.apache.maven.plugin.internal.DefaultMavenPluginManager.getConfiguredMojo (DefaultMavenPluginManager.java:596)
    at org.apache.maven.plugin.DefaultBuildPluginManager.executeMojo (DefaultBuildPluginManager.java:121)
    at org.apache.maven.lifecycle.internal.MojoExecutor.execute (MojoExecutor.java:208)
    at org.apache.maven.lifecycle.internal.MojoExecutor.execute (MojoExecutor.java:154)
    at org.apache.maven.lifecycle.internal.MojoExecutor.execute (MojoExecutor.java:146)
    at org.apache.maven.lifecycle.internal.LifecycleModuleBuilder.buildProject (LifecycleModuleBuilder.java:117)
    at org.apache.maven.lifecycle.internal.LifecycleModuleBuilder.buildProject (LifecycleModuleBuilder.java:81)
    at org.apache.maven.lifecycle.internal.builder.singlethreaded.SingleThreadedBuilder.build (SingleThreadedBuilder.java:51)
    at org.apache.maven.lifecycle.internal.LifecycleStarter.execute (LifecycleStarter.java:128)
    at org.apache.maven.DefaultMaven.doExecute (DefaultMaven.java:309)
    at org.apache.maven.DefaultMaven.doExecute (DefaultMaven.java:194)
    at org.apache.maven.DefaultMaven.execute (DefaultMaven.java:107)
    at org.apache.maven.cli.MavenCli.execute (MavenCli.java:955)
    at org.apache.maven.cli.MavenCli.doMain (MavenCli.java:290)
    at org.apache.maven.cli.MavenCli.main (MavenCli.java:194)
    at sun.reflect.NativeMethodAccessorImpl.invoke0 (Native Method)
    at sun.reflect.NativeMethodAccessorImpl.invoke (NativeMethodAccessorImpl.java:57)
    at sun.reflect.DelegatingMethodAccessorImpl.invoke (DelegatingMethodAccessorImpl.java:43)
    at java.lang.reflect.Method.invoke (Method.java:606)
    at org.codehaus.plexus.classworlds.launcher.Launcher.launchEnhanced (Launcher.java:289)
    at org.codehaus.plexus.classworlds.launcher.Launcher.launch (Launcher.java:229)
    at org.codehaus.plexus.classworlds.launcher.Launcher.mainWithExitCode (Launcher.java:415)
    at org.codehaus.plexus.classworlds.launcher.Launcher.main (Launcher.java:356)
Caused by: org.codehaus.plexus.component.configurator.ComponentConfigurationException: Cannot assign configuration entry 'environmentVariables' with value 'JENKINS_MAVEN_AGENT_DISABLED=true' of type java.lang.String to property of type java.util.Map
    at org.codehaus.plexus.component.configurator.converters.AbstractConfigurationConverter.failIfNotTypeCompatible (AbstractConfigurationConverter.java:100)
    at org.codehaus.plexus.component.configurator.converters.AbstractConfigurationConverter.fromExpression (AbstractConfigurationConverter.java:76)
    at org.codehaus.plexus.component.configurator.converters.composite.MapConverter.fromConfiguration (MapConverter.java:54)
    at org.eclipse.sisu.plexus.CompositeBeanHelper.convertProperty (CompositeBeanHelper.java:268)
    at org.eclipse.sisu.plexus.CompositeBeanHelper.setProperty (CompositeBeanHelper.java:174)
    at org.codehaus.plexus.component.configurator.converters.composite.ObjectWithFieldsConverter.processConfiguration (ObjectWithFieldsConverter.java:101)
    at org.codehaus.plexus.component.configurator.BasicComponentConfigurator.configureComponent (BasicComponentConfigurator.java:34)
    at org.apache.maven.plugin.internal.DefaultMavenPluginManager.populatePluginFields (DefaultMavenPluginManager.java:634)
    at org.apache.maven.plugin.internal.DefaultMavenPluginManager.getConfiguredMojo (DefaultMavenPluginManager.java:596)
    at org.apache.maven.plugin.DefaultBuildPluginManager.executeMojo (DefaultBuildPluginManager.java:121)
    at org.apache.maven.lifecycle.internal.MojoExecutor.execute (MojoExecutor.java:208)
    at org.apache.maven.lifecycle.internal.MojoExecutor.execute (MojoExecutor.java:154)
    at org.apache.maven.lifecycle.internal.MojoExecutor.execute (MojoExecutor.java:146)
    at org.apache.maven.lifecycle.internal.LifecycleModuleBuilder.buildProject (LifecycleModuleBuilder.java:117)
    at org.apache.maven.lifecycle.internal.LifecycleModuleBuilder.buildProject (LifecycleModuleBuilder.java:81)
    at org.apache.maven.lifecycle.internal.builder.singlethreaded.SingleThreadedBuilder.build (SingleThreadedBuilder.java:51)
    at org.apache.maven.lifecycle.internal.LifecycleStarter.execute (LifecycleStarter.java:128)
    at org.apache.maven.DefaultMaven.doExecute (DefaultMaven.java:309)
    at org.apache.maven.DefaultMaven.doExecute (DefaultMaven.java:194)
    at org.apache.maven.DefaultMaven.execute (DefaultMaven.java:107)
    at org.apache.maven.cli.MavenCli.execute (MavenCli.java:955)
    at org.apache.maven.cli.MavenCli.doMain (MavenCli.java:290)
    at org.apache.maven.cli.MavenCli.main (MavenCli.java:194)
    at sun.reflect.NativeMethodAccessorImpl.invoke0 (Native Method)
    at sun.reflect.NativeMethodAccessorImpl.invoke (NativeMethodAccessorImpl.java:57)
    at sun.reflect.DelegatingMethodAccessorImpl.invoke (DelegatingMethodAccessorImpl.java:43)
    at java.lang.reflect.Method.invoke (Method.java:606)
    at org.codehaus.plexus.classworlds.launcher.Launcher.launchEnhanced (Launcher.java:289)
    at org.codehaus.plexus.classworlds.launcher.Launcher.launch (Launcher.java:229)
    at org.codehaus.plexus.classworlds.launcher.Launcher.mainWithExitCode (Launcher.java:415)
    at org.codehaus.plexus.classworlds.launcher.Launcher.main (Launcher.java:356)
[ERROR] 
[ERROR] Re-run Maven using the -X switch to enable full debug logging.
[ERROR] 
[ERROR] For more information about the errors and possible solutions, please read the following articles:
[ERROR] [Help 1] http://cwiki.apache.org/confluence/display/MAVEN/PluginConfigurationException
[ERROR] 
[ERROR] After correcting the problems, you can resume the build with the command
[ERROR]   mvn <goals> -rf :maven-model
[Pipeline] }
[withMaven] artifactsPublisher - Archive artifact pom.xml under org/apache/maven/maven/3.5.3-SNAPSHOT/maven-3.5.3-SNAPSHOT.pom
[withMaven] artifactsPublisher - Archive artifact target/maven-3.5.3-SNAPSHOT-site.xml under org/apache/maven/maven/3.5.3-SNAPSHOT/maven-3.5.3-SNAPSHOT-site.xml
[Fast Archiver] No artifacts from Maven TLP (wip) » maven » master #2 to compare, so performing full copy of artifacts
[withMaven] junitPublisher - Archive test results for Maven artifact org.apache.maven:maven-model:3.5.3-SNAPSHOT generated by maven-surefire-plugin:test (default-test): maven-model/target/surefire-reports/*.xml
[withMaven] junitPublisher - Jenkins JUnit Attachments Plugin not found, can't publish test attachments.Recording test results
None of the test reports contained any result
[withMaven] junitPublisher - Archive test results for Maven artifact org.apache.maven:maven-artifact:3.5.3-SNAPSHOT generated by maven-surefire-plugin:test (default-test): maven-artifact/target/surefire-reports/*.xml
[withMaven] junitPublisher - Jenkins JUnit Attachments Plugin not found, can't publish test attachments.Recording test results
None of the test reports contained any result
[withMaven] junitPublisher - Archive test results for Maven artifact org.apache.maven:maven-builder-support:3.5.3-SNAPSHOT generated by maven-surefire-plugin:test (default-test): maven-builder-support/target/surefire-reports/*.xml
[withMaven] junitPublisher - Jenkins JUnit Attachments Plugin not found, can't publish test attachments.Recording test results
None of the test reports contained any result
[withMaven] junitPublisher - Archive test results for Maven artifact org.apache.maven:maven-settings:3.5.3-SNAPSHOT generated by maven-surefire-plugin:test (default-test): maven-settings/target/surefire-reports/*.xml
[withMaven] junitPublisher - Jenkins JUnit Attachments Plugin not found, can't publish test attachments.Recording test results
None of the test reports contained any result
[withMaven] junitPublisher - Archive test results for Maven artifact org.apache.maven:maven-repository-metadata:3.5.3-SNAPSHOT generated by maven-surefire-plugin:test (default-test): maven-repository-metadata/target/surefire-reports/*.xml
[withMaven] junitPublisher - Jenkins JUnit Attachments Plugin not found, can't publish test attachments.Recording test results
None of the test reports contained any result
[withMaven] junitPublisher - Archive test results for Maven artifact org.apache.maven:maven-slf4j-provider:3.5.3-SNAPSHOT generated by maven-surefire-plugin:test (default-test): maven-slf4j-provider/target/surefire-reports/*.xml
[withMaven] junitPublisher - Jenkins JUnit Attachments Plugin not found, can't publish test attachments.Recording test results
None of the test reports contained any result
[withMaven] openTasksPublisher - Scan Tasks for Maven artifact org.apache.maven:maven-model:3.5.3-SNAPSHOT in source directory maven-model/src/main/java
[withMaven] openTasksPublisher - Scan Tasks for Maven artifact org.apache.maven:maven-artifact:3.5.3-SNAPSHOT in source directory maven-artifact/src/main/java
[withMaven] openTasksPublisher - Scan Tasks for Maven artifact org.apache.maven:maven-builder-support:3.5.3-SNAPSHOT in source directory maven-builder-support/src/main/java
[withMaven] openTasksPublisher - Scan Tasks for Maven artifact org.apache.maven:maven-settings:3.5.3-SNAPSHOT in source directory maven-settings/src/main/java
[withMaven] openTasksPublisher - Scan Tasks for Maven artifact org.apache.maven:maven-slf4j-provider:3.5.3-SNAPSHOT in source directory maven-slf4j-provider/src/main/java
[TASKS] Scanning folder '/home/jenkins/jenkins-slave/workspace/maven-wip_maven_master-45H665RDJD4D5J5T6E2CHUCWKXNNABXP24O5RG44ZDYZYKW63GPQ/build' for files matching the pattern 'maven-model/src/main/java/**/*,maven-artifact/src/main/java/**/*,maven-builder-support/src/main/java/**/*,maven-settings/src/main/java/**/*,maven-slf4j-provider/src/main/java/**/*' - excludes: null
[TASKS] Found 44 files to scan for tasks
[TASKS] Found 9 open tasks.
Skipping warnings blame since pipelines do not have an SCM link.%n
[Pipeline] // withMaven
[Pipeline] }
[Pipeline] // stage
[Pipeline] }
[Pipeline] // dir
[Pipeline] }
[Pipeline] // node
[Pipeline] stage
[Pipeline] { (Notifications)
[Pipeline] echo
Build result: FAILURE
[Pipeline] jiraIssueSelector
[Pipeline] jiraComment

Build failed in Jenkins: Maven TLP (wip) » maven » master #14

Posted by Apache Jenkins Server <je...@builds.apache.org>.
See https://builds.apache.org/job/maven-wip/job/maven/job/master/14/

No changes.

No tests ran.

Build log:
[...truncated 335.26 KB...]
    at sun.reflect.DelegatingMethodAccessorImpl.invoke (DelegatingMethodAccessorImpl.java:43)
    at java.lang.reflect.Method.invoke (Method.java:606)
    at org.codehaus.plexus.classworlds.launcher.Launcher.launchEnhanced (Launcher.java:289)
    at org.codehaus.plexus.classworlds.launcher.Launcher.launch (Launcher.java:229)
    at org.codehaus.plexus.classworlds.launcher.Launcher.mainWithExitCode (Launcher.java:415)
    at org.codehaus.plexus.classworlds.launcher.Launcher.main (Launcher.java:356)
Caused by: org.codehaus.plexus.component.configurator.ComponentConfigurationException: Cannot assign configuration entry 'environmentVariables' with value 'JENKINS_MAVEN_AGENT_DISABLED=true' of type java.lang.String to property of type java.util.Map
    at org.codehaus.plexus.component.configurator.converters.AbstractConfigurationConverter.failIfNotTypeCompatible (AbstractConfigurationConverter.java:100)
    at org.codehaus.plexus.component.configurator.converters.AbstractConfigurationConverter.fromExpression (AbstractConfigurationConverter.java:76)
    at org.codehaus.plexus.component.configurator.converters.composite.MapConverter.fromConfiguration (MapConverter.java:54)
    at org.eclipse.sisu.plexus.CompositeBeanHelper.convertProperty (CompositeBeanHelper.java:268)
    at org.eclipse.sisu.plexus.CompositeBeanHelper.setProperty (CompositeBeanHelper.java:174)
    at org.codehaus.plexus.component.configurator.converters.composite.ObjectWithFieldsConverter.processConfiguration (ObjectWithFieldsConverter.java:101)
    at org.codehaus.plexus.component.configurator.BasicComponentConfigurator.configureComponent (BasicComponentConfigurator.java:34)
    at org.apache.maven.plugin.internal.DefaultMavenPluginManager.populatePluginFields (DefaultMavenPluginManager.java:634)
    at org.apache.maven.plugin.internal.DefaultMavenPluginManager.getConfiguredMojo (DefaultMavenPluginManager.java:596)
    at org.apache.maven.plugin.DefaultBuildPluginManager.executeMojo (DefaultBuildPluginManager.java:121)
    at org.apache.maven.lifecycle.internal.MojoExecutor.execute (MojoExecutor.java:208)
    at org.apache.maven.lifecycle.internal.MojoExecutor.execute (MojoExecutor.java:154)
    at org.apache.maven.lifecycle.internal.MojoExecutor.execute (MojoExecutor.java:146)
    at org.apache.maven.lifecycle.internal.LifecycleModuleBuilder.buildProject (LifecycleModuleBuilder.java:117)
    at org.apache.maven.lifecycle.internal.LifecycleModuleBuilder.buildProject (LifecycleModuleBuilder.java:81)
    at org.apache.maven.lifecycle.internal.builder.singlethreaded.SingleThreadedBuilder.build (SingleThreadedBuilder.java:51)
    at org.apache.maven.lifecycle.internal.LifecycleStarter.execute (LifecycleStarter.java:128)
    at org.apache.maven.DefaultMaven.doExecute (DefaultMaven.java:309)
    at org.apache.maven.DefaultMaven.doExecute (DefaultMaven.java:194)
    at org.apache.maven.DefaultMaven.execute (DefaultMaven.java:107)
    at org.apache.maven.cli.MavenCli.execute (MavenCli.java:955)
    at org.apache.maven.cli.MavenCli.doMain (MavenCli.java:290)
    at org.apache.maven.cli.MavenCli.main (MavenCli.java:194)
    at sun.reflect.NativeMethodAccessorImpl.invoke0 (Native Method)
    at sun.reflect.NativeMethodAccessorImpl.invoke (NativeMethodAccessorImpl.java:57)
    at sun.reflect.DelegatingMethodAccessorImpl.invoke (DelegatingMethodAccessorImpl.java:43)
    at java.lang.reflect.Method.invoke (Method.java:606)
    at org.codehaus.plexus.classworlds.launcher.Launcher.launchEnhanced (Launcher.java:289)
    at org.codehaus.plexus.classworlds.launcher.Launcher.launch (Launcher.java:229)
    at org.codehaus.plexus.classworlds.launcher.Launcher.mainWithExitCode (Launcher.java:415)
    at org.codehaus.plexus.classworlds.launcher.Launcher.main (Launcher.java:356)
[ERROR] Failed to execute goal org.apache.maven.plugins:maven-surefire-plugin:2.18.1:test (default-test) on project maven-repository-metadata: Unable to parse configuration of mojo org.apache.maven.plugins:maven-surefire-plugin:2.18.1:test for parameter environmentVariables: Cannot assign configuration entry 'environmentVariables' with value 'JENKINS_MAVEN_AGENT_DISABLED=true' of type java.lang.String to property of type java.util.Map -> [Help 1]
org.apache.maven.lifecycle.LifecycleExecutionException: Failed to execute goal org.apache.maven.plugins:maven-surefire-plugin:2.18.1:test (default-test) on project maven-repository-metadata: Unable to parse configuration of mojo org.apache.maven.plugins:maven-surefire-plugin:2.18.1:test for parameter environmentVariables: Cannot assign configuration entry 'environmentVariables' with value 'JENKINS_MAVEN_AGENT_DISABLED=true' of type java.lang.String to property of type java.util.Map
    at org.apache.maven.lifecycle.internal.MojoExecutor.execute (MojoExecutor.java:213)
    at org.apache.maven.lifecycle.internal.MojoExecutor.execute (MojoExecutor.java:154)
    at org.apache.maven.lifecycle.internal.MojoExecutor.execute (MojoExecutor.java:146)
    at org.apache.maven.lifecycle.internal.LifecycleModuleBuilder.buildProject (LifecycleModuleBuilder.java:117)
    at org.apache.maven.lifecycle.internal.LifecycleModuleBuilder.buildProject (LifecycleModuleBuilder.java:81)
    at org.apache.maven.lifecycle.internal.builder.singlethreaded.SingleThreadedBuilder.build (SingleThreadedBuilder.java:51)
    at org.apache.maven.lifecycle.internal.LifecycleStarter.execute (LifecycleStarter.java:128)
    at org.apache.maven.DefaultMaven.doExecute (DefaultMaven.java:309)
    at org.apache.maven.DefaultMaven.doExecute (DefaultMaven.java:194)
    at org.apache.maven.DefaultMaven.execute (DefaultMaven.java:107)
    at org.apache.maven.cli.MavenCli.execute (MavenCli.java:955)
    at org.apache.maven.cli.MavenCli.doMain (MavenCli.java:290)
    at org.apache.maven.cli.MavenCli.main (MavenCli.java:194)
    at sun.reflect.NativeMethodAccessorImpl.invoke0 (Native Method)
    at sun.reflect.NativeMethodAccessorImpl.invoke (NativeMethodAccessorImpl.java:57)
    at sun.reflect.DelegatingMethodAccessorImpl.invoke (DelegatingMethodAccessorImpl.java:43)
    at java.lang.reflect.Method.invoke (Method.java:606)
    at org.codehaus.plexus.classworlds.launcher.Launcher.launchEnhanced (Launcher.java:289)
    at org.codehaus.plexus.classworlds.launcher.Launcher.launch (Launcher.java:229)
    at org.codehaus.plexus.classworlds.launcher.Launcher.mainWithExitCode (Launcher.java:415)
    at org.codehaus.plexus.classworlds.launcher.Launcher.main (Launcher.java:356)
Caused by: org.apache.maven.plugin.PluginConfigurationException: Unable to parse configuration of mojo org.apache.maven.plugins:maven-surefire-plugin:2.18.1:test for parameter environmentVariables: Cannot assign configuration entry 'environmentVariables' with value 'JENKINS_MAVEN_AGENT_DISABLED=true' of type java.lang.String to property of type java.util.Map
    at org.apache.maven.plugin.internal.DefaultMavenPluginManager.populatePluginFields (DefaultMavenPluginManager.java:664)
    at org.apache.maven.plugin.internal.DefaultMavenPluginManager.getConfiguredMojo (DefaultMavenPluginManager.java:596)
    at org.apache.maven.plugin.DefaultBuildPluginManager.executeMojo (DefaultBuildPluginManager.java:121)
    at org.apache.maven.lifecycle.internal.MojoExecutor.execute (MojoExecutor.java:208)
    at org.apache.maven.lifecycle.internal.MojoExecutor.execute (MojoExecutor.java:154)
    at org.apache.maven.lifecycle.internal.MojoExecutor.execute (MojoExecutor.java:146)
    at org.apache.maven.lifecycle.internal.LifecycleModuleBuilder.buildProject (LifecycleModuleBuilder.java:117)
    at org.apache.maven.lifecycle.internal.LifecycleModuleBuilder.buildProject (LifecycleModuleBuilder.java:81)
    at org.apache.maven.lifecycle.internal.builder.singlethreaded.SingleThreadedBuilder.build (SingleThreadedBuilder.java:51)
    at org.apache.maven.lifecycle.internal.LifecycleStarter.execute (LifecycleStarter.java:128)
    at org.apache.maven.DefaultMaven.doExecute (DefaultMaven.java:309)
    at org.apache.maven.DefaultMaven.doExecute (DefaultMaven.java:194)
    at org.apache.maven.DefaultMaven.execute (DefaultMaven.java:107)
    at org.apache.maven.cli.MavenCli.execute (MavenCli.java:955)
    at org.apache.maven.cli.MavenCli.doMain (MavenCli.java:290)
    at org.apache.maven.cli.MavenCli.main (MavenCli.java:194)
    at sun.reflect.NativeMethodAccessorImpl.invoke0 (Native Method)
    at sun.reflect.NativeMethodAccessorImpl.invoke (NativeMethodAccessorImpl.java:57)
    at sun.reflect.DelegatingMethodAccessorImpl.invoke (DelegatingMethodAccessorImpl.java:43)
    at java.lang.reflect.Method.invoke (Method.java:606)
    at org.codehaus.plexus.classworlds.launcher.Launcher.launchEnhanced (Launcher.java:289)
    at org.codehaus.plexus.classworlds.launcher.Launcher.launch (Launcher.java:229)
    at org.codehaus.plexus.classworlds.launcher.Launcher.mainWithExitCode (Launcher.java:415)
    at org.codehaus.plexus.classworlds.launcher.Launcher.main (Launcher.java:356)
Caused by: org.codehaus.plexus.component.configurator.ComponentConfigurationException: Cannot assign configuration entry 'environmentVariables' with value 'JENKINS_MAVEN_AGENT_DISABLED=true' of type java.lang.String to property of type java.util.Map
    at org.codehaus.plexus.component.configurator.converters.AbstractConfigurationConverter.failIfNotTypeCompatible (AbstractConfigurationConverter.java:100)
    at org.codehaus.plexus.component.configurator.converters.AbstractConfigurationConverter.fromExpression (AbstractConfigurationConverter.java:76)
    at org.codehaus.plexus.component.configurator.converters.composite.MapConverter.fromConfiguration (MapConverter.java:54)
    at org.eclipse.sisu.plexus.CompositeBeanHelper.convertProperty (CompositeBeanHelper.java:268)
    at org.eclipse.sisu.plexus.CompositeBeanHelper.setProperty (CompositeBeanHelper.java:174)
    at org.codehaus.plexus.component.configurator.converters.composite.ObjectWithFieldsConverter.processConfiguration (ObjectWithFieldsConverter.java:101)
    at org.codehaus.plexus.component.configurator.BasicComponentConfigurator.configureComponent (BasicComponentConfigurator.java:34)
    at org.apache.maven.plugin.internal.DefaultMavenPluginManager.populatePluginFields (DefaultMavenPluginManager.java:634)
    at org.apache.maven.plugin.internal.DefaultMavenPluginManager.getConfiguredMojo (DefaultMavenPluginManager.java:596)
    at org.apache.maven.plugin.DefaultBuildPluginManager.executeMojo (DefaultBuildPluginManager.java:121)
    at org.apache.maven.lifecycle.internal.MojoExecutor.execute (MojoExecutor.java:208)
    at org.apache.maven.lifecycle.internal.MojoExecutor.execute (MojoExecutor.java:154)
    at org.apache.maven.lifecycle.internal.MojoExecutor.execute (MojoExecutor.java:146)
    at org.apache.maven.lifecycle.internal.LifecycleModuleBuilder.buildProject (LifecycleModuleBuilder.java:117)
    at org.apache.maven.lifecycle.internal.LifecycleModuleBuilder.buildProject (LifecycleModuleBuilder.java:81)
    at org.apache.maven.lifecycle.internal.builder.singlethreaded.SingleThreadedBuilder.build (SingleThreadedBuilder.java:51)
    at org.apache.maven.lifecycle.internal.LifecycleStarter.execute (LifecycleStarter.java:128)
    at org.apache.maven.DefaultMaven.doExecute (DefaultMaven.java:309)
    at org.apache.maven.DefaultMaven.doExecute (DefaultMaven.java:194)
    at org.apache.maven.DefaultMaven.execute (DefaultMaven.java:107)
    at org.apache.maven.cli.MavenCli.execute (MavenCli.java:955)
    at org.apache.maven.cli.MavenCli.doMain (MavenCli.java:290)
    at org.apache.maven.cli.MavenCli.main (MavenCli.java:194)
    at sun.reflect.NativeMethodAccessorImpl.invoke0 (Native Method)
    at sun.reflect.NativeMethodAccessorImpl.invoke (NativeMethodAccessorImpl.java:57)
    at sun.reflect.DelegatingMethodAccessorImpl.invoke (DelegatingMethodAccessorImpl.java:43)
    at java.lang.reflect.Method.invoke (Method.java:606)
    at org.codehaus.plexus.classworlds.launcher.Launcher.launchEnhanced (Launcher.java:289)
    at org.codehaus.plexus.classworlds.launcher.Launcher.launch (Launcher.java:229)
    at org.codehaus.plexus.classworlds.launcher.Launcher.mainWithExitCode (Launcher.java:415)
    at org.codehaus.plexus.classworlds.launcher.Launcher.main (Launcher.java:356)
[ERROR] Failed to execute goal org.apache.maven.plugins:maven-surefire-plugin:2.18.1:test (default-test) on project maven-slf4j-provider: Unable to parse configuration of mojo org.apache.maven.plugins:maven-surefire-plugin:2.18.1:test for parameter environmentVariables: Cannot assign configuration entry 'environmentVariables' with value 'JENKINS_MAVEN_AGENT_DISABLED=true' of type java.lang.String to property of type java.util.Map -> [Help 1]
org.apache.maven.lifecycle.LifecycleExecutionException: Failed to execute goal org.apache.maven.plugins:maven-surefire-plugin:2.18.1:test (default-test) on project maven-slf4j-provider: Unable to parse configuration of mojo org.apache.maven.plugins:maven-surefire-plugin:2.18.1:test for parameter environmentVariables: Cannot assign configuration entry 'environmentVariables' with value 'JENKINS_MAVEN_AGENT_DISABLED=true' of type java.lang.String to property of type java.util.Map
    at org.apache.maven.lifecycle.internal.MojoExecutor.execute (MojoExecutor.java:213)
    at org.apache.maven.lifecycle.internal.MojoExecutor.execute (MojoExecutor.java:154)
    at org.apache.maven.lifecycle.internal.MojoExecutor.execute (MojoExecutor.java:146)
    at org.apache.maven.lifecycle.internal.LifecycleModuleBuilder.buildProject (LifecycleModuleBuilder.java:117)
    at org.apache.maven.lifecycle.internal.LifecycleModuleBuilder.buildProject (LifecycleModuleBuilder.java:81)
    at org.apache.maven.lifecycle.internal.builder.singlethreaded.SingleThreadedBuilder.build (SingleThreadedBuilder.java:51)
    at org.apache.maven.lifecycle.internal.LifecycleStarter.execute (LifecycleStarter.java:128)
    at org.apache.maven.DefaultMaven.doExecute (DefaultMaven.java:309)
    at org.apache.maven.DefaultMaven.doExecute (DefaultMaven.java:194)
    at org.apache.maven.DefaultMaven.execute (DefaultMaven.java:107)
    at org.apache.maven.cli.MavenCli.execute (MavenCli.java:955)
    at org.apache.maven.cli.MavenCli.doMain (MavenCli.java:290)
    at org.apache.maven.cli.MavenCli.main (MavenCli.java:194)
    at sun.reflect.NativeMethodAccessorImpl.invoke0 (Native Method)
    at sun.reflect.NativeMethodAccessorImpl.invoke (NativeMethodAccessorImpl.java:57)
    at sun.reflect.DelegatingMethodAccessorImpl.invoke (DelegatingMethodAccessorImpl.java:43)
    at java.lang.reflect.Method.invoke (Method.java:606)
    at org.codehaus.plexus.classworlds.launcher.Launcher.launchEnhanced (Launcher.java:289)
    at org.codehaus.plexus.classworlds.launcher.Launcher.launch (Launcher.java:229)
    at org.codehaus.plexus.classworlds.launcher.Launcher.mainWithExitCode (Launcher.java:415)
    at org.codehaus.plexus.classworlds.launcher.Launcher.main (Launcher.java:356)
Caused by: org.apache.maven.plugin.PluginConfigurationException: Unable to parse configuration of mojo org.apache.maven.plugins:maven-surefire-plugin:2.18.1:test for parameter environmentVariables: Cannot assign configuration entry 'environmentVariables' with value 'JENKINS_MAVEN_AGENT_DISABLED=true' of type java.lang.String to property of type java.util.Map
    at org.apache.maven.plugin.internal.DefaultMavenPluginManager.populatePluginFields (DefaultMavenPluginManager.java:664)
    at org.apache.maven.plugin.internal.DefaultMavenPluginManager.getConfiguredMojo (DefaultMavenPluginManager.java:596)
    at org.apache.maven.plugin.DefaultBuildPluginManager.executeMojo (DefaultBuildPluginManager.java:121)
    at org.apache.maven.lifecycle.internal.MojoExecutor.execute (MojoExecutor.java:208)
    at org.apache.maven.lifecycle.internal.MojoExecutor.execute (MojoExecutor.java:154)
    at org.apache.maven.lifecycle.internal.MojoExecutor.execute (MojoExecutor.java:146)
    at org.apache.maven.lifecycle.internal.LifecycleModuleBuilder.buildProject (LifecycleModuleBuilder.java:117)
    at org.apache.maven.lifecycle.internal.LifecycleModuleBuilder.buildProject (LifecycleModuleBuilder.java:81)
    at org.apache.maven.lifecycle.internal.builder.singlethreaded.SingleThreadedBuilder.build (SingleThreadedBuilder.java:51)
    at org.apache.maven.lifecycle.internal.LifecycleStarter.execute (LifecycleStarter.java:128)
    at org.apache.maven.DefaultMaven.doExecute (DefaultMaven.java:309)
    at org.apache.maven.DefaultMaven.doExecute (DefaultMaven.java:194)
    at org.apache.maven.DefaultMaven.execute (DefaultMaven.java:107)
    at org.apache.maven.cli.MavenCli.execute (MavenCli.java:955)
    at org.apache.maven.cli.MavenCli.doMain (MavenCli.java:290)
    at org.apache.maven.cli.MavenCli.main (MavenCli.java:194)
    at sun.reflect.NativeMethodAccessorImpl.invoke0 (Native Method)
    at sun.reflect.NativeMethodAccessorImpl.invoke (NativeMethodAccessorImpl.java:57)
    at sun.reflect.DelegatingMethodAccessorImpl.invoke (DelegatingMethodAccessorImpl.java:43)
    at java.lang.reflect.Method.invoke (Method.java:606)
    at org.codehaus.plexus.classworlds.launcher.Launcher.launchEnhanced (Launcher.java:289)
    at org.codehaus.plexus.classworlds.launcher.Launcher.launch (Launcher.java:229)
    at org.codehaus.plexus.classworlds.launcher.Launcher.mainWithExitCode (Launcher.java:415)
    at org.codehaus.plexus.classworlds.launcher.Launcher.main (Launcher.java:356)
Caused by: org.codehaus.plexus.component.configurator.ComponentConfigurationException: Cannot assign configuration entry 'environmentVariables' with value 'JENKINS_MAVEN_AGENT_DISABLED=true' of type java.lang.String to property of type java.util.Map
    at org.codehaus.plexus.component.configurator.converters.AbstractConfigurationConverter.failIfNotTypeCompatible (AbstractConfigurationConverter.java:100)
    at org.codehaus.plexus.component.configurator.converters.AbstractConfigurationConverter.fromExpression (AbstractConfigurationConverter.java:76)
    at org.codehaus.plexus.component.configurator.converters.composite.MapConverter.fromConfiguration (MapConverter.java:54)
    at org.eclipse.sisu.plexus.CompositeBeanHelper.convertProperty (CompositeBeanHelper.java:268)
    at org.eclipse.sisu.plexus.CompositeBeanHelper.setProperty (CompositeBeanHelper.java:174)
    at org.codehaus.plexus.component.configurator.converters.composite.ObjectWithFieldsConverter.processConfiguration (ObjectWithFieldsConverter.java:101)
    at org.codehaus.plexus.component.configurator.BasicComponentConfigurator.configureComponent (BasicComponentConfigurator.java:34)
    at org.apache.maven.plugin.internal.DefaultMavenPluginManager.populatePluginFields (DefaultMavenPluginManager.java:634)
    at org.apache.maven.plugin.internal.DefaultMavenPluginManager.getConfiguredMojo (DefaultMavenPluginManager.java:596)
    at org.apache.maven.plugin.DefaultBuildPluginManager.executeMojo (DefaultBuildPluginManager.java:121)
    at org.apache.maven.lifecycle.internal.MojoExecutor.execute (MojoExecutor.java:208)
    at org.apache.maven.lifecycle.internal.MojoExecutor.execute (MojoExecutor.java:154)
    at org.apache.maven.lifecycle.internal.MojoExecutor.execute (MojoExecutor.java:146)
    at org.apache.maven.lifecycle.internal.LifecycleModuleBuilder.buildProject (LifecycleModuleBuilder.java:117)
    at org.apache.maven.lifecycle.internal.LifecycleModuleBuilder.buildProject (LifecycleModuleBuilder.java:81)
    at org.apache.maven.lifecycle.internal.builder.singlethreaded.SingleThreadedBuilder.build (SingleThreadedBuilder.java:51)
    at org.apache.maven.lifecycle.internal.LifecycleStarter.execute (LifecycleStarter.java:128)
    at org.apache.maven.DefaultMaven.doExecute (DefaultMaven.java:309)
    at org.apache.maven.DefaultMaven.doExecute (DefaultMaven.java:194)
    at org.apache.maven.DefaultMaven.execute (DefaultMaven.java:107)
    at org.apache.maven.cli.MavenCli.execute (MavenCli.java:955)
    at org.apache.maven.cli.MavenCli.doMain (MavenCli.java:290)
    at org.apache.maven.cli.MavenCli.main (MavenCli.java:194)
    at sun.reflect.NativeMethodAccessorImpl.invoke0 (Native Method)
    at sun.reflect.NativeMethodAccessorImpl.invoke (NativeMethodAccessorImpl.java:57)
    at sun.reflect.DelegatingMethodAccessorImpl.invoke (DelegatingMethodAccessorImpl.java:43)
    at java.lang.reflect.Method.invoke (Method.java:606)
    at org.codehaus.plexus.classworlds.launcher.Launcher.launchEnhanced (Launcher.java:289)
    at org.codehaus.plexus.classworlds.launcher.Launcher.launch (Launcher.java:229)
    at org.codehaus.plexus.classworlds.launcher.Launcher.mainWithExitCode (Launcher.java:415)
    at org.codehaus.plexus.classworlds.launcher.Launcher.main (Launcher.java:356)
[ERROR] 
[ERROR] Re-run Maven using the -X switch to enable full debug logging.
[ERROR] 
[ERROR] For more information about the errors and possible solutions, please read the following articles:
[ERROR] [Help 1] http://cwiki.apache.org/confluence/display/MAVEN/PluginConfigurationException
[ERROR] 
[ERROR] After correcting the problems, you can resume the build with the command
[ERROR]   mvn <goals> -rf :maven-model
[Pipeline] }
[withMaven] artifactsPublisher - Archive artifact pom.xml under org/apache/maven/maven/3.5.3-SNAPSHOT/maven-3.5.3-SNAPSHOT.pom
[withMaven] artifactsPublisher - Archive artifact target/maven-3.5.3-SNAPSHOT-site.xml under org/apache/maven/maven/3.5.3-SNAPSHOT/maven-3.5.3-SNAPSHOT-site.xml
[withMaven] junitPublisher - Archive test results for Maven artifact org.apache.maven:maven-model:3.5.3-SNAPSHOT generated by maven-surefire-plugin:test (default-test): maven-model/target/surefire-reports/*.xml
[withMaven] junitPublisher - Jenkins JUnit Attachments Plugin not found, can't publish test attachments.Recording test results
None of the test reports contained any result
[withMaven] junitPublisher - Archive test results for Maven artifact org.apache.maven:maven-artifact:3.5.3-SNAPSHOT generated by maven-surefire-plugin:test (default-test): maven-artifact/target/surefire-reports/*.xml
[withMaven] junitPublisher - Jenkins JUnit Attachments Plugin not found, can't publish test attachments.Recording test results
None of the test reports contained any result
[withMaven] junitPublisher - Archive test results for Maven artifact org.apache.maven:maven-builder-support:3.5.3-SNAPSHOT generated by maven-surefire-plugin:test (default-test): maven-builder-support/target/surefire-reports/*.xml
[withMaven] junitPublisher - Jenkins JUnit Attachments Plugin not found, can't publish test attachments.Recording test results
None of the test reports contained any result
[withMaven] junitPublisher - Archive test results for Maven artifact org.apache.maven:maven-settings:3.5.3-SNAPSHOT generated by maven-surefire-plugin:test (default-test): maven-settings/target/surefire-reports/*.xml
[withMaven] junitPublisher - Jenkins JUnit Attachments Plugin not found, can't publish test attachments.Recording test results
None of the test reports contained any result
[withMaven] junitPublisher - Archive test results for Maven artifact org.apache.maven:maven-repository-metadata:3.5.3-SNAPSHOT generated by maven-surefire-plugin:test (default-test): maven-repository-metadata/target/surefire-reports/*.xml
[withMaven] junitPublisher - Jenkins JUnit Attachments Plugin not found, can't publish test attachments.Recording test results
None of the test reports contained any result
[withMaven] junitPublisher - Archive test results for Maven artifact org.apache.maven:maven-slf4j-provider:3.5.3-SNAPSHOT generated by maven-surefire-plugin:test (default-test): maven-slf4j-provider/target/surefire-reports/*.xml
[withMaven] junitPublisher - Jenkins JUnit Attachments Plugin not found, can't publish test attachments.Recording test results
None of the test reports contained any result
[withMaven] openTasksPublisher - Scan Tasks for Maven artifact org.apache.maven:maven-model:3.5.3-SNAPSHOT in source directory maven-model/src/main/java
[withMaven] openTasksPublisher - Scan Tasks for Maven artifact org.apache.maven:maven-artifact:3.5.3-SNAPSHOT in source directory maven-artifact/src/main/java
[withMaven] openTasksPublisher - Scan Tasks for Maven artifact org.apache.maven:maven-builder-support:3.5.3-SNAPSHOT in source directory maven-builder-support/src/main/java
[withMaven] openTasksPublisher - Scan Tasks for Maven artifact org.apache.maven:maven-settings:3.5.3-SNAPSHOT in source directory maven-settings/src/main/java
[withMaven] openTasksPublisher - Scan Tasks for Maven artifact org.apache.maven:maven-slf4j-provider:3.5.3-SNAPSHOT in source directory maven-slf4j-provider/src/main/java
[TASKS] Scanning folder '/home/jenkins/jenkins-slave/workspace/maven-wip_maven_master-45H665RDJD4D5J5T6E2CHUCWKXNNABXP24O5RG44ZDYZYKW63GPQ/build' for files matching the pattern 'maven-model/src/main/java/**/*,maven-artifact/src/main/java/**/*,maven-builder-support/src/main/java/**/*,maven-settings/src/main/java/**/*,maven-slf4j-provider/src/main/java/**/*' - excludes: null
[TASKS] Found 44 files to scan for tasks
[TASKS] Found 9 open tasks.
Skipping warnings blame since pipelines do not have an SCM link.%n
[TASKS] Computing warning deltas based on reference build #12
[Pipeline] // withMaven
[Pipeline] }
[Pipeline] // stage
[Pipeline] }
[Pipeline] // dir
[Pipeline] }
[Pipeline] // node
[Pipeline] stage
[Pipeline] { (Notifications)
[Pipeline] echo
Build result: FAILURE
[Pipeline] jiraIssueSelector

Build failed in Jenkins: Maven TLP (wip) » maven » master #13

Posted by Apache Jenkins Server <je...@builds.apache.org>.
See https://builds.apache.org/job/maven-wip/job/maven/job/master/13/

Changes:

* Ensure any forked Maven executions are not spied on by Jenkins

No tests ran.

Build log:
[...truncated 335.07 KB...]
    at java.lang.reflect.Method.invoke (Method.java:606)
    at org.codehaus.plexus.classworlds.launcher.Launcher.launchEnhanced (Launcher.java:289)
    at org.codehaus.plexus.classworlds.launcher.Launcher.launch (Launcher.java:229)
    at org.codehaus.plexus.classworlds.launcher.Launcher.mainWithExitCode (Launcher.java:415)
    at org.codehaus.plexus.classworlds.launcher.Launcher.main (Launcher.java:356)
Caused by: org.codehaus.plexus.component.configurator.ComponentConfigurationException: Cannot assign configuration entry 'environmentVariables' with value 'JENKINS_MAVEN_AGENT_DISABLED=true' of type java.lang.String to property of type java.util.Map
    at org.codehaus.plexus.component.configurator.converters.AbstractConfigurationConverter.failIfNotTypeCompatible (AbstractConfigurationConverter.java:100)
    at org.codehaus.plexus.component.configurator.converters.AbstractConfigurationConverter.fromExpression (AbstractConfigurationConverter.java:76)
    at org.codehaus.plexus.component.configurator.converters.composite.MapConverter.fromConfiguration (MapConverter.java:54)
    at org.eclipse.sisu.plexus.CompositeBeanHelper.convertProperty (CompositeBeanHelper.java:268)
    at org.eclipse.sisu.plexus.CompositeBeanHelper.setProperty (CompositeBeanHelper.java:174)
    at org.codehaus.plexus.component.configurator.converters.composite.ObjectWithFieldsConverter.processConfiguration (ObjectWithFieldsConverter.java:101)
    at org.codehaus.plexus.component.configurator.BasicComponentConfigurator.configureComponent (BasicComponentConfigurator.java:34)
    at org.apache.maven.plugin.internal.DefaultMavenPluginManager.populatePluginFields (DefaultMavenPluginManager.java:634)
    at org.apache.maven.plugin.internal.DefaultMavenPluginManager.getConfiguredMojo (DefaultMavenPluginManager.java:596)
    at org.apache.maven.plugin.DefaultBuildPluginManager.executeMojo (DefaultBuildPluginManager.java:121)
    at org.apache.maven.lifecycle.internal.MojoExecutor.execute (MojoExecutor.java:208)
    at org.apache.maven.lifecycle.internal.MojoExecutor.execute (MojoExecutor.java:154)
    at org.apache.maven.lifecycle.internal.MojoExecutor.execute (MojoExecutor.java:146)
    at org.apache.maven.lifecycle.internal.LifecycleModuleBuilder.buildProject (LifecycleModuleBuilder.java:117)
    at org.apache.maven.lifecycle.internal.LifecycleModuleBuilder.buildProject (LifecycleModuleBuilder.java:81)
    at org.apache.maven.lifecycle.internal.builder.singlethreaded.SingleThreadedBuilder.build (SingleThreadedBuilder.java:51)
    at org.apache.maven.lifecycle.internal.LifecycleStarter.execute (LifecycleStarter.java:128)
    at org.apache.maven.DefaultMaven.doExecute (DefaultMaven.java:309)
    at org.apache.maven.DefaultMaven.doExecute (DefaultMaven.java:194)
    at org.apache.maven.DefaultMaven.execute (DefaultMaven.java:107)
    at org.apache.maven.cli.MavenCli.execute (MavenCli.java:955)
    at org.apache.maven.cli.MavenCli.doMain (MavenCli.java:290)
    at org.apache.maven.cli.MavenCli.main (MavenCli.java:194)
    at sun.reflect.NativeMethodAccessorImpl.invoke0 (Native Method)
    at sun.reflect.NativeMethodAccessorImpl.invoke (NativeMethodAccessorImpl.java:57)
    at sun.reflect.DelegatingMethodAccessorImpl.invoke (DelegatingMethodAccessorImpl.java:43)
    at java.lang.reflect.Method.invoke (Method.java:606)
    at org.codehaus.plexus.classworlds.launcher.Launcher.launchEnhanced (Launcher.java:289)
    at org.codehaus.plexus.classworlds.launcher.Launcher.launch (Launcher.java:229)
    at org.codehaus.plexus.classworlds.launcher.Launcher.mainWithExitCode (Launcher.java:415)
    at org.codehaus.plexus.classworlds.launcher.Launcher.main (Launcher.java:356)
[ERROR] Failed to execute goal org.apache.maven.plugins:maven-surefire-plugin:2.18.1:test (default-test) on project maven-repository-metadata: Unable to parse configuration of mojo org.apache.maven.plugins:maven-surefire-plugin:2.18.1:test for parameter environmentVariables: Cannot assign configuration entry 'environmentVariables' with value 'JENKINS_MAVEN_AGENT_DISABLED=true' of type java.lang.String to property of type java.util.Map -> [Help 1]
org.apache.maven.lifecycle.LifecycleExecutionException: Failed to execute goal org.apache.maven.plugins:maven-surefire-plugin:2.18.1:test (default-test) on project maven-repository-metadata: Unable to parse configuration of mojo org.apache.maven.plugins:maven-surefire-plugin:2.18.1:test for parameter environmentVariables: Cannot assign configuration entry 'environmentVariables' with value 'JENKINS_MAVEN_AGENT_DISABLED=true' of type java.lang.String to property of type java.util.Map
    at org.apache.maven.lifecycle.internal.MojoExecutor.execute (MojoExecutor.java:213)
    at org.apache.maven.lifecycle.internal.MojoExecutor.execute (MojoExecutor.java:154)
    at org.apache.maven.lifecycle.internal.MojoExecutor.execute (MojoExecutor.java:146)
    at org.apache.maven.lifecycle.internal.LifecycleModuleBuilder.buildProject (LifecycleModuleBuilder.java:117)
    at org.apache.maven.lifecycle.internal.LifecycleModuleBuilder.buildProject (LifecycleModuleBuilder.java:81)
    at org.apache.maven.lifecycle.internal.builder.singlethreaded.SingleThreadedBuilder.build (SingleThreadedBuilder.java:51)
    at org.apache.maven.lifecycle.internal.LifecycleStarter.execute (LifecycleStarter.java:128)
    at org.apache.maven.DefaultMaven.doExecute (DefaultMaven.java:309)
    at org.apache.maven.DefaultMaven.doExecute (DefaultMaven.java:194)
    at org.apache.maven.DefaultMaven.execute (DefaultMaven.java:107)
    at org.apache.maven.cli.MavenCli.execute (MavenCli.java:955)
    at org.apache.maven.cli.MavenCli.doMain (MavenCli.java:290)
    at org.apache.maven.cli.MavenCli.main (MavenCli.java:194)
    at sun.reflect.NativeMethodAccessorImpl.invoke0 (Native Method)
    at sun.reflect.NativeMethodAccessorImpl.invoke (NativeMethodAccessorImpl.java:57)
    at sun.reflect.DelegatingMethodAccessorImpl.invoke (DelegatingMethodAccessorImpl.java:43)
    at java.lang.reflect.Method.invoke (Method.java:606)
    at org.codehaus.plexus.classworlds.launcher.Launcher.launchEnhanced (Launcher.java:289)
    at org.codehaus.plexus.classworlds.launcher.Launcher.launch (Launcher.java:229)
    at org.codehaus.plexus.classworlds.launcher.Launcher.mainWithExitCode (Launcher.java:415)
    at org.codehaus.plexus.classworlds.launcher.Launcher.main (Launcher.java:356)
Caused by: org.apache.maven.plugin.PluginConfigurationException: Unable to parse configuration of mojo org.apache.maven.plugins:maven-surefire-plugin:2.18.1:test for parameter environmentVariables: Cannot assign configuration entry 'environmentVariables' with value 'JENKINS_MAVEN_AGENT_DISABLED=true' of type java.lang.String to property of type java.util.Map
    at org.apache.maven.plugin.internal.DefaultMavenPluginManager.populatePluginFields (DefaultMavenPluginManager.java:664)
    at org.apache.maven.plugin.internal.DefaultMavenPluginManager.getConfiguredMojo (DefaultMavenPluginManager.java:596)
    at org.apache.maven.plugin.DefaultBuildPluginManager.executeMojo (DefaultBuildPluginManager.java:121)
    at org.apache.maven.lifecycle.internal.MojoExecutor.execute (MojoExecutor.java:208)
    at org.apache.maven.lifecycle.internal.MojoExecutor.execute (MojoExecutor.java:154)
    at org.apache.maven.lifecycle.internal.MojoExecutor.execute (MojoExecutor.java:146)
    at org.apache.maven.lifecycle.internal.LifecycleModuleBuilder.buildProject (LifecycleModuleBuilder.java:117)
    at org.apache.maven.lifecycle.internal.LifecycleModuleBuilder.buildProject (LifecycleModuleBuilder.java:81)
    at org.apache.maven.lifecycle.internal.builder.singlethreaded.SingleThreadedBuilder.build (SingleThreadedBuilder.java:51)
    at org.apache.maven.lifecycle.internal.LifecycleStarter.execute (LifecycleStarter.java:128)
    at org.apache.maven.DefaultMaven.doExecute (DefaultMaven.java:309)
    at org.apache.maven.DefaultMaven.doExecute (DefaultMaven.java:194)
    at org.apache.maven.DefaultMaven.execute (DefaultMaven.java:107)
    at org.apache.maven.cli.MavenCli.execute (MavenCli.java:955)
    at org.apache.maven.cli.MavenCli.doMain (MavenCli.java:290)
    at org.apache.maven.cli.MavenCli.main (MavenCli.java:194)
    at sun.reflect.NativeMethodAccessorImpl.invoke0 (Native Method)
    at sun.reflect.NativeMethodAccessorImpl.invoke (NativeMethodAccessorImpl.java:57)
    at sun.reflect.DelegatingMethodAccessorImpl.invoke (DelegatingMethodAccessorImpl.java:43)
    at java.lang.reflect.Method.invoke (Method.java:606)
    at org.codehaus.plexus.classworlds.launcher.Launcher.launchEnhanced (Launcher.java:289)
    at org.codehaus.plexus.classworlds.launcher.Launcher.launch (Launcher.java:229)
    at org.codehaus.plexus.classworlds.launcher.Launcher.mainWithExitCode (Launcher.java:415)
    at org.codehaus.plexus.classworlds.launcher.Launcher.main (Launcher.java:356)
Caused by: org.codehaus.plexus.component.configurator.ComponentConfigurationException: Cannot assign configuration entry 'environmentVariables' with value 'JENKINS_MAVEN_AGENT_DISABLED=true' of type java.lang.String to property of type java.util.Map
    at org.codehaus.plexus.component.configurator.converters.AbstractConfigurationConverter.failIfNotTypeCompatible (AbstractConfigurationConverter.java:100)
    at org.codehaus.plexus.component.configurator.converters.AbstractConfigurationConverter.fromExpression (AbstractConfigurationConverter.java:76)
    at org.codehaus.plexus.component.configurator.converters.composite.MapConverter.fromConfiguration (MapConverter.java:54)
    at org.eclipse.sisu.plexus.CompositeBeanHelper.convertProperty (CompositeBeanHelper.java:268)
    at org.eclipse.sisu.plexus.CompositeBeanHelper.setProperty (CompositeBeanHelper.java:174)
    at org.codehaus.plexus.component.configurator.converters.composite.ObjectWithFieldsConverter.processConfiguration (ObjectWithFieldsConverter.java:101)
    at org.codehaus.plexus.component.configurator.BasicComponentConfigurator.configureComponent (BasicComponentConfigurator.java:34)
    at org.apache.maven.plugin.internal.DefaultMavenPluginManager.populatePluginFields (DefaultMavenPluginManager.java:634)
    at org.apache.maven.plugin.internal.DefaultMavenPluginManager.getConfiguredMojo (DefaultMavenPluginManager.java:596)
    at org.apache.maven.plugin.DefaultBuildPluginManager.executeMojo (DefaultBuildPluginManager.java:121)
    at org.apache.maven.lifecycle.internal.MojoExecutor.execute (MojoExecutor.java:208)
    at org.apache.maven.lifecycle.internal.MojoExecutor.execute (MojoExecutor.java:154)
    at org.apache.maven.lifecycle.internal.MojoExecutor.execute (MojoExecutor.java:146)
    at org.apache.maven.lifecycle.internal.LifecycleModuleBuilder.buildProject (LifecycleModuleBuilder.java:117)
    at org.apache.maven.lifecycle.internal.LifecycleModuleBuilder.buildProject (LifecycleModuleBuilder.java:81)
    at org.apache.maven.lifecycle.internal.builder.singlethreaded.SingleThreadedBuilder.build (SingleThreadedBuilder.java:51)
    at org.apache.maven.lifecycle.internal.LifecycleStarter.execute (LifecycleStarter.java:128)
    at org.apache.maven.DefaultMaven.doExecute (DefaultMaven.java:309)
    at org.apache.maven.DefaultMaven.doExecute (DefaultMaven.java:194)
    at org.apache.maven.DefaultMaven.execute (DefaultMaven.java:107)
    at org.apache.maven.cli.MavenCli.execute (MavenCli.java:955)
    at org.apache.maven.cli.MavenCli.doMain (MavenCli.java:290)
    at org.apache.maven.cli.MavenCli.main (MavenCli.java:194)
    at sun.reflect.NativeMethodAccessorImpl.invoke0 (Native Method)
    at sun.reflect.NativeMethodAccessorImpl.invoke (NativeMethodAccessorImpl.java:57)
    at sun.reflect.DelegatingMethodAccessorImpl.invoke (DelegatingMethodAccessorImpl.java:43)
    at java.lang.reflect.Method.invoke (Method.java:606)
    at org.codehaus.plexus.classworlds.launcher.Launcher.launchEnhanced (Launcher.java:289)
    at org.codehaus.plexus.classworlds.launcher.Launcher.launch (Launcher.java:229)
    at org.codehaus.plexus.classworlds.launcher.Launcher.mainWithExitCode (Launcher.java:415)
    at org.codehaus.plexus.classworlds.launcher.Launcher.main (Launcher.java:356)
[ERROR] Failed to execute goal org.apache.maven.plugins:maven-surefire-plugin:2.18.1:test (default-test) on project maven-slf4j-provider: Unable to parse configuration of mojo org.apache.maven.plugins:maven-surefire-plugin:2.18.1:test for parameter environmentVariables: Cannot assign configuration entry 'environmentVariables' with value 'JENKINS_MAVEN_AGENT_DISABLED=true' of type java.lang.String to property of type java.util.Map -> [Help 1]
org.apache.maven.lifecycle.LifecycleExecutionException: Failed to execute goal org.apache.maven.plugins:maven-surefire-plugin:2.18.1:test (default-test) on project maven-slf4j-provider: Unable to parse configuration of mojo org.apache.maven.plugins:maven-surefire-plugin:2.18.1:test for parameter environmentVariables: Cannot assign configuration entry 'environmentVariables' with value 'JENKINS_MAVEN_AGENT_DISABLED=true' of type java.lang.String to property of type java.util.Map
    at org.apache.maven.lifecycle.internal.MojoExecutor.execute (MojoExecutor.java:213)
    at org.apache.maven.lifecycle.internal.MojoExecutor.execute (MojoExecutor.java:154)
    at org.apache.maven.lifecycle.internal.MojoExecutor.execute (MojoExecutor.java:146)
    at org.apache.maven.lifecycle.internal.LifecycleModuleBuilder.buildProject (LifecycleModuleBuilder.java:117)
    at org.apache.maven.lifecycle.internal.LifecycleModuleBuilder.buildProject (LifecycleModuleBuilder.java:81)
    at org.apache.maven.lifecycle.internal.builder.singlethreaded.SingleThreadedBuilder.build (SingleThreadedBuilder.java:51)
    at org.apache.maven.lifecycle.internal.LifecycleStarter.execute (LifecycleStarter.java:128)
    at org.apache.maven.DefaultMaven.doExecute (DefaultMaven.java:309)
    at org.apache.maven.DefaultMaven.doExecute (DefaultMaven.java:194)
    at org.apache.maven.DefaultMaven.execute (DefaultMaven.java:107)
    at org.apache.maven.cli.MavenCli.execute (MavenCli.java:955)
    at org.apache.maven.cli.MavenCli.doMain (MavenCli.java:290)
    at org.apache.maven.cli.MavenCli.main (MavenCli.java:194)
    at sun.reflect.NativeMethodAccessorImpl.invoke0 (Native Method)
    at sun.reflect.NativeMethodAccessorImpl.invoke (NativeMethodAccessorImpl.java:57)
    at sun.reflect.DelegatingMethodAccessorImpl.invoke (DelegatingMethodAccessorImpl.java:43)
    at java.lang.reflect.Method.invoke (Method.java:606)
    at org.codehaus.plexus.classworlds.launcher.Launcher.launchEnhanced (Launcher.java:289)
    at org.codehaus.plexus.classworlds.launcher.Launcher.launch (Launcher.java:229)
    at org.codehaus.plexus.classworlds.launcher.Launcher.mainWithExitCode (Launcher.java:415)
    at org.codehaus.plexus.classworlds.launcher.Launcher.main (Launcher.java:356)
Caused by: org.apache.maven.plugin.PluginConfigurationException: Unable to parse configuration of mojo org.apache.maven.plugins:maven-surefire-plugin:2.18.1:test for parameter environmentVariables: Cannot assign configuration entry 'environmentVariables' with value 'JENKINS_MAVEN_AGENT_DISABLED=true' of type java.lang.String to property of type java.util.Map
    at org.apache.maven.plugin.internal.DefaultMavenPluginManager.populatePluginFields (DefaultMavenPluginManager.java:664)
    at org.apache.maven.plugin.internal.DefaultMavenPluginManager.getConfiguredMojo (DefaultMavenPluginManager.java:596)
    at org.apache.maven.plugin.DefaultBuildPluginManager.executeMojo (DefaultBuildPluginManager.java:121)
    at org.apache.maven.lifecycle.internal.MojoExecutor.execute (MojoExecutor.java:208)
    at org.apache.maven.lifecycle.internal.MojoExecutor.execute (MojoExecutor.java:154)
    at org.apache.maven.lifecycle.internal.MojoExecutor.execute (MojoExecutor.java:146)
    at org.apache.maven.lifecycle.internal.LifecycleModuleBuilder.buildProject (LifecycleModuleBuilder.java:117)
    at org.apache.maven.lifecycle.internal.LifecycleModuleBuilder.buildProject (LifecycleModuleBuilder.java:81)
    at org.apache.maven.lifecycle.internal.builder.singlethreaded.SingleThreadedBuilder.build (SingleThreadedBuilder.java:51)
    at org.apache.maven.lifecycle.internal.LifecycleStarter.execute (LifecycleStarter.java:128)
    at org.apache.maven.DefaultMaven.doExecute (DefaultMaven.java:309)
    at org.apache.maven.DefaultMaven.doExecute (DefaultMaven.java:194)
    at org.apache.maven.DefaultMaven.execute (DefaultMaven.java:107)
    at org.apache.maven.cli.MavenCli.execute (MavenCli.java:955)
    at org.apache.maven.cli.MavenCli.doMain (MavenCli.java:290)
    at org.apache.maven.cli.MavenCli.main (MavenCli.java:194)
    at sun.reflect.NativeMethodAccessorImpl.invoke0 (Native Method)
    at sun.reflect.NativeMethodAccessorImpl.invoke (NativeMethodAccessorImpl.java:57)
    at sun.reflect.DelegatingMethodAccessorImpl.invoke (DelegatingMethodAccessorImpl.java:43)
    at java.lang.reflect.Method.invoke (Method.java:606)
    at org.codehaus.plexus.classworlds.launcher.Launcher.launchEnhanced (Launcher.java:289)
    at org.codehaus.plexus.classworlds.launcher.Launcher.launch (Launcher.java:229)
    at org.codehaus.plexus.classworlds.launcher.Launcher.mainWithExitCode (Launcher.java:415)
    at org.codehaus.plexus.classworlds.launcher.Launcher.main (Launcher.java:356)
Caused by: org.codehaus.plexus.component.configurator.ComponentConfigurationException: Cannot assign configuration entry 'environmentVariables' with value 'JENKINS_MAVEN_AGENT_DISABLED=true' of type java.lang.String to property of type java.util.Map
    at org.codehaus.plexus.component.configurator.converters.AbstractConfigurationConverter.failIfNotTypeCompatible (AbstractConfigurationConverter.java:100)
    at org.codehaus.plexus.component.configurator.converters.AbstractConfigurationConverter.fromExpression (AbstractConfigurationConverter.java:76)
    at org.codehaus.plexus.component.configurator.converters.composite.MapConverter.fromConfiguration (MapConverter.java:54)
    at org.eclipse.sisu.plexus.CompositeBeanHelper.convertProperty (CompositeBeanHelper.java:268)
    at org.eclipse.sisu.plexus.CompositeBeanHelper.setProperty (CompositeBeanHelper.java:174)
    at org.codehaus.plexus.component.configurator.converters.composite.ObjectWithFieldsConverter.processConfiguration (ObjectWithFieldsConverter.java:101)
    at org.codehaus.plexus.component.configurator.BasicComponentConfigurator.configureComponent (BasicComponentConfigurator.java:34)
    at org.apache.maven.plugin.internal.DefaultMavenPluginManager.populatePluginFields (DefaultMavenPluginManager.java:634)
    at org.apache.maven.plugin.internal.DefaultMavenPluginManager.getConfiguredMojo (DefaultMavenPluginManager.java:596)
    at org.apache.maven.plugin.DefaultBuildPluginManager.executeMojo (DefaultBuildPluginManager.java:121)
    at org.apache.maven.lifecycle.internal.MojoExecutor.execute (MojoExecutor.java:208)
    at org.apache.maven.lifecycle.internal.MojoExecutor.execute (MojoExecutor.java:154)
    at org.apache.maven.lifecycle.internal.MojoExecutor.execute (MojoExecutor.java:146)
    at org.apache.maven.lifecycle.internal.LifecycleModuleBuilder.buildProject (LifecycleModuleBuilder.java:117)
    at org.apache.maven.lifecycle.internal.LifecycleModuleBuilder.buildProject (LifecycleModuleBuilder.java:81)
    at org.apache.maven.lifecycle.internal.builder.singlethreaded.SingleThreadedBuilder.build (SingleThreadedBuilder.java:51)
    at org.apache.maven.lifecycle.internal.LifecycleStarter.execute (LifecycleStarter.java:128)
    at org.apache.maven.DefaultMaven.doExecute (DefaultMaven.java:309)
    at org.apache.maven.DefaultMaven.doExecute (DefaultMaven.java:194)
    at org.apache.maven.DefaultMaven.execute (DefaultMaven.java:107)
    at org.apache.maven.cli.MavenCli.execute (MavenCli.java:955)
    at org.apache.maven.cli.MavenCli.doMain (MavenCli.java:290)
    at org.apache.maven.cli.MavenCli.main (MavenCli.java:194)
    at sun.reflect.NativeMethodAccessorImpl.invoke0 (Native Method)
    at sun.reflect.NativeMethodAccessorImpl.invoke (NativeMethodAccessorImpl.java:57)
    at sun.reflect.DelegatingMethodAccessorImpl.invoke (DelegatingMethodAccessorImpl.java:43)
    at java.lang.reflect.Method.invoke (Method.java:606)
    at org.codehaus.plexus.classworlds.launcher.Launcher.launchEnhanced (Launcher.java:289)
    at org.codehaus.plexus.classworlds.launcher.Launcher.launch (Launcher.java:229)
    at org.codehaus.plexus.classworlds.launcher.Launcher.mainWithExitCode (Launcher.java:415)
    at org.codehaus.plexus.classworlds.launcher.Launcher.main (Launcher.java:356)
[ERROR] 
[ERROR] Re-run Maven using the -X switch to enable full debug logging.
[ERROR] 
[ERROR] For more information about the errors and possible solutions, please read the following articles:
[ERROR] [Help 1] http://cwiki.apache.org/confluence/display/MAVEN/PluginConfigurationException
[ERROR] 
[ERROR] After correcting the problems, you can resume the build with the command
[ERROR]   mvn <goals> -rf :maven-model
[Pipeline] }
[withMaven] artifactsPublisher - Archive artifact pom.xml under org/apache/maven/maven/3.5.3-SNAPSHOT/maven-3.5.3-SNAPSHOT.pom
[withMaven] artifactsPublisher - Archive artifact target/maven-3.5.3-SNAPSHOT-site.xml under org/apache/maven/maven/3.5.3-SNAPSHOT/maven-3.5.3-SNAPSHOT-site.xml
[withMaven] junitPublisher - Archive test results for Maven artifact org.apache.maven:maven-model:3.5.3-SNAPSHOT generated by maven-surefire-plugin:test (default-test): maven-model/target/surefire-reports/*.xml
[withMaven] junitPublisher - Jenkins JUnit Attachments Plugin not found, can't publish test attachments.Recording test results
None of the test reports contained any result
[withMaven] junitPublisher - Archive test results for Maven artifact org.apache.maven:maven-artifact:3.5.3-SNAPSHOT generated by maven-surefire-plugin:test (default-test): maven-artifact/target/surefire-reports/*.xml
[withMaven] junitPublisher - Jenkins JUnit Attachments Plugin not found, can't publish test attachments.Recording test results
None of the test reports contained any result
[withMaven] junitPublisher - Archive test results for Maven artifact org.apache.maven:maven-builder-support:3.5.3-SNAPSHOT generated by maven-surefire-plugin:test (default-test): maven-builder-support/target/surefire-reports/*.xml
[withMaven] junitPublisher - Jenkins JUnit Attachments Plugin not found, can't publish test attachments.Recording test results
None of the test reports contained any result
[withMaven] junitPublisher - Archive test results for Maven artifact org.apache.maven:maven-settings:3.5.3-SNAPSHOT generated by maven-surefire-plugin:test (default-test): maven-settings/target/surefire-reports/*.xml
[withMaven] junitPublisher - Jenkins JUnit Attachments Plugin not found, can't publish test attachments.Recording test results
None of the test reports contained any result
[withMaven] junitPublisher - Archive test results for Maven artifact org.apache.maven:maven-repository-metadata:3.5.3-SNAPSHOT generated by maven-surefire-plugin:test (default-test): maven-repository-metadata/target/surefire-reports/*.xml
[withMaven] junitPublisher - Jenkins JUnit Attachments Plugin not found, can't publish test attachments.Recording test results
None of the test reports contained any result
[withMaven] junitPublisher - Archive test results for Maven artifact org.apache.maven:maven-slf4j-provider:3.5.3-SNAPSHOT generated by maven-surefire-plugin:test (default-test): maven-slf4j-provider/target/surefire-reports/*.xml
[withMaven] junitPublisher - Jenkins JUnit Attachments Plugin not found, can't publish test attachments.Recording test results
None of the test reports contained any result
[withMaven] openTasksPublisher - Scan Tasks for Maven artifact org.apache.maven:maven-model:3.5.3-SNAPSHOT in source directory maven-model/src/main/java
[withMaven] openTasksPublisher - Scan Tasks for Maven artifact org.apache.maven:maven-artifact:3.5.3-SNAPSHOT in source directory maven-artifact/src/main/java
[withMaven] openTasksPublisher - Scan Tasks for Maven artifact org.apache.maven:maven-builder-support:3.5.3-SNAPSHOT in source directory maven-builder-support/src/main/java
[withMaven] openTasksPublisher - Scan Tasks for Maven artifact org.apache.maven:maven-settings:3.5.3-SNAPSHOT in source directory maven-settings/src/main/java
[withMaven] openTasksPublisher - Scan Tasks for Maven artifact org.apache.maven:maven-slf4j-provider:3.5.3-SNAPSHOT in source directory maven-slf4j-provider/src/main/java
[TASKS] Scanning folder '/home/jenkins/jenkins-slave/workspace/maven-wip_maven_master-45H665RDJD4D5J5T6E2CHUCWKXNNABXP24O5RG44ZDYZYKW63GPQ/build' for files matching the pattern 'maven-model/src/main/java/**/*,maven-artifact/src/main/java/**/*,maven-builder-support/src/main/java/**/*,maven-settings/src/main/java/**/*,maven-slf4j-provider/src/main/java/**/*' - excludes: null
[TASKS] Found 44 files to scan for tasks
[TASKS] Found 9 open tasks.
Skipping warnings blame since pipelines do not have an SCM link.%n
[TASKS] Computing warning deltas based on reference build #12
[Pipeline] // withMaven
[Pipeline] }
[Pipeline] // stage
[Pipeline] }
[Pipeline] // dir
[Pipeline] }
[Pipeline] // node
[Pipeline] stage
[Pipeline] { (Notifications)
[Pipeline] echo
Build result: FAILURE
[Pipeline] jiraIssueSelector
[Pipeline] emailext

Build unstable in Jenkins: Maven TLP (wip) » maven » master #12

Posted by Apache Jenkins Server <je...@builds.apache.org>.
See https://builds.apache.org/job/maven-wip/job/maven/job/master/12/

Changes:

* Noting INFRA-15651
* Typowq

4 tests failed.
FAILED:  org.apache.maven.it.MavenITmng4387QuietLoggingTest.testit

Error Message:
expected:<[]> but was:<[[jenkins-maven-event-spy] INFO generate /home/jenkins/jenkins-slave/workspace/maven-wip_maven_master-45H665RDJD4D5J5T6E2CHUCWKXNNABXP24O5RG44ZDYZYKW63GPQ/test@tmp/withMaven46e52032/maven-spy-20171211-135858-6666767046761058746133.log.tmp ..., [jenkins-maven-event-spy] INFO generated /home/jenkins/jenkins-slave/workspace/maven-wip_maven_master-45H665RDJD4D5J5T6E2CHUCWKXNNABXP24O5RG44ZDYZYKW63GPQ/test@tmp/withMaven46e52032/maven-spy-20171211-135858-6666767046761058746133.log]>

Stack Trace:
junit.framework.AssertionFailedError: expected:<[]> but was:<[[jenkins-maven-event-spy] INFO generate /home/jenkins/jenkins-slave/workspace/maven-wip_maven_master-45H665RDJD4D5J5T6E2CHUCWKXNNABXP24O5RG44ZDYZYKW63GPQ/test@tmp/withMaven46e52032/maven-spy-20171211-135858-6666767046761058746133.log.tmp ..., [jenkins-maven-event-spy] INFO generated /home/jenkins/jenkins-slave/workspace/maven-wip_maven_master-45H665RDJD4D5J5T6E2CHUCWKXNNABXP24O5RG44ZDYZYKW63GPQ/test@tmp/withMaven46e52032/maven-spy-20171211-135858-6666767046761058746133.log]>
	at junit.framework.Assert.fail(Assert.java:47)
	at junit.framework.Assert.failNotEquals(Assert.java:283)
	at junit.framework.Assert.assertEquals(Assert.java:64)
	at junit.framework.Assert.assertEquals(Assert.java:71)
	at org.apache.maven.it.MavenITmng4387QuietLoggingTest.testit(MavenITmng4387QuietLoggingTest.java:71)


FAILED:  org.apache.maven.it.MavenITmng4387QuietLoggingTest.testit

Error Message:
expected:<[]> but was:<[[jenkins-maven-event-spy] INFO generate /home/jenkins/jenkins-slave/workspace/maven-wip_maven_master-45H665RDJD4D5J5T6E2CHUCWKXNNABXP24O5RG44ZDYZYKW63GPQ/test@tmp/withMaven1af3f9aa/maven-spy-20171211-140010-1986156568791187578206.log.tmp ..., [jenkins-maven-event-spy] INFO generated /home/jenkins/jenkins-slave/workspace/maven-wip_maven_master-45H665RDJD4D5J5T6E2CHUCWKXNNABXP24O5RG44ZDYZYKW63GPQ/test@tmp/withMaven1af3f9aa/maven-spy-20171211-140010-1986156568791187578206.log]>

Stack Trace:
junit.framework.AssertionFailedError: expected:<[]> but was:<[[jenkins-maven-event-spy] INFO generate /home/jenkins/jenkins-slave/workspace/maven-wip_maven_master-45H665RDJD4D5J5T6E2CHUCWKXNNABXP24O5RG44ZDYZYKW63GPQ/test@tmp/withMaven1af3f9aa/maven-spy-20171211-140010-1986156568791187578206.log.tmp ..., [jenkins-maven-event-spy] INFO generated /home/jenkins/jenkins-slave/workspace/maven-wip_maven_master-45H665RDJD4D5J5T6E2CHUCWKXNNABXP24O5RG44ZDYZYKW63GPQ/test@tmp/withMaven1af3f9aa/maven-spy-20171211-140010-1986156568791187578206.log]>
	at junit.framework.Assert.fail(Assert.java:47)
	at junit.framework.Assert.failNotEquals(Assert.java:283)
	at junit.framework.Assert.assertEquals(Assert.java:64)
	at junit.framework.Assert.assertEquals(Assert.java:71)
	at org.apache.maven.it.MavenITmng4387QuietLoggingTest.testit(MavenITmng4387QuietLoggingTest.java:71)


FAILED:  org.apache.maven.its.mng5640.FailingTest.testApp

Error Message:
null

Stack Trace:
junit.framework.AssertionFailedError
	at junit.framework.Assert.fail(Assert.java:47)
	at junit.framework.Assert.assertTrue(Assert.java:20)
	at junit.framework.Assert.assertTrue(Assert.java:27)
	at org.apache.maven.its.mng5640.FailingTest.testApp(FailingTest.java:16)


FAILED:  org.apache.maven.its.mng5640.FailingTest.testApp

Error Message:
null

Stack Trace:
junit.framework.AssertionFailedError
	at junit.framework.Assert.fail(Assert.java:47)
	at junit.framework.Assert.assertTrue(Assert.java:20)
	at junit.framework.Assert.assertTrue(Assert.java:27)
	at org.apache.maven.its.mng5640.FailingTest.testApp(FailingTest.java:16)




Build log:
[...truncated 23.25 MB...]
[winJava8] 	at com.cloudbees.groovy.cps.Continuable$1.call(Continuable.java:166)
[winJava8] 	at com.cloudbees.groovy.cps.Continuable$1.call(Continuable.java:163)
[winJava8] 	at org.codehaus.groovy.runtime.GroovyCategorySupport$ThreadCategoryInfo.use(GroovyCategorySupport.java:122)
[winJava8] 	at org.codehaus.groovy.runtime.GroovyCategorySupport.use(GroovyCategorySupport.java:261)
[winJava8] 	at com.cloudbees.groovy.cps.Continuable.run0(Continuable.java:163)
[winJava8] 	at org.jenkinsci.plugins.workflow.cps.SandboxContinuable.access$001(SandboxContinuable.java:19)
[winJava8] 	at org.jenkinsci.plugins.workflow.cps.SandboxContinuable$1.call(SandboxContinuable.java:35)
[winJava8] 	at org.jenkinsci.plugins.workflow.cps.SandboxContinuable$1.call(SandboxContinuable.java:32)
[winJava8] 	at org.jenkinsci.plugins.scriptsecurity.sandbox.groovy.GroovySandbox.runInSandbox(GroovySandbox.java:108)
[winJava8] 	at org.jenkinsci.plugins.workflow.cps.SandboxContinuable.run0(SandboxContinuable.java:32)
[winJava8] 	at org.jenkinsci.plugins.workflow.cps.CpsThread.runNextChunk(CpsThread.java:174)
[winJava8] 	at org.jenkinsci.plugins.workflow.cps.CpsThreadGroup.run(CpsThreadGroup.java:330)
[winJava8] 	at org.jenkinsci.plugins.workflow.cps.CpsThreadGroup.access$100(CpsThreadGroup.java:82)
[winJava8] 	at org.jenkinsci.plugins.workflow.cps.CpsThreadGroup$2.call(CpsThreadGroup.java:242)
[winJava8] 	at org.jenkinsci.plugins.workflow.cps.CpsThreadGroup$2.call(CpsThreadGroup.java:230)
[winJava8] 	at org.jenkinsci.plugins.workflow.cps.CpsVmExecutorService$2.call(CpsVmExecutorService.java:64)
[winJava8] 	at java.util.concurrent.FutureTask.run(FutureTask.java:266)
[winJava8] 	at hudson.remoting.SingleLaneExecutorService$1.run(SingleLaneExecutorService.java:112)
[winJava8] 	at jenkins.util.ContextResettingExecutorService$1.run(ContextResettingExecutorService.java:28)
[winJava8] 	at java.util.concurrent.Executors$RunnableAdapter.call(Executors.java:511)
[winJava8] 	at java.util.concurrent.FutureTask.run(FutureTask.java:266)
[winJava8] 	at java.util.concurrent.ThreadPoolExecutor.runWorker(ThreadPoolExecutor.java:1149)
[winJava8] 	at java.util.concurrent.ThreadPoolExecutor$Worker.run(ThreadPoolExecutor.java:624)
[winJava8] 	at java.lang.Thread.run(Thread.java:748)
[winJava8] ERROR: [withMaven] artifactsPublisher - WARNING: Exception archiving and fingerprinting MavenArtifact{org.apache.maven.its.it0009:test:pom:1.0(version: 1.0, snapshot:false)  C:\mvn-it-0.tmp\core-it-suite\target\test-classes\it0009\pom.xml}, skip archiving of the artifacts
[winJava8] java.lang.IllegalArgumentException: Cannot relativize 'C:\mvn-it-0.tmp\core-it-suite\target\test-classes\it0009\pom.xml' relatively to '/mvn-it-0.tmp'
[winJava8] 	at org.jenkinsci.plugins.pipeline.maven.util.XmlUtils.getPathInWorkspace(XmlUtils.java:319)
[winJava8] 	at org.jenkinsci.plugins.pipeline.maven.publishers.GeneratedArtifactsPublisher.process(GeneratedArtifactsPublisher.java:80)
[winJava8] 	at org.jenkinsci.plugins.pipeline.maven.MavenSpyLogProcessor.processMavenSpyLogs(MavenSpyLogProcessor.java:109)
[winJava8] 	at org.jenkinsci.plugins.pipeline.maven.WithMavenStepExecution$WorkspaceCleanupCallback.finished(WithMavenStepExecution.java:913)
[winJava8] 	at org.jenkinsci.plugins.workflow.steps.BodyExecutionCallback$TailCall.onSuccess(BodyExecutionCallback.java:114)
[winJava8] 	at org.jenkinsci.plugins.workflow.cps.CpsBodyExecution$SuccessAdapter.receive(CpsBodyExecution.java:362)
[winJava8] 	at com.cloudbees.groovy.cps.Outcome.resumeFrom(Outcome.java:73)
[winJava8] 	at com.cloudbees.groovy.cps.Continuable$1.call(Continuable.java:166)
[winJava8] 	at com.cloudbees.groovy.cps.Continuable$1.call(Continuable.java:163)
[winJava8] 	at org.codehaus.groovy.runtime.GroovyCategorySupport$ThreadCategoryInfo.use(GroovyCategorySupport.java:122)
[winJava8] 	at org.codehaus.groovy.runtime.GroovyCategorySupport.use(GroovyCategorySupport.java:261)
[winJava8] 	at com.cloudbees.groovy.cps.Continuable.run0(Continuable.java:163)
[winJava8] 	at org.jenkinsci.plugins.workflow.cps.SandboxContinuable.access$001(SandboxContinuable.java:19)
[winJava8] 	at org.jenkinsci.plugins.workflow.cps.SandboxContinuable$1.call(SandboxContinuable.java:35)
[winJava8] 	at org.jenkinsci.plugins.workflow.cps.SandboxContinuable$1.call(SandboxContinuable.java:32)
[winJava8] 	at org.jenkinsci.plugins.scriptsecurity.sandbox.groovy.GroovySandbox.runInSandbox(GroovySandbox.java:108)
[winJava8] 	at org.jenkinsci.plugins.workflow.cps.SandboxContinuable.run0(SandboxContinuable.java:32)
[winJava8] 	at org.jenkinsci.plugins.workflow.cps.CpsThread.runNextChunk(CpsThread.java:174)
[winJava8] 	at org.jenkinsci.plugins.workflow.cps.CpsThreadGroup.run(CpsThreadGroup.java:330)
[winJava8] 	at org.jenkinsci.plugins.workflow.cps.CpsThreadGroup.access$100(CpsThreadGroup.java:82)
[winJava8] 	at org.jenkinsci.plugins.workflow.cps.CpsThreadGroup$2.call(CpsThreadGroup.java:242)
[winJava8] 	at org.jenkinsci.plugins.workflow.cps.CpsThreadGroup$2.call(CpsThreadGroup.java:230)
[winJava8] 	at org.jenkinsci.plugins.workflow.cps.CpsVmExecutorService$2.call(CpsVmExecutorService.java:64)
[winJava8] 	at java.util.concurrent.FutureTask.run(FutureTask.java:266)
[winJava8] 	at hudson.remoting.SingleLaneExecutorService$1.run(SingleLaneExecutorService.java:112)
[winJava8] 	at jenkins.util.ContextResettingExecutorService$1.run(ContextResettingExecutorService.java:28)
[winJava8] 	at java.util.concurrent.Executors$RunnableAdapter.call(Executors.java:511)
[winJava8] 	at java.util.concurrent.FutureTask.run(FutureTask.java:266)
[winJava8] 	at java.util.concurrent.ThreadPoolExecutor.runWorker(ThreadPoolExecutor.java:1149)
[winJava8] 	at java.util.concurrent.ThreadPoolExecutor$Worker.run(ThreadPoolExecutor.java:624)
[winJava8] 	at java.lang.Thread.run(Thread.java:748)
[winJava8] [Fast Archiver] No artifacts from Maven TLP (wip) » maven » master #2 to compare, so performing full copy of artifacts
[winJava8] ERROR: [withMaven] WARNING Exception executing Maven reporter 'Open Task Scanner Publisher' / org.jenkinsci.plugins.pipeline.maven.publishers.TasksScannerPublisher. Please report a bug associated for the component 'pipeline-maven-plugin' at https://issues.jenkins-ci.org 
[winJava8] java.lang.IllegalArgumentException: Cannot relativize 'C:\mvn-it-0.tmp\core-it-suite\target\test-classes\it0009\src\main\java' relatively to '/mvn-it-0.tmp'
[winJava8] 	at org.jenkinsci.plugins.pipeline.maven.util.XmlUtils.getPathInWorkspace(XmlUtils.java:319)
[winJava8] 	at org.jenkinsci.plugins.pipeline.maven.publishers.TasksScannerPublisher.process(TasksScannerPublisher.java:128)
[winJava8] 	at org.jenkinsci.plugins.pipeline.maven.MavenSpyLogProcessor.processMavenSpyLogs(MavenSpyLogProcessor.java:109)
[winJava8] 	at org.jenkinsci.plugins.pipeline.maven.WithMavenStepExecution$WorkspaceCleanupCallback.finished(WithMavenStepExecution.java:913)
[winJava8] 	at org.jenkinsci.plugins.workflow.steps.BodyExecutionCallback$TailCall.onSuccess(BodyExecutionCallback.java:114)
[winJava8] 	at org.jenkinsci.plugins.workflow.cps.CpsBodyExecution$SuccessAdapter.receive(CpsBodyExecution.java:362)
[winJava8] 	at com.cloudbees.groovy.cps.Outcome.resumeFrom(Outcome.java:73)
[winJava8] 	at com.cloudbees.groovy.cps.Continuable$1.call(Continuable.java:166)
[winJava8] 	at com.cloudbees.groovy.cps.Continuable$1.call(Continuable.java:163)
[winJava8] 	at org.codehaus.groovy.runtime.GroovyCategorySupport$ThreadCategoryInfo.use(GroovyCategorySupport.java:122)
[winJava8] 	at org.codehaus.groovy.runtime.GroovyCategorySupport.use(GroovyCategorySupport.java:261)
[winJava8] 	at com.cloudbees.groovy.cps.Continuable.run0(Continuable.java:163)
[winJava8] 	at org.jenkinsci.plugins.workflow.cps.SandboxContinuable.access$001(SandboxContinuable.java:19)
[winJava8] 	at org.jenkinsci.plugins.workflow.cps.SandboxContinuable$1.call(SandboxContinuable.java:35)
[winJava8] 	at org.jenkinsci.plugins.workflow.cps.SandboxContinuable$1.call(SandboxContinuable.java:32)
[winJava8] 	at org.jenkinsci.plugins.scriptsecurity.sandbox.groovy.GroovySandbox.runInSandbox(GroovySandbox.java:108)
[winJava8] 	at org.jenkinsci.plugins.workflow.cps.SandboxContinuable.run0(SandboxContinuable.java:32)
[winJava8] 	at org.jenkinsci.plugins.workflow.cps.CpsThread.runNextChunk(CpsThread.java:174)
[winJava8] 	at org.jenkinsci.plugins.workflow.cps.CpsThreadGroup.run(CpsThreadGroup.java:330)
[winJava8] 	at org.jenkinsci.plugins.workflow.cps.CpsThreadGroup.access$100(CpsThreadGroup.java:82)
[winJava8] 	at org.jenkinsci.plugins.workflow.cps.CpsThreadGroup$2.call(CpsThreadGroup.java:242)
[winJava8] 	at org.jenkinsci.plugins.workflow.cps.CpsThreadGroup$2.call(CpsThreadGroup.java:230)
[winJava8] 	at org.jenkinsci.plugins.workflow.cps.CpsVmExecutorService$2.call(CpsVmExecutorService.java:64)
[winJava8] 	at java.util.concurrent.FutureTask.run(FutureTask.java:266)
[winJava8] 	at hudson.remoting.SingleLaneExecutorService$1.run(SingleLaneExecutorService.java:112)
[winJava8] 	at jenkins.util.ContextResettingExecutorService$1.run(ContextResettingExecutorService.java:28)
[winJava8] 	at java.util.concurrent.Executors$RunnableAdapter.call(Executors.java:511)
[winJava8] 	at java.util.concurrent.FutureTask.run(FutureTask.java:266)
[winJava8] 	at java.util.concurrent.ThreadPoolExecutor.runWorker(ThreadPoolExecutor.java:1149)
[winJava8] 	at java.util.concurrent.ThreadPoolExecutor$Worker.run(ThreadPoolExecutor.java:624)
[winJava8] 	at java.lang.Thread.run(Thread.java:748)
[winJava8] ERROR: [withMaven] artifactsPublisher - WARNING: Exception archiving and fingerprinting MavenArtifact{org.apache.maven.its.it0008:test:pom:1.0(version: 1.0, snapshot:false)  C:\mvn-it-0.tmp\core-it-suite\target\test-classes\it0008\pom.xml}, skip archiving of the artifacts
[winJava8] java.lang.IllegalArgumentException: Cannot relativize 'C:\mvn-it-0.tmp\core-it-suite\target\test-classes\it0008\pom.xml' relatively to '/mvn-it-0.tmp'
[winJava8] 	at org.jenkinsci.plugins.pipeline.maven.util.XmlUtils.getPathInWorkspace(XmlUtils.java:319)
[winJava8] 	at org.jenkinsci.plugins.pipeline.maven.publishers.GeneratedArtifactsPublisher.process(GeneratedArtifactsPublisher.java:80)
[winJava8] 	at org.jenkinsci.plugins.pipeline.maven.MavenSpyLogProcessor.processMavenSpyLogs(MavenSpyLogProcessor.java:109)
[winJava8] 	at org.jenkinsci.plugins.pipeline.maven.WithMavenStepExecution$WorkspaceCleanupCallback.finished(WithMavenStepExecution.java:913)
[winJava8] 	at org.jenkinsci.plugins.workflow.steps.BodyExecutionCallback$TailCall.onSuccess(BodyExecutionCallback.java:114)
[winJava8] 	at org.jenkinsci.plugins.workflow.cps.CpsBodyExecution$SuccessAdapter.receive(CpsBodyExecution.java:362)
[winJava8] 	at com.cloudbees.groovy.cps.Outcome.resumeFrom(Outcome.java:73)
[winJava8] 	at com.cloudbees.groovy.cps.Continuable$1.call(Continuable.java:166)
[winJava8] 	at com.cloudbees.groovy.cps.Continuable$1.call(Continuable.java:163)
[winJava8] 	at org.codehaus.groovy.runtime.GroovyCategorySupport$ThreadCategoryInfo.use(GroovyCategorySupport.java:122)
[winJava8] 	at org.codehaus.groovy.runtime.GroovyCategorySupport.use(GroovyCategorySupport.java:261)
[winJava8] 	at com.cloudbees.groovy.cps.Continuable.run0(Continuable.java:163)
[winJava8] 	at org.jenkinsci.plugins.workflow.cps.SandboxContinuable.access$001(SandboxContinuable.java:19)
[winJava8] 	at org.jenkinsci.plugins.workflow.cps.SandboxContinuable$1.call(SandboxContinuable.java:35)
[winJava8] 	at org.jenkinsci.plugins.workflow.cps.SandboxContinuable$1.call(SandboxContinuable.java:32)
[winJava8] 	at org.jenkinsci.plugins.scriptsecurity.sandbox.groovy.GroovySandbox.runInSandbox(GroovySandbox.java:108)
[winJava8] 	at org.jenkinsci.plugins.workflow.cps.SandboxContinuable.run0(SandboxContinuable.java:32)
[winJava8] 	at org.jenkinsci.plugins.workflow.cps.CpsThread.runNextChunk(CpsThread.java:174)
[winJava8] 	at org.jenkinsci.plugins.workflow.cps.CpsThreadGroup.run(CpsThreadGroup.java:330)
[winJava8] 	at org.jenkinsci.plugins.workflow.cps.CpsThreadGroup.access$100(CpsThreadGroup.java:82)
[winJava8] 	at org.jenkinsci.plugins.workflow.cps.CpsThreadGroup$2.call(CpsThreadGroup.java:242)
[winJava8] 	at org.jenkinsci.plugins.workflow.cps.CpsThreadGroup$2.call(CpsThreadGroup.java:230)
[winJava8] 	at org.jenkinsci.plugins.workflow.cps.CpsVmExecutorService$2.call(CpsVmExecutorService.java:64)
[winJava8] 	at java.util.concurrent.FutureTask.run(FutureTask.java:266)
[winJava8] 	at hudson.remoting.SingleLaneExecutorService$1.run(SingleLaneExecutorService.java:112)
[winJava8] 	at jenkins.util.ContextResettingExecutorService$1.run(ContextResettingExecutorService.java:28)
[winJava8] 	at java.util.concurrent.Executors$RunnableAdapter.call(Executors.java:511)
[winJava8] 	at java.util.concurrent.FutureTask.run(FutureTask.java:266)
[winJava8] 	at java.util.concurrent.ThreadPoolExecutor.runWorker(ThreadPoolExecutor.java:1149)
[winJava8] 	at java.util.concurrent.ThreadPoolExecutor$Worker.run(ThreadPoolExecutor.java:624)
[winJava8] 	at java.lang.Thread.run(Thread.java:748)
[winJava8] [Fast Archiver] No artifacts from Maven TLP (wip) » maven » master #2 to compare, so performing full copy of artifacts
[winJava8] ERROR: [withMaven] WARNING Exception executing Maven reporter 'Open Task Scanner Publisher' / org.jenkinsci.plugins.pipeline.maven.publishers.TasksScannerPublisher. Please report a bug associated for the component 'pipeline-maven-plugin' at https://issues.jenkins-ci.org 
[winJava8] java.lang.IllegalArgumentException: Cannot relativize 'C:\mvn-it-0.tmp\core-it-suite\target\test-classes\it0008\src\main\java' relatively to '/mvn-it-0.tmp'
[winJava8] 	at org.jenkinsci.plugins.pipeline.maven.util.XmlUtils.getPathInWorkspace(XmlUtils.java:319)
[winJava8] 	at org.jenkinsci.plugins.pipeline.maven.publishers.TasksScannerPublisher.process(TasksScannerPublisher.java:128)
[winJava8] 	at org.jenkinsci.plugins.pipeline.maven.MavenSpyLogProcessor.processMavenSpyLogs(MavenSpyLogProcessor.java:109)
[winJava8] 	at org.jenkinsci.plugins.pipeline.maven.WithMavenStepExecution$WorkspaceCleanupCallback.finished(WithMavenStepExecution.java:913)
[winJava8] 	at org.jenkinsci.plugins.workflow.steps.BodyExecutionCallback$TailCall.onSuccess(BodyExecutionCallback.java:114)
[winJava8] 	at org.jenkinsci.plugins.workflow.cps.CpsBodyExecution$SuccessAdapter.receive(CpsBodyExecution.java:362)
[winJava8] 	at com.cloudbees.groovy.cps.Outcome.resumeFrom(Outcome.java:73)
[winJava8] 	at com.cloudbees.groovy.cps.Continuable$1.call(Continuable.java:166)
[winJava8] 	at com.cloudbees.groovy.cps.Continuable$1.call(Continuable.java:163)
[winJava8] 	at org.codehaus.groovy.runtime.GroovyCategorySupport$ThreadCategoryInfo.use(GroovyCategorySupport.java:122)
[winJava8] 	at org.codehaus.groovy.runtime.GroovyCategorySupport.use(GroovyCategorySupport.java:261)
[winJava8] 	at com.cloudbees.groovy.cps.Continuable.run0(Continuable.java:163)
[winJava8] 	at org.jenkinsci.plugins.workflow.cps.SandboxContinuable.access$001(SandboxContinuable.java:19)
[winJava8] 	at org.jenkinsci.plugins.workflow.cps.SandboxContinuable$1.call(SandboxContinuable.java:35)
[winJava8] 	at org.jenkinsci.plugins.workflow.cps.SandboxContinuable$1.call(SandboxContinuable.java:32)
[winJava8] 	at org.jenkinsci.plugins.scriptsecurity.sandbox.groovy.GroovySandbox.runInSandbox(GroovySandbox.java:108)
[winJava8] 	at org.jenkinsci.plugins.workflow.cps.SandboxContinuable.run0(SandboxContinuable.java:32)
[winJava8] 	at org.jenkinsci.plugins.workflow.cps.CpsThread.runNextChunk(CpsThread.java:174)
[winJava8] 	at org.jenkinsci.plugins.workflow.cps.CpsThreadGroup.run(CpsThreadGroup.java:330)
[winJava8] 	at org.jenkinsci.plugins.workflow.cps.CpsThreadGroup.access$100(CpsThreadGroup.java:82)
[winJava8] 	at org.jenkinsci.plugins.workflow.cps.CpsThreadGroup$2.call(CpsThreadGroup.java:242)
[winJava8] 	at org.jenkinsci.plugins.workflow.cps.CpsThreadGroup$2.call(CpsThreadGroup.java:230)
[winJava8] 	at org.jenkinsci.plugins.workflow.cps.CpsVmExecutorService$2.call(CpsVmExecutorService.java:64)
[winJava8] 	at java.util.concurrent.FutureTask.run(FutureTask.java:266)
[winJava8] 	at hudson.remoting.SingleLaneExecutorService$1.run(SingleLaneExecutorService.java:112)
[winJava8] 	at jenkins.util.ContextResettingExecutorService$1.run(ContextResettingExecutorService.java:28)
[winJava8] 	at java.util.concurrent.Executors$RunnableAdapter.call(Executors.java:511)
[winJava8] 	at java.util.concurrent.FutureTask.run(FutureTask.java:266)
[winJava8] 	at java.util.concurrent.ThreadPoolExecutor.runWorker(ThreadPoolExecutor.java:1149)
[winJava8] 	at java.util.concurrent.ThreadPoolExecutor$Worker.run(ThreadPoolExecutor.java:624)
[winJava8] 	at java.lang.Thread.run(Thread.java:748)
[winJava8] ERROR: [withMaven] artifactsPublisher - WARNING: Exception archiving and fingerprinting MavenArtifact{org.apache.maven.its.it-core-extensions-custom-scopes:test:pom:0.1(version: 0.1, snapshot:false)  C:\mvn-it-0.tmp\core-it-suite\target\test-classes\mng-6210-core-extensions-scopes\client\pom.xml}, skip archiving of the artifacts
[winJava8] java.lang.IllegalArgumentException: Cannot relativize 'C:\mvn-it-0.tmp\core-it-suite\target\test-classes\mng-6210-core-extensions-scopes\client\pom.xml' relatively to '/mvn-it-0.tmp'
[winJava8] 	at org.jenkinsci.plugins.pipeline.maven.util.XmlUtils.getPathInWorkspace(XmlUtils.java:319)
[winJava8] 	at org.jenkinsci.plugins.pipeline.maven.publishers.GeneratedArtifactsPublisher.process(GeneratedArtifactsPublisher.java:80)
[winJava8] 	at org.jenkinsci.plugins.pipeline.maven.MavenSpyLogProcessor.processMavenSpyLogs(MavenSpyLogProcessor.java:109)
[winJava8] 	at org.jenkinsci.plugins.pipeline.maven.WithMavenStepExecution$WorkspaceCleanupCallback.finished(WithMavenStepExecution.java:913)
[winJava8] 	at org.jenkinsci.plugins.workflow.steps.BodyExecutionCallback$TailCall.onSuccess(BodyExecutionCallback.java:114)
[winJava8] 	at org.jenkinsci.plugins.workflow.cps.CpsBodyExecution$SuccessAdapter.receive(CpsBodyExecution.java:362)
[winJava8] 	at com.cloudbees.groovy.cps.Outcome.resumeFrom(Outcome.java:73)
[winJava8] 	at com.cloudbees.groovy.cps.Continuable$1.call(Continuable.java:166)
[winJava8] 	at com.cloudbees.groovy.cps.Continuable$1.call(Continuable.java:163)
[winJava8] 	at org.codehaus.groovy.runtime.GroovyCategorySupport$ThreadCategoryInfo.use(GroovyCategorySupport.java:122)
[winJava8] 	at org.codehaus.groovy.runtime.GroovyCategorySupport.use(GroovyCategorySupport.java:261)
[winJava8] 	at com.cloudbees.groovy.cps.Continuable.run0(Continuable.java:163)
[winJava8] 	at org.jenkinsci.plugins.workflow.cps.SandboxContinuable.access$001(SandboxContinuable.java:19)
[winJava8] 	at org.jenkinsci.plugins.workflow.cps.SandboxContinuable$1.call(SandboxContinuable.java:35)
[winJava8] 	at org.jenkinsci.plugins.workflow.cps.SandboxContinuable$1.call(SandboxContinuable.java:32)
[winJava8] 	at org.jenkinsci.plugins.scriptsecurity.sandbox.groovy.GroovySandbox.runInSandbox(GroovySandbox.java:108)
[winJava8] 	at org.jenkinsci.plugins.workflow.cps.SandboxContinuable.run0(SandboxContinuable.java:32)
[winJava8] 	at org.jenkinsci.plugins.workflow.cps.CpsThread.runNextChunk(CpsThread.java:174)
[winJava8] 	at org.jenkinsci.plugins.workflow.cps.CpsThreadGroup.run(CpsThreadGroup.java:330)
[winJava8] 	at org.jenkinsci.plugins.workflow.cps.CpsThreadGroup.access$100(CpsThreadGroup.java:82)
[winJava8] 	at org.jenkinsci.plugins.workflow.cps.CpsThreadGroup$2.call(CpsThreadGroup.java:242)
[winJava8] 	at org.jenkinsci.plugins.workflow.cps.CpsThreadGroup$2.call(CpsThreadGroup.java:230)
[winJava8] 	at org.jenkinsci.plugins.workflow.cps.CpsVmExecutorService$2.call(CpsVmExecutorService.java:64)
[winJava8] 	at java.util.concurrent.FutureTask.run(FutureTask.java:266)
[winJava8] 	at hudson.remoting.SingleLaneExecutorService$1.run(SingleLaneExecutorService.java:112)
[winJava8] 	at jenkins.util.ContextResettingExecutorService$1.run(ContextResettingExecutorService.java:28)
[winJava8] 	at java.util.concurrent.Executors$RunnableAdapter.call(Executors.java:511)
[winJava8] 	at java.util.concurrent.FutureTask.run(FutureTask.java:266)
[winJava8] 	at java.util.concurrent.ThreadPoolExecutor.runWorker(ThreadPoolExecutor.java:1149)
[winJava8] 	at java.util.concurrent.ThreadPoolExecutor$Worker.run(ThreadPoolExecutor.java:624)
[winJava8] 	at java.lang.Thread.run(Thread.java:748)
[winJava8] [Fast Archiver] No artifacts from Maven TLP (wip) » maven » master #2 to compare, so performing full copy of artifacts
[winJava8] ERROR: [withMaven] WARNING Exception executing Maven reporter 'Open Task Scanner Publisher' / org.jenkinsci.plugins.pipeline.maven.publishers.TasksScannerPublisher. Please report a bug associated for the component 'pipeline-maven-plugin' at https://issues.jenkins-ci.org 
[winJava8] java.lang.IllegalArgumentException: Cannot relativize 'C:\mvn-it-0.tmp\core-it-suite\target\test-classes\mng-6210-core-extensions-scopes\client\src\main\java' relatively to '/mvn-it-0.tmp'
[winJava8] 	at org.jenkinsci.plugins.pipeline.maven.util.XmlUtils.getPathInWorkspace(XmlUtils.java:319)
[winJava8] 	at org.jenkinsci.plugins.pipeline.maven.publishers.TasksScannerPublisher.process(TasksScannerPublisher.java:128)
[winJava8] 	at org.jenkinsci.plugins.pipeline.maven.MavenSpyLogProcessor.processMavenSpyLogs(MavenSpyLogProcessor.java:109)
[winJava8] 	at org.jenkinsci.plugins.pipeline.maven.WithMavenStepExecution$WorkspaceCleanupCallback.finished(WithMavenStepExecution.java:913)
[winJava8] 	at org.jenkinsci.plugins.workflow.steps.BodyExecutionCallback$TailCall.onSuccess(BodyExecutionCallback.java:114)
[winJava8] 	at org.jenkinsci.plugins.workflow.cps.CpsBodyExecution$SuccessAdapter.receive(CpsBodyExecution.java:362)
[winJava8] 	at com.cloudbees.groovy.cps.Outcome.resumeFrom(Outcome.java:73)
[winJava8] 	at com.cloudbees.groovy.cps.Continuable$1.call(Continuable.java:166)
[winJava8] 	at com.cloudbees.groovy.cps.Continuable$1.call(Continuable.java:163)
[winJava8] 	at org.codehaus.groovy.runtime.GroovyCategorySupport$ThreadCategoryInfo.use(GroovyCategorySupport.java:122)
[winJava8] 	at org.codehaus.groovy.runtime.GroovyCategorySupport.use(GroovyCategorySupport.java:261)
[winJava8] 	at com.cloudbees.groovy.cps.Continuable.run0(Continuable.java:163)
[winJava8] 	at org.jenkinsci.plugins.workflow.cps.SandboxContinuable.access$001(SandboxContinuable.java:19)
[winJava8] 	at org.jenkinsci.plugins.workflow.cps.SandboxContinuable$1.call(SandboxContinuable.java:35)
[winJava8] 	at org.jenkinsci.plugins.workflow.cps.SandboxContinuable$1.call(SandboxContinuable.java:32)
[winJava8] 	at org.jenkinsci.plugins.scriptsecurity.sandbox.groovy.GroovySandbox.runInSandbox(GroovySandbox.java:108)
[winJava8] 	at org.jenkinsci.plugins.workflow.cps.SandboxContinuable.run0(SandboxContinuable.java:32)
[winJava8] 	at org.jenkinsci.plugins.workflow.cps.CpsThread.runNextChunk(CpsThread.java:174)
[winJava8] 	at org.jenkinsci.plugins.workflow.cps.CpsThreadGroup.run(CpsThreadGroup.java:330)
[winJava8] 	at org.jenkinsci.plugins.workflow.cps.CpsThreadGroup.access$100(CpsThreadGroup.java:82)
[winJava8] 	at org.jenkinsci.plugins.workflow.cps.CpsThreadGroup$2.call(CpsThreadGroup.java:242)
[winJava8] 	at org.jenkinsci.plugins.workflow.cps.CpsThreadGroup$2.call(CpsThreadGroup.java:230)
[winJava8] 	at org.jenkinsci.plugins.workflow.cps.CpsVmExecutorService$2.call(CpsVmExecutorService.java:64)
[winJava8] 	at java.util.concurrent.FutureTask.run(FutureTask.java:266)
[winJava8] 	at hudson.remoting.SingleLaneExecutorService$1.run(SingleLaneExecutorService.java:112)
[winJava8] 	at jenkins.util.ContextResettingExecutorService$1.run(ContextResettingExecutorService.java:28)
[winJava8] 	at java.util.concurrent.Executors$RunnableAdapter.call(Executors.java:511)
[winJava8] 	at java.util.concurrent.FutureTask.run(FutureTask.java:266)
[winJava8] 	at java.util.concurrent.ThreadPoolExecutor.runWorker(ThreadPoolExecutor.java:1149)
[winJava8] 	at java.util.concurrent.ThreadPoolExecutor$Worker.run(ThreadPoolExecutor.java:624)
[winJava8] 	at java.lang.Thread.run(Thread.java:748)
[winJava8] [withMaven] One or multiple Maven executions have been ignored by the Jenkins Pipeline Maven Plugin because they have been interrupted before completion (4). See Pipeline Maven Plugin FAQ for more details.
[Pipeline] [winJava8] // withMaven
[Pipeline] [winJava7] }
[Pipeline] [winJava8] deleteDir
[Pipeline] [winJava7] // dir
[Pipeline] [winJava7] }
[Pipeline] [winJava7] // stage
[Pipeline] [winJava7] }
[Pipeline] [winJava7] // node
[Pipeline] [winJava7] }
[Pipeline] [winJava8] }
[Pipeline] [winJava8] // dir
[Pipeline] [winJava8] }
[Pipeline] [winJava8] // stage
[Pipeline] [winJava8] }
[Pipeline] [winJava8] // node
[Pipeline] [winJava8] }
[Pipeline] // parallel
[Pipeline] stage
[Pipeline] { (Notifications)
[Pipeline] echo
Build result: UNSTABLE
[Pipeline] jiraIssueSelector
[Pipeline] jiraComment

Build failed in Jenkins: Maven TLP (wip) » maven » master #11

Posted by Apache Jenkins Server <je...@builds.apache.org>.
See https://builds.apache.org/job/maven-wip/job/maven/job/master/11/

Changes:

* Noting INFRA-15651

No tests ran.

Build log:
Started by user stephenc
Obtained Jenkinsfile from 5411c5a9c4d327d7217ae966be3d1ead807ebfd8
Loading library jenkins-env@master
Attempting to resolve master from remote references...
 > git --version # timeout=10
 > git ls-remote -h -t https://gitbox.apache.org/repos/asf/maven-jenkins-env.git # timeout=10
Found match: refs/heads/master revision 8e2c8b2d7dce618409d588665e030dcf5d141f75
 > git rev-parse --is-inside-work-tree # timeout=10
Fetching changes from the remote Git repository
 > git config remote.origin.url https://gitbox.apache.org/repos/asf/maven-jenkins-env.git # timeout=10
Fetching without tags
Fetching upstream changes from https://gitbox.apache.org/repos/asf/maven-jenkins-env.git
 > git --version # timeout=10
 > git fetch --no-tags --progress https://gitbox.apache.org/repos/asf/maven-jenkins-env.git +refs/heads/*:refs/remotes/origin/*
Checking out Revision 8e2c8b2d7dce618409d588665e030dcf5d141f75 (master)
 > git config core.sparsecheckout # timeout=10
 > git checkout -f 8e2c8b2d7dce618409d588665e030dcf5d141f75
Commit message: "Noting INFRA-15651"
 > git rev-list 6c77351e3029741c6f350e8e419c0fb5f9feab2d # timeout=10
Loading library jenkins-lib@master
Attempting to resolve master from remote references...
 > git --version # timeout=10
 > git ls-remote -h -t https://gitbox.apache.org/repos/asf/maven-jenkins-lib.git # timeout=10
Found match: refs/heads/master revision cee8923b494ff5f0008fcdad10501d7d91f28328
 > git rev-parse --is-inside-work-tree # timeout=10
Fetching changes from the remote Git repository
 > git config remote.origin.url https://gitbox.apache.org/repos/asf/maven-jenkins-lib.git # timeout=10
Fetching without tags
Fetching upstream changes from https://gitbox.apache.org/repos/asf/maven-jenkins-lib.git
 > git --version # timeout=10
 > git fetch --no-tags --progress https://gitbox.apache.org/repos/asf/maven-jenkins-lib.git +refs/heads/*:refs/remotes/origin/*
Checking out Revision cee8923b494ff5f0008fcdad10501d7d91f28328 (master)
 > git config core.sparsecheckout # timeout=10
 > git checkout -f cee8923b494ff5f0008fcdad10501d7d91f28328
Commit message: "capture another"
 > git rev-list cee8923b494ff5f0008fcdad10501d7d91f28328 # timeout=10
[Pipeline] properties
[Pipeline] node
Still waiting to schedule task
There are no nodes with the label ‘ubuntui&&!ubuntu-4’
Aborted by stephenc
[Pipeline] // node
[Pipeline] stage
[Pipeline] { (Notifications)
[Pipeline] echo
Build result: FAILURE
[Pipeline] jiraIssueSelector
[Pipeline] jiraComment
[Pipeline] emailext

Build failed in Jenkins: Maven TLP (wip) » maven » master #10

Posted by Apache Jenkins Server <je...@builds.apache.org>.
See https://builds.apache.org/job/maven-wip/job/maven/job/master/10/

No changes.

No tests ran.

Build log:
Branch event
Obtained Jenkinsfile from 5411c5a9c4d327d7217ae966be3d1ead807ebfd8
Loading library jenkins-env@master
Attempting to resolve master from remote references...
 > git --version # timeout=10
 > git ls-remote -h -t https://gitbox.apache.org/repos/asf/maven-jenkins-env.git # timeout=10
Found match: refs/heads/master revision 6c77351e3029741c6f350e8e419c0fb5f9feab2d
 > git rev-parse --is-inside-work-tree # timeout=10
Fetching changes from the remote Git repository
 > git config remote.origin.url https://gitbox.apache.org/repos/asf/maven-jenkins-env.git # timeout=10
Fetching without tags
Fetching upstream changes from https://gitbox.apache.org/repos/asf/maven-jenkins-env.git
 > git --version # timeout=10
 > git fetch --no-tags --progress https://gitbox.apache.org/repos/asf/maven-jenkins-env.git +refs/heads/*:refs/remotes/origin/*
Checking out Revision 6c77351e3029741c6f350e8e419c0fb5f9feab2d (master)
 > git config core.sparsecheckout # timeout=10
 > git checkout -f 6c77351e3029741c6f350e8e419c0fb5f9feab2d
Commit message: "Add license headers"
 > git rev-list 6c77351e3029741c6f350e8e419c0fb5f9feab2d # timeout=10
Loading library jenkins-lib@master
Attempting to resolve master from remote references...
 > git --version # timeout=10
 > git ls-remote -h -t https://gitbox.apache.org/repos/asf/maven-jenkins-lib.git # timeout=10
Found match: refs/heads/master revision cee8923b494ff5f0008fcdad10501d7d91f28328
 > git rev-parse --is-inside-work-tree # timeout=10
Fetching changes from the remote Git repository
 > git config remote.origin.url https://gitbox.apache.org/repos/asf/maven-jenkins-lib.git # timeout=10
Fetching without tags
Fetching upstream changes from https://gitbox.apache.org/repos/asf/maven-jenkins-lib.git
 > git --version # timeout=10
 > git fetch --no-tags --progress https://gitbox.apache.org/repos/asf/maven-jenkins-lib.git +refs/heads/*:refs/remotes/origin/*
Checking out Revision cee8923b494ff5f0008fcdad10501d7d91f28328 (master)
 > git config core.sparsecheckout # timeout=10
 > git checkout -f cee8923b494ff5f0008fcdad10501d7d91f28328
Commit message: "capture another"
 > git rev-list cee8923b494ff5f0008fcdad10501d7d91f28328 # timeout=10
[Pipeline] properties
[Pipeline] node
Running on ubuntu-4 in /home/jenkins/jenkins-slave/workspace/maven-wip_maven_master-45H665RDJD4D5J5T6E2CHUCWKXNNABXP24O5RG44ZDYZYKW63GPQ
[Pipeline] {
[Pipeline] dir
Running in /home/jenkins/jenkins-slave/workspace/maven-wip_maven_master-45H665RDJD4D5J5T6E2CHUCWKXNNABXP24O5RG44ZDYZYKW63GPQ/build
[Pipeline] {
[Pipeline] stage
[Pipeline] { (Checkout)
[Pipeline] checkout
 > git rev-parse --is-inside-work-tree # timeout=10
Fetching changes from the remote Git repository
 > git config remote.origin.url https://git-wip-us.apache.org/repos/asf/maven.git # timeout=10
Fetching without tags
Fetching upstream changes from https://git-wip-us.apache.org/repos/asf/maven.git
 > git --version # timeout=10
 > git fetch --no-tags --progress https://git-wip-us.apache.org/repos/asf/maven.git +refs/heads/*:refs/remotes/origin/*
Checking out Revision 5411c5a9c4d327d7217ae966be3d1ead807ebfd8 (master)
 > git config core.sparsecheckout # timeout=10
 > git checkout -f 5411c5a9c4d327d7217ae966be3d1ead807ebfd8
[Pipeline] }
[Pipeline] // stage
[Pipeline] }
[Pipeline] // dir
[Pipeline] }
[Pipeline] // node
[Pipeline] stage
[Pipeline] { (Notifications)
[Pipeline] echo
Build result: FAILURE
[Pipeline] jiraIssueSelector
[Pipeline] emailext

Build failed in Jenkins: Maven TLP (wip) » maven » master #9

Posted by Apache Jenkins Server <je...@builds.apache.org>.
See https://builds.apache.org/job/maven-wip/job/maven/job/master/9/

No changes.

No tests ran.

Build log:
Started by user stephenc
Replayed #8
Obtained Jenkinsfile from 3f04e94ea45033fa2768f40148b5e06a141e066e
Loading library jenkins-env@master
Attempting to resolve master from remote references...
 > git --version # timeout=10
 > git ls-remote -h -t https://gitbox.apache.org/repos/asf/maven-jenkins-env.git # timeout=10
Found match: refs/heads/master revision 6c77351e3029741c6f350e8e419c0fb5f9feab2d
 > git rev-parse --is-inside-work-tree # timeout=10
Fetching changes from the remote Git repository
 > git config remote.origin.url https://gitbox.apache.org/repos/asf/maven-jenkins-env.git # timeout=10
Fetching without tags
Fetching upstream changes from https://gitbox.apache.org/repos/asf/maven-jenkins-env.git
 > git --version # timeout=10
 > git fetch --no-tags --progress https://gitbox.apache.org/repos/asf/maven-jenkins-env.git +refs/heads/*:refs/remotes/origin/*
Checking out Revision 6c77351e3029741c6f350e8e419c0fb5f9feab2d (master)
 > git config core.sparsecheckout # timeout=10
 > git checkout -f 6c77351e3029741c6f350e8e419c0fb5f9feab2d
Commit message: "Add license headers"
 > git rev-list 6c77351e3029741c6f350e8e419c0fb5f9feab2d # timeout=10
Replacing contents of vars/jenkinsEnv.groovy
Replacing contents of vars/jenkinsNotify.groovy
Loading library jenkins-lib@master
Attempting to resolve master from remote references...
 > git --version # timeout=10
 > git ls-remote -h -t https://gitbox.apache.org/repos/asf/maven-jenkins-lib.git # timeout=10
Found match: refs/heads/master revision cee8923b494ff5f0008fcdad10501d7d91f28328
 > git rev-parse --is-inside-work-tree # timeout=10
Fetching changes from the remote Git repository
 > git config remote.origin.url https://gitbox.apache.org/repos/asf/maven-jenkins-lib.git # timeout=10
Fetching without tags
Fetching upstream changes from https://gitbox.apache.org/repos/asf/maven-jenkins-lib.git
 > git --version # timeout=10
 > git fetch --no-tags --progress https://gitbox.apache.org/repos/asf/maven-jenkins-lib.git +refs/heads/*:refs/remotes/origin/*
Checking out Revision cee8923b494ff5f0008fcdad10501d7d91f28328 (master)
 > git config core.sparsecheckout # timeout=10
 > git checkout -f cee8923b494ff5f0008fcdad10501d7d91f28328
Commit message: "capture another"
 > git rev-list cee8923b494ff5f0008fcdad10501d7d91f28328 # timeout=10
Replacing contents of vars/asfMavenTlpStdBuild.groovy
[Pipeline] properties
[Pipeline] node
Running on H27 in /home/jenkins/jenkins-slave/workspace/maven-wip_maven_master-45H665RDJD4D5J5T6E2CHUCWKXNNABXP24O5RG44ZDYZYKW63GPQ
[Pipeline] {
[Pipeline] dir
Running in /home/jenkins/jenkins-slave/workspace/maven-wip_maven_master-45H665RDJD4D5J5T6E2CHUCWKXNNABXP24O5RG44ZDYZYKW63GPQ/build
[Pipeline] {
[Pipeline] stage
[Pipeline] { (Checkout)
[Pipeline] checkout
 > git rev-parse --is-inside-work-tree # timeout=10
Fetching changes from the remote Git repository
 > git config remote.origin.url https://git-wip-us.apache.org/repos/asf/maven.git # timeout=10
Fetching without tags
Fetching upstream changes from https://git-wip-us.apache.org/repos/asf/maven.git
 > git --version # timeout=10
 > git fetch --no-tags --progress https://git-wip-us.apache.org/repos/asf/maven.git +refs/heads/*:refs/remotes/origin/*
Checking out Revision 3f04e94ea45033fa2768f40148b5e06a141e066e (master)
 > git config core.sparsecheckout # timeout=10
 > git checkout -f 3f04e94ea45033fa2768f40148b5e06a141e066e
Commit message: "Syntax"
 > git rev-list 3f04e94ea45033fa2768f40148b5e06a141e066e # timeout=10
Cleaning workspace
 > git rev-parse --verify HEAD # timeout=10
Resetting working tree
 > git reset --hard # timeout=10
 > git clean -fdx # timeout=10
[Pipeline] }
[Pipeline] // stage
[Pipeline] pwd
[Pipeline] stage
[Pipeline] { (Build / Unit Test)
[Pipeline] withMaven
[withMaven] Options: [org.jenkinsci.plugins.pipeline.maven.publishers.GeneratedArtifactsPublisher[disabled=false], org.jenkinsci.plugins.pipeline.maven.publishers.JunitTestsPublisher[disabled=false], org.jenkinsci.plugins.pipeline.maven.publishers.FindbugsAnalysisPublisher[disabled=false], org.jenkinsci.plugins.pipeline.maven.publishers.TasksScannerPublisher[disabled=false], org.jenkinsci.plugins.pipeline.maven.publishers.DependenciesFingerprintPublisher[disabled=false, scopes=[compile, provided, runtime], versions={snapshot:true, release:false}], org.jenkinsci.plugins.pipeline.maven.publishers.InvokerRunsPublisher[disabled=false], org.jenkinsci.plugins.pipeline.maven.publishers.PipelineGraphPublisher[disabled=false, scopes=[compile, provided, runtime], versions={snapshot:true, release:false}, skipDownstreamTriggers=false, lifecycleThreshold=deploy, ignoreUpstreamTriggers=false]]
[withMaven] Available options: 
[withMaven] use JDK installation JDK 1.7 (latest)
[withMaven] use Maven installation 'Maven 3.5.2'
[Pipeline] {
[Pipeline] sh
[build] Running shell script
+ mvn clean verify -B -U -e -fae -V -maven.test.failure.ignore=true
----- withMaven Wrapper script -----
Picked up JAVA_TOOL_OPTIONS: -Dmaven.ext.class.path="/home/jenkins/jenkins-slave/workspace/maven-wip_maven_master-45H665RDJD4D5J5T6E2CHUCWKXNNABXP24O5RG44ZDYZYKW63GPQ/build@tmp/withMavene792e546/pipeline-maven-spy.jar" -Dorg.jenkinsci.plugins.pipeline.maven.reportsFolder="/home/jenkins/jenkins-slave/workspace/maven-wip_maven_master-45H665RDJD4D5J5T6E2CHUCWKXNNABXP24O5RG44ZDYZYKW63GPQ/build@tmp/withMavene792e546" 
Unable to parse command line options: Unrecognized option: -maven.test.failure.ignore=true

usage: mvn [options] [<goal(s)>] [<phase(s)>]

Options:
 -am,--also-make                        If project list is specified, also
                                        build projects required by the
                                        list
 -amd,--also-make-dependents            If project list is specified, also
                                        build projects that depend on
                                        projects on the list
 -B,--batch-mode                        Run in non-interactive (batch)
                                        mode (disables output color)
 -b,--builder <arg>                     The id of the build strategy to
                                        use
 -C,--strict-checksums                  Fail the build if checksums don't
                                        match
 -c,--lax-checksums                     Warn if checksums don't match
 -cpu,--check-plugin-updates            Ineffective, only kept for
                                        backward compatibility
 -D,--define <arg>                      Define a system property
 -e,--errors                            Produce execution error messages
 -emp,--encrypt-master-password <arg>   Encrypt master security password
 -ep,--encrypt-password <arg>           Encrypt server password
 -f,--file <arg>                        Force the use of an alternate POM
                                        file (or directory with pom.xml)
 -fae,--fail-at-end                     Only fail the build afterwards;
                                        allow all non-impacted builds to
                                        continue
 -ff,--fail-fast                        Stop at first failure in
                                        reactorized builds
 -fn,--fail-never                       NEVER fail the build, regardless
                                        of project result
 -gs,--global-settings <arg>            Alternate path for the global
                                        settings file
 -gt,--global-toolchains <arg>          Alternate path for the global
                                        toolchains file
 -h,--help                              Display help information
 -l,--log-file <arg>                    Log file where all build output
                                        will go (disables output color)
 -llr,--legacy-local-repository         Use Maven 2 Legacy Local
                                        Repository behaviour, ie no use of
                                        _remote.repositories. Can also be
                                        activated by using
                                        -Dmaven.legacyLocalRepo=true
 -N,--non-recursive                     Do not recurse into sub-projects
 -npr,--no-plugin-registry              Ineffective, only kept for
                                        backward compatibility
 -npu,--no-plugin-updates               Ineffective, only kept for
                                        backward compatibility
 -nsu,--no-snapshot-updates             Suppress SNAPSHOT updates
 -o,--offline                           Work offline
 -P,--activate-profiles <arg>           Comma-delimited list of profiles
                                        to activate
 -pl,--projects <arg>                   Comma-delimited list of specified
                                        reactor projects to build instead
                                        of all projects. A project can be
                                        specified by [groupId]:artifactId
                                        or by its relative path
 -q,--quiet                             Quiet output - only show errors
 -rf,--resume-from <arg>                Resume reactor from specified
                                        project
 -s,--settings <arg>                    Alternate path for the user
                                        settings file
 -t,--toolchains <arg>                  Alternate path for the user
                                        toolchains file
 -T,--threads <arg>                     Thread count, for instance 2.0C
                                        where C is core multiplied
 -U,--update-snapshots                  Forces a check for missing
                                        releases and updated snapshots on
                                        remote repositories
 -up,--update-plugins                   Ineffective, only kept for
                                        backward compatibility
 -v,--version                           Display version information
 -V,--show-version                      Display version information
                                        WITHOUT stopping build
 -X,--debug                             Produce execution debug output
[Pipeline] }
[Pipeline] // withMaven
[Pipeline] }
[Pipeline] // stage
[Pipeline] }
[Pipeline] // dir
[Pipeline] }
[Pipeline] // node
[Pipeline] stage
[Pipeline] { (Notifications)
[Pipeline] echo
Build result: FAILURE
[Pipeline] jiraIssueSelector

Build failed in Jenkins: Maven TLP (wip) » maven » master #8

Posted by Apache Jenkins Server <je...@builds.apache.org>.
See https://builds.apache.org/job/maven-wip/job/maven/job/master/8/

No changes.

No tests ran.

Build log:
Branch event
Obtained Jenkinsfile from 3f04e94ea45033fa2768f40148b5e06a141e066e
Loading library jenkins-env@master
Attempting to resolve master from remote references...
 > git --version # timeout=10
 > git ls-remote -h -t https://gitbox.apache.org/repos/asf/maven-jenkins-env.git # timeout=10
Found match: refs/heads/master revision 6c77351e3029741c6f350e8e419c0fb5f9feab2d
 > git rev-parse --is-inside-work-tree # timeout=10
Fetching changes from the remote Git repository
 > git config remote.origin.url https://gitbox.apache.org/repos/asf/maven-jenkins-env.git # timeout=10
Fetching without tags
Fetching upstream changes from https://gitbox.apache.org/repos/asf/maven-jenkins-env.git
 > git --version # timeout=10
 > git fetch --no-tags --progress https://gitbox.apache.org/repos/asf/maven-jenkins-env.git +refs/heads/*:refs/remotes/origin/*
Checking out Revision 6c77351e3029741c6f350e8e419c0fb5f9feab2d (master)
 > git config core.sparsecheckout # timeout=10
 > git checkout -f 6c77351e3029741c6f350e8e419c0fb5f9feab2d
Commit message: "Add license headers"
 > git rev-list 6c77351e3029741c6f350e8e419c0fb5f9feab2d # timeout=10
Loading library jenkins-lib@master
Attempting to resolve master from remote references...
 > git --version # timeout=10
 > git ls-remote -h -t https://gitbox.apache.org/repos/asf/maven-jenkins-lib.git # timeout=10
Found match: refs/heads/master revision cee8923b494ff5f0008fcdad10501d7d91f28328
 > git rev-parse --is-inside-work-tree # timeout=10
Fetching changes from the remote Git repository
 > git config remote.origin.url https://gitbox.apache.org/repos/asf/maven-jenkins-lib.git # timeout=10
Fetching without tags
Fetching upstream changes from https://gitbox.apache.org/repos/asf/maven-jenkins-lib.git
 > git --version # timeout=10
 > git fetch --no-tags --progress https://gitbox.apache.org/repos/asf/maven-jenkins-lib.git +refs/heads/*:refs/remotes/origin/*
Checking out Revision cee8923b494ff5f0008fcdad10501d7d91f28328 (master)
 > git config core.sparsecheckout # timeout=10
 > git checkout -f cee8923b494ff5f0008fcdad10501d7d91f28328
Commit message: "capture another"
 > git rev-list cee8923b494ff5f0008fcdad10501d7d91f28328 # timeout=10
[Pipeline] properties
[Pipeline] node
Running on ubuntu-4 in /home/jenkins/jenkins-slave/workspace/maven-wip_maven_master-45H665RDJD4D5J5T6E2CHUCWKXNNABXP24O5RG44ZDYZYKW63GPQ
[Pipeline] {
[Pipeline] dir
Running in /home/jenkins/jenkins-slave/workspace/maven-wip_maven_master-45H665RDJD4D5J5T6E2CHUCWKXNNABXP24O5RG44ZDYZYKW63GPQ/build
[Pipeline] {
[Pipeline] stage
[Pipeline] { (Checkout)
[Pipeline] checkout
 > git rev-parse --is-inside-work-tree # timeout=10
Fetching changes from the remote Git repository
 > git config remote.origin.url https://git-wip-us.apache.org/repos/asf/maven.git # timeout=10
Fetching without tags
Fetching upstream changes from https://git-wip-us.apache.org/repos/asf/maven.git
 > git --version # timeout=10
 > git fetch --no-tags --progress https://git-wip-us.apache.org/repos/asf/maven.git +refs/heads/*:refs/remotes/origin/*
Checking out Revision 3f04e94ea45033fa2768f40148b5e06a141e066e (master)
 > git config core.sparsecheckout # timeout=10
 > git checkout -f 3f04e94ea45033fa2768f40148b5e06a141e066e
[Pipeline] }
[Pipeline] // stage
[Pipeline] }
[Pipeline] // dir
[Pipeline] }
[Pipeline] // node
[Pipeline] stage
[Pipeline] { (Notifications)
[Pipeline] echo
Build result: FAILURE
[Pipeline] jiraIssueSelector
[Pipeline] emailext

Build failed in Jenkins: Maven TLP (wip) » maven » master #7

Posted by Apache Jenkins Server <je...@builds.apache.org>.
See https://builds.apache.org/job/maven-wip/job/maven/job/master/7/

No changes.

No tests ran.

Build log:
Started by user stephenc
Replayed #6
Obtained Jenkinsfile from 35f3586eccb1cd7bf3a6585aaa1aeb8f0cd0516b
Loading library jenkins-env@master
Attempting to resolve master from remote references...
 > git --version # timeout=10
 > git ls-remote -h -t https://gitbox.apache.org/repos/asf/maven-jenkins-env.git # timeout=10
Found match: refs/heads/master revision 6c77351e3029741c6f350e8e419c0fb5f9feab2d
 > git rev-parse --is-inside-work-tree # timeout=10
Fetching changes from the remote Git repository
 > git config remote.origin.url https://gitbox.apache.org/repos/asf/maven-jenkins-env.git # timeout=10
Fetching without tags
Fetching upstream changes from https://gitbox.apache.org/repos/asf/maven-jenkins-env.git
 > git --version # timeout=10
 > git fetch --no-tags --progress https://gitbox.apache.org/repos/asf/maven-jenkins-env.git +refs/heads/*:refs/remotes/origin/*
Checking out Revision 6c77351e3029741c6f350e8e419c0fb5f9feab2d (master)
 > git config core.sparsecheckout # timeout=10
 > git checkout -f 6c77351e3029741c6f350e8e419c0fb5f9feab2d
Commit message: "Add license headers"
 > git rev-list 6c77351e3029741c6f350e8e419c0fb5f9feab2d # timeout=10
Replacing contents of vars/jenkinsEnv.groovy
Replacing contents of vars/jenkinsNotify.groovy
Loading library jenkins-lib@master
Attempting to resolve master from remote references...
 > git --version # timeout=10
 > git ls-remote -h -t https://gitbox.apache.org/repos/asf/maven-jenkins-lib.git # timeout=10
Found match: refs/heads/master revision cee8923b494ff5f0008fcdad10501d7d91f28328
 > git rev-parse --is-inside-work-tree # timeout=10
Fetching changes from the remote Git repository
 > git config remote.origin.url https://gitbox.apache.org/repos/asf/maven-jenkins-lib.git # timeout=10
Fetching without tags
Fetching upstream changes from https://gitbox.apache.org/repos/asf/maven-jenkins-lib.git
 > git --version # timeout=10
 > git fetch --no-tags --progress https://gitbox.apache.org/repos/asf/maven-jenkins-lib.git +refs/heads/*:refs/remotes/origin/*
Checking out Revision cee8923b494ff5f0008fcdad10501d7d91f28328 (master)
 > git config core.sparsecheckout # timeout=10
 > git checkout -f cee8923b494ff5f0008fcdad10501d7d91f28328
Commit message: "capture another"
 > git rev-list cee8923b494ff5f0008fcdad10501d7d91f28328 # timeout=10
Replacing contents of vars/asfMavenTlpStdBuild.groovy
[Pipeline] properties
[Pipeline] node
Running on H27 in /home/jenkins/jenkins-slave/workspace/maven-wip_maven_master-45H665RDJD4D5J5T6E2CHUCWKXNNABXP24O5RG44ZDYZYKW63GPQ
[Pipeline] {
[Pipeline] dir
Running in /home/jenkins/jenkins-slave/workspace/maven-wip_maven_master-45H665RDJD4D5J5T6E2CHUCWKXNNABXP24O5RG44ZDYZYKW63GPQ/build
[Pipeline] {
[Pipeline] stage
[Pipeline] { (Checkout)
[Pipeline] checkout
Cloning the remote Git repository
Cloning with configured refspecs honoured and without tags
Cloning repository https://git-wip-us.apache.org/repos/asf/maven.git
 > git init /home/jenkins/jenkins-slave/workspace/maven-wip_maven_master-45H665RDJD4D5J5T6E2CHUCWKXNNABXP24O5RG44ZDYZYKW63GPQ/build # timeout=10
Fetching upstream changes from https://git-wip-us.apache.org/repos/asf/maven.git
 > git --version # timeout=10
 > git fetch --no-tags --progress https://git-wip-us.apache.org/repos/asf/maven.git +refs/heads/*:refs/remotes/origin/*
 > git config remote.origin.url https://git-wip-us.apache.org/repos/asf/maven.git # timeout=10
 > git config --add remote.origin.fetch +refs/heads/*:refs/remotes/origin/* # timeout=10
 > git config remote.origin.url https://git-wip-us.apache.org/repos/asf/maven.git # timeout=10
Fetching without tags
Fetching upstream changes from https://git-wip-us.apache.org/repos/asf/maven.git
 > git fetch --no-tags --progress https://git-wip-us.apache.org/repos/asf/maven.git +refs/heads/*:refs/remotes/origin/*
Checking out Revision 35f3586eccb1cd7bf3a6585aaa1aeb8f0cd0516b (master)
 > git config core.sparsecheckout # timeout=10
 > git checkout -f 35f3586eccb1cd7bf3a6585aaa1aeb8f0cd0516b
Commit message: "Start using some of the jenkinsEnv stuff"
 > git rev-list 35f3586eccb1cd7bf3a6585aaa1aeb8f0cd0516b # timeout=10
Cleaning workspace
 > git rev-parse --verify HEAD # timeout=10
Resetting working tree
 > git reset --hard # timeout=10
 > git clean -fdx # timeout=10
[Pipeline] }
[Pipeline] // stage
[Pipeline] pwd
[Pipeline] stage
[Pipeline] { (Build / Unit Test)
[Pipeline] }
[Pipeline] // stage
[Pipeline] }
[Pipeline] // dir
[Pipeline] }
[Pipeline] // node
[Pipeline] stage
[Pipeline] { (Notifications)
[Pipeline] echo
Build result: FAILURE
[Pipeline] jiraIssueSelector
[Pipeline] emailext

Build failed in Jenkins: Maven TLP (wip) » maven » master #6

Posted by Apache Jenkins Server <je...@builds.apache.org>.
See https://builds.apache.org/job/maven-wip/job/maven/job/master/6/

No changes.

No tests ran.

Build log:
Branch event
Obtained Jenkinsfile from 35f3586eccb1cd7bf3a6585aaa1aeb8f0cd0516b
Loading library jenkins-env@master
Attempting to resolve master from remote references...
 > git --version # timeout=10
 > git ls-remote -h -t https://gitbox.apache.org/repos/asf/maven-jenkins-env.git # timeout=10
Found match: refs/heads/master revision 6c77351e3029741c6f350e8e419c0fb5f9feab2d
 > git rev-parse --is-inside-work-tree # timeout=10
Fetching changes from the remote Git repository
 > git config remote.origin.url https://gitbox.apache.org/repos/asf/maven-jenkins-env.git # timeout=10
Fetching without tags
Fetching upstream changes from https://gitbox.apache.org/repos/asf/maven-jenkins-env.git
 > git --version # timeout=10
 > git fetch --no-tags --progress https://gitbox.apache.org/repos/asf/maven-jenkins-env.git +refs/heads/*:refs/remotes/origin/*
Checking out Revision 6c77351e3029741c6f350e8e419c0fb5f9feab2d (master)
 > git config core.sparsecheckout # timeout=10
 > git checkout -f 6c77351e3029741c6f350e8e419c0fb5f9feab2d
Commit message: "Add license headers"
 > git rev-list 6c77351e3029741c6f350e8e419c0fb5f9feab2d # timeout=10
Loading library jenkins-lib@master
Attempting to resolve master from remote references...
 > git --version # timeout=10
 > git ls-remote -h -t https://gitbox.apache.org/repos/asf/maven-jenkins-lib.git # timeout=10
Found match: refs/heads/master revision cee8923b494ff5f0008fcdad10501d7d91f28328
 > git rev-parse --is-inside-work-tree # timeout=10
Fetching changes from the remote Git repository
 > git config remote.origin.url https://gitbox.apache.org/repos/asf/maven-jenkins-lib.git # timeout=10
Fetching without tags
Fetching upstream changes from https://gitbox.apache.org/repos/asf/maven-jenkins-lib.git
 > git --version # timeout=10
 > git fetch --no-tags --progress https://gitbox.apache.org/repos/asf/maven-jenkins-lib.git +refs/heads/*:refs/remotes/origin/*
Checking out Revision cee8923b494ff5f0008fcdad10501d7d91f28328 (master)
 > git config core.sparsecheckout # timeout=10
 > git checkout -f cee8923b494ff5f0008fcdad10501d7d91f28328
Commit message: "capture another"
 > git rev-list cee8923b494ff5f0008fcdad10501d7d91f28328 # timeout=10
[Pipeline] properties
[Pipeline] node
Running on ubuntu-4 in /home/jenkins/jenkins-slave/workspace/maven-wip_maven_master-45H665RDJD4D5J5T6E2CHUCWKXNNABXP24O5RG44ZDYZYKW63GPQ
[Pipeline] {
[Pipeline] dir
Running in /home/jenkins/jenkins-slave/workspace/maven-wip_maven_master-45H665RDJD4D5J5T6E2CHUCWKXNNABXP24O5RG44ZDYZYKW63GPQ/build
[Pipeline] {
[Pipeline] stage
[Pipeline] { (Checkout)
[Pipeline] checkout
 > git rev-parse --is-inside-work-tree # timeout=10
Fetching changes from the remote Git repository
 > git config remote.origin.url https://git-wip-us.apache.org/repos/asf/maven.git # timeout=10
Fetching without tags
Fetching upstream changes from https://git-wip-us.apache.org/repos/asf/maven.git
 > git --version # timeout=10
 > git fetch --no-tags --progress https://git-wip-us.apache.org/repos/asf/maven.git +refs/heads/*:refs/remotes/origin/*
Checking out Revision 35f3586eccb1cd7bf3a6585aaa1aeb8f0cd0516b (master)
 > git config core.sparsecheckout # timeout=10
 > git checkout -f 35f3586eccb1cd7bf3a6585aaa1aeb8f0cd0516b
[Pipeline] }
[Pipeline] // stage
[Pipeline] }
[Pipeline] // dir
[Pipeline] }
[Pipeline] // node
[Pipeline] stage
[Pipeline] { (Notifications)
[Pipeline] echo
Build result: FAILURE
[Pipeline] jiraIssueSelector
[Pipeline] emailext

Build failed in Jenkins: Maven TLP (wip) » maven » master #5

Posted by Apache Jenkins Server <je...@builds.apache.org>.
See https://builds.apache.org/job/maven-wip/job/maven/job/master/5/

No changes.

No tests ran.

Build log:
Started by user stephenc
Replayed #4
Obtained Jenkinsfile from 866582d296ed80f36f33e5293cd07647185e0e43
Loading library jenkins-env@master
Attempting to resolve master from remote references...
 > git --version # timeout=10
 > git ls-remote -h -t https://gitbox.apache.org/repos/asf/maven-jenkins-env.git # timeout=10
Found match: refs/heads/master revision 6c77351e3029741c6f350e8e419c0fb5f9feab2d
 > git rev-parse --is-inside-work-tree # timeout=10
Fetching changes from the remote Git repository
 > git config remote.origin.url https://gitbox.apache.org/repos/asf/maven-jenkins-env.git # timeout=10
Fetching without tags
Fetching upstream changes from https://gitbox.apache.org/repos/asf/maven-jenkins-env.git
 > git --version # timeout=10
 > git fetch --no-tags --progress https://gitbox.apache.org/repos/asf/maven-jenkins-env.git +refs/heads/*:refs/remotes/origin/*
Checking out Revision 6c77351e3029741c6f350e8e419c0fb5f9feab2d (master)
 > git config core.sparsecheckout # timeout=10
 > git checkout -f 6c77351e3029741c6f350e8e419c0fb5f9feab2d
Commit message: "Add license headers"
 > git rev-list 6c77351e3029741c6f350e8e419c0fb5f9feab2d # timeout=10
Replacing contents of vars/jenkinsEnv.groovy
Replacing contents of vars/jenkinsNotify.groovy
Loading library jenkins-lib@master
Attempting to resolve master from remote references...
 > git --version # timeout=10
 > git ls-remote -h -t https://gitbox.apache.org/repos/asf/maven-jenkins-lib.git # timeout=10
Found match: refs/heads/master revision cee8923b494ff5f0008fcdad10501d7d91f28328
 > git rev-parse --is-inside-work-tree # timeout=10
Fetching changes from the remote Git repository
 > git config remote.origin.url https://gitbox.apache.org/repos/asf/maven-jenkins-lib.git # timeout=10
Fetching without tags
Fetching upstream changes from https://gitbox.apache.org/repos/asf/maven-jenkins-lib.git
 > git --version # timeout=10
 > git fetch --no-tags --progress https://gitbox.apache.org/repos/asf/maven-jenkins-lib.git +refs/heads/*:refs/remotes/origin/*
Checking out Revision cee8923b494ff5f0008fcdad10501d7d91f28328 (master)
 > git config core.sparsecheckout # timeout=10
 > git checkout -f cee8923b494ff5f0008fcdad10501d7d91f28328
Commit message: "capture another"
 > git rev-list cee8923b494ff5f0008fcdad10501d7d91f28328 # timeout=10
Replacing contents of vars/asfMavenTlpStdBuild.groovy
[Pipeline] properties
[Pipeline] node
Running on ubuntu-4 in /home/jenkins/jenkins-slave/workspace/maven-wip_maven_master-45H665RDJD4D5J5T6E2CHUCWKXNNABXP24O5RG44ZDYZYKW63GPQ
[Pipeline] {
[Pipeline] dir
Running in /home/jenkins/jenkins-slave/workspace/maven-wip_maven_master-45H665RDJD4D5J5T6E2CHUCWKXNNABXP24O5RG44ZDYZYKW63GPQ/build
[Pipeline] {
[Pipeline] stage
[Pipeline] { (Checkout)
[Pipeline] checkout
 > git rev-parse --is-inside-work-tree # timeout=10
Fetching changes from the remote Git repository
 > git config remote.origin.url https://git-wip-us.apache.org/repos/asf/maven.git # timeout=10
Fetching without tags
Fetching upstream changes from https://git-wip-us.apache.org/repos/asf/maven.git
 > git --version # timeout=10
 > git fetch --no-tags --progress https://git-wip-us.apache.org/repos/asf/maven.git +refs/heads/*:refs/remotes/origin/*
Checking out Revision 866582d296ed80f36f33e5293cd07647185e0e43 (master)
 > git config core.sparsecheckout # timeout=10
 > git checkout -f 866582d296ed80f36f33e5293cd07647185e0e43
[Pipeline] }
[Pipeline] // stage
[Pipeline] }
[Pipeline] // dir
[Pipeline] }
[Pipeline] // node
[Pipeline] stage
[Pipeline] { (Notifications)
[Pipeline] echo
Build result: FAILURE
[Pipeline] jiraIssueSelector
[Pipeline] emailext

Build succeeded in Jenkins: Maven TLP (wip) » maven » master #4

Posted by Apache Jenkins Server <je...@builds.apache.org>.
See https://builds.apache.org/job/maven-wip/job/maven/job/master/4/

No changes.

No tests ran.