You are viewing a plain text version of this content. The canonical link for it is here.
Posted to builds@beam.apache.org by Apache Jenkins Server <je...@builds.apache.org> on 2023/03/23 01:41:35 UTC

Build failed in Jenkins: beam_PostCommit_Python_Examples_Spark #1594

See <https://ci-beam.apache.org/job/beam_PostCommit_Python_Examples_Spark/1594/display/redirect>

Changes:


------------------------------------------
[...truncated 4.96 MB...]
  grpc._channel._MultiThreadedRendezvous: <_MultiThreadedRendezvous of RPC that terminated with:
  	status = StatusCode.CANCELLED
  	details = "Multiplexer hanging up"
  	debug_error_string = "UNKNOWN:Error received from peer ipv6:%5B::1%5D:42441 {grpc_message:"Multiplexer hanging up", grpc_status:1, created_time:"2023-03-23T01:40:06.532448329+00:00"}"
  >
  
    warnings.warn(pytest.PytestUnhandledThreadExceptionWarning(msg))

apache_beam/examples/cookbook/custom_ptransform_it_test.py::CustomPTransformIT::test_custom_ptransform_output_files_on_small_input
  <https://ci-beam.apache.org/job/beam_PostCommit_Python_Examples_Spark/ws/src/build/gradleenv/-1720702907/lib/python3.10/site-packages/_pytest/threadexception.py>:73: PytestUnhandledThreadExceptionWarning: Exception in thread read_grpc_client_inputs
  
  Traceback (most recent call last):
    File "/usr/lib/python3.10/threading.py", line 1009, in _bootstrap_inner
      self.run()
    File "/usr/lib/python3.10/threading.py", line 946, in run
      self._target(*self._args, **self._kwargs)
    File "<https://ci-beam.apache.org/job/beam_PostCommit_Python_Examples_Spark/ws/src/sdks/python/apache_beam/runners/worker/data_plane.py",> line 671, in <lambda>
      target=lambda: self._read_inputs(elements_iterator),
    File "<https://ci-beam.apache.org/job/beam_PostCommit_Python_Examples_Spark/ws/src/sdks/python/apache_beam/runners/worker/data_plane.py",> line 654, in _read_inputs
      for elements in elements_iterator:
    File "<https://ci-beam.apache.org/job/beam_PostCommit_Python_Examples_Spark/ws/src/build/gradleenv/-1720702907/lib/python3.10/site-packages/grpc/_channel.py",> line 426, in __next__
      return self._next()
    File "<https://ci-beam.apache.org/job/beam_PostCommit_Python_Examples_Spark/ws/src/build/gradleenv/-1720702907/lib/python3.10/site-packages/grpc/_channel.py",> line 826, in _next
      raise self
  grpc._channel._MultiThreadedRendezvous: <_MultiThreadedRendezvous of RPC that terminated with:
  	status = StatusCode.CANCELLED
  	details = "Multiplexer hanging up"
  	debug_error_string = "UNKNOWN:Error received from peer ipv6:%5B::1%5D:40221 {grpc_message:"Multiplexer hanging up", grpc_status:1, created_time:"2023-03-23T01:40:15.0713062+00:00"}"
  >
  
    warnings.warn(pytest.PytestUnhandledThreadExceptionWarning(msg))

apache_beam/examples/cookbook/filters_test.py::FiltersTest::test_filters_output_bigquery_matcher
  <https://ci-beam.apache.org/job/beam_PostCommit_Python_Examples_Spark/ws/src/build/gradleenv/-1720702907/lib/python3.10/site-packages/_pytest/threadexception.py>:73: PytestUnhandledThreadExceptionWarning: Exception in thread read_grpc_client_inputs
  
  Traceback (most recent call last):
    File "/usr/lib/python3.10/threading.py", line 1009, in _bootstrap_inner
      self.run()
    File "/usr/lib/python3.10/threading.py", line 946, in run
      self._target(*self._args, **self._kwargs)
    File "<https://ci-beam.apache.org/job/beam_PostCommit_Python_Examples_Spark/ws/src/sdks/python/apache_beam/runners/worker/data_plane.py",> line 671, in <lambda>
      target=lambda: self._read_inputs(elements_iterator),
    File "<https://ci-beam.apache.org/job/beam_PostCommit_Python_Examples_Spark/ws/src/sdks/python/apache_beam/runners/worker/data_plane.py",> line 654, in _read_inputs
      for elements in elements_iterator:
    File "<https://ci-beam.apache.org/job/beam_PostCommit_Python_Examples_Spark/ws/src/build/gradleenv/-1720702907/lib/python3.10/site-packages/grpc/_channel.py",> line 426, in __next__
      return self._next()
    File "<https://ci-beam.apache.org/job/beam_PostCommit_Python_Examples_Spark/ws/src/build/gradleenv/-1720702907/lib/python3.10/site-packages/grpc/_channel.py",> line 826, in _next
      raise self
  grpc._channel._MultiThreadedRendezvous: <_MultiThreadedRendezvous of RPC that terminated with:
  	status = StatusCode.CANCELLED
  	details = "Multiplexer hanging up"
  	debug_error_string = "UNKNOWN:Error received from peer ipv6:%5B::1%5D:41503 {created_time:"2023-03-23T01:40:35.686437341+00:00", grpc_status:1, grpc_message:"Multiplexer hanging up"}"
  >
  
    warnings.warn(pytest.PytestUnhandledThreadExceptionWarning(msg))

apache_beam/examples/cookbook/group_with_coder_test.py::GroupWithCoderTest::test_basics_with_type_check
  <https://ci-beam.apache.org/job/beam_PostCommit_Python_Examples_Spark/ws/src/build/gradleenv/-1720702907/lib/python3.10/site-packages/_pytest/threadexception.py>:73: PytestUnhandledThreadExceptionWarning: Exception in thread read_grpc_client_inputs
  
  Traceback (most recent call last):
    File "/usr/lib/python3.10/threading.py", line 1009, in _bootstrap_inner
      self.run()
    File "/usr/lib/python3.10/threading.py", line 946, in run
      self._target(*self._args, **self._kwargs)
    File "<https://ci-beam.apache.org/job/beam_PostCommit_Python_Examples_Spark/ws/src/sdks/python/apache_beam/runners/worker/data_plane.py",> line 671, in <lambda>
      target=lambda: self._read_inputs(elements_iterator),
    File "<https://ci-beam.apache.org/job/beam_PostCommit_Python_Examples_Spark/ws/src/sdks/python/apache_beam/runners/worker/data_plane.py",> line 654, in _read_inputs
      for elements in elements_iterator:
    File "<https://ci-beam.apache.org/job/beam_PostCommit_Python_Examples_Spark/ws/src/build/gradleenv/-1720702907/lib/python3.10/site-packages/grpc/_channel.py",> line 426, in __next__
      return self._next()
    File "<https://ci-beam.apache.org/job/beam_PostCommit_Python_Examples_Spark/ws/src/build/gradleenv/-1720702907/lib/python3.10/site-packages/grpc/_channel.py",> line 826, in _next
      raise self
  grpc._channel._MultiThreadedRendezvous: <_MultiThreadedRendezvous of RPC that terminated with:
  	status = StatusCode.CANCELLED
  	details = "Multiplexer hanging up"
  	debug_error_string = "UNKNOWN:Error received from peer ipv6:%5B::1%5D:38703 {created_time:"2023-03-23T01:40:38.781379263+00:00", grpc_status:1, grpc_message:"Multiplexer hanging up"}"
  >
  
    warnings.warn(pytest.PytestUnhandledThreadExceptionWarning(msg))

apache_beam/examples/cookbook/group_with_coder_test.py::GroupWithCoderTest::test_basics_without_type_check
  <https://ci-beam.apache.org/job/beam_PostCommit_Python_Examples_Spark/ws/src/build/gradleenv/-1720702907/lib/python3.10/site-packages/_pytest/threadexception.py>:73: PytestUnhandledThreadExceptionWarning: Exception in thread read_grpc_client_inputs
  
  Traceback (most recent call last):
    File "/usr/lib/python3.10/threading.py", line 1009, in _bootstrap_inner
      self.run()
    File "/usr/lib/python3.10/threading.py", line 946, in run
      self._target(*self._args, **self._kwargs)
    File "<https://ci-beam.apache.org/job/beam_PostCommit_Python_Examples_Spark/ws/src/sdks/python/apache_beam/runners/worker/data_plane.py",> line 671, in <lambda>
      target=lambda: self._read_inputs(elements_iterator),
    File "<https://ci-beam.apache.org/job/beam_PostCommit_Python_Examples_Spark/ws/src/sdks/python/apache_beam/runners/worker/data_plane.py",> line 654, in _read_inputs
      for elements in elements_iterator:
    File "<https://ci-beam.apache.org/job/beam_PostCommit_Python_Examples_Spark/ws/src/build/gradleenv/-1720702907/lib/python3.10/site-packages/grpc/_channel.py",> line 426, in __next__
      return self._next()
    File "<https://ci-beam.apache.org/job/beam_PostCommit_Python_Examples_Spark/ws/src/build/gradleenv/-1720702907/lib/python3.10/site-packages/grpc/_channel.py",> line 826, in _next
      raise self
  grpc._channel._MultiThreadedRendezvous: <_MultiThreadedRendezvous of RPC that terminated with:
  	status = StatusCode.CANCELLED
  	details = "Multiplexer hanging up"
  	debug_error_string = "UNKNOWN:Error received from peer ipv6:%5B::1%5D:37199 {created_time:"2023-03-23T01:40:40.374940283+00:00", grpc_status:1, grpc_message:"Multiplexer hanging up"}"
  >
  
    warnings.warn(pytest.PytestUnhandledThreadExceptionWarning(msg))

apache_beam/examples/cookbook/mergecontacts_test.py::MergeContactsTest::test_mergecontacts
  <https://ci-beam.apache.org/job/beam_PostCommit_Python_Examples_Spark/ws/src/build/gradleenv/-1720702907/lib/python3.10/site-packages/_pytest/threadexception.py>:73: PytestUnhandledThreadExceptionWarning: Exception in thread read_grpc_client_inputs
  
  Traceback (most recent call last):
    File "/usr/lib/python3.10/threading.py", line 1009, in _bootstrap_inner
      self.run()
    File "/usr/lib/python3.10/threading.py", line 946, in run
      self._target(*self._args, **self._kwargs)
    File "<https://ci-beam.apache.org/job/beam_PostCommit_Python_Examples_Spark/ws/src/sdks/python/apache_beam/runners/worker/data_plane.py",> line 671, in <lambda>
      target=lambda: self._read_inputs(elements_iterator),
    File "<https://ci-beam.apache.org/job/beam_PostCommit_Python_Examples_Spark/ws/src/sdks/python/apache_beam/runners/worker/data_plane.py",> line 654, in _read_inputs
      for elements in elements_iterator:
    File "<https://ci-beam.apache.org/job/beam_PostCommit_Python_Examples_Spark/ws/src/build/gradleenv/-1720702907/lib/python3.10/site-packages/grpc/_channel.py",> line 426, in __next__
      return self._next()
    File "<https://ci-beam.apache.org/job/beam_PostCommit_Python_Examples_Spark/ws/src/build/gradleenv/-1720702907/lib/python3.10/site-packages/grpc/_channel.py",> line 826, in _next
      raise self
  grpc._channel._MultiThreadedRendezvous: <_MultiThreadedRendezvous of RPC that terminated with:
  	status = StatusCode.CANCELLED
  	details = "Multiplexer hanging up"
  	debug_error_string = "UNKNOWN:Error received from peer ipv6:%5B::1%5D:39545 {grpc_message:"Multiplexer hanging up", grpc_status:1, created_time:"2023-03-23T01:40:47.800635247+00:00"}"
  >
  
    warnings.warn(pytest.PytestUnhandledThreadExceptionWarning(msg))

apache_beam/examples/cookbook/multiple_output_pardo_test.py::MultipleOutputParDo::test_multiple_output_pardo
  <https://ci-beam.apache.org/job/beam_PostCommit_Python_Examples_Spark/ws/src/build/gradleenv/-1720702907/lib/python3.10/site-packages/_pytest/threadexception.py>:73: PytestUnhandledThreadExceptionWarning: Exception in thread read_grpc_client_inputs
  
  Traceback (most recent call last):
    File "/usr/lib/python3.10/threading.py", line 1009, in _bootstrap_inner
      self.run()
    File "/usr/lib/python3.10/threading.py", line 946, in run
      self._target(*self._args, **self._kwargs)
    File "<https://ci-beam.apache.org/job/beam_PostCommit_Python_Examples_Spark/ws/src/sdks/python/apache_beam/runners/worker/data_plane.py",> line 671, in <lambda>
      target=lambda: self._read_inputs(elements_iterator),
    File "<https://ci-beam.apache.org/job/beam_PostCommit_Python_Examples_Spark/ws/src/sdks/python/apache_beam/runners/worker/data_plane.py",> line 654, in _read_inputs
      for elements in elements_iterator:
    File "<https://ci-beam.apache.org/job/beam_PostCommit_Python_Examples_Spark/ws/src/build/gradleenv/-1720702907/lib/python3.10/site-packages/grpc/_channel.py",> line 426, in __next__
      return self._next()
    File "<https://ci-beam.apache.org/job/beam_PostCommit_Python_Examples_Spark/ws/src/build/gradleenv/-1720702907/lib/python3.10/site-packages/grpc/_channel.py",> line 826, in _next
      raise self
  grpc._channel._MultiThreadedRendezvous: <_MultiThreadedRendezvous of RPC that terminated with:
  	status = StatusCode.CANCELLED
  	details = "Multiplexer hanging up"
  	debug_error_string = "UNKNOWN:Error received from peer ipv6:%5B::1%5D:37321 {grpc_message:"Multiplexer hanging up", grpc_status:1, created_time:"2023-03-23T01:40:55.070954042+00:00"}"
  >
  
    warnings.warn(pytest.PytestUnhandledThreadExceptionWarning(msg))

apache_beam/examples/dataframe/flight_delays_it_test.py: 45 warnings
  <https://ci-beam.apache.org/job/beam_PostCommit_Python_Examples_Spark/ws/src/sdks/python/apache_beam/examples/dataframe/flight_delays.py>:47: FutureWarning: The default value of numeric_only in DataFrame.mean is deprecated. In a future version, it will default to False. In addition, specifying 'numeric_only=None' is deprecated. Select only valid columns or specify the value of numeric_only to silence this warning.
    return airline_df[at_top_airports].mean()

apache_beam/examples/dataframe/flight_delays_it_test.py::FlightDelaysTest::test_flight_delays
apache_beam/examples/dataframe/wordcount_test.py::WordCountTest::test_basics
  <https://ci-beam.apache.org/job/beam_PostCommit_Python_Examples_Spark/ws/src/sdks/python/apache_beam/dataframe/io.py>:659: FutureWarning: WriteToFiles is experimental.
    return pcoll | fileio.WriteToFiles(

apache_beam/examples/dataframe/flight_delays_it_test.py::FlightDelaysTest::test_flight_delays
apache_beam/examples/dataframe/wordcount_test.py::WordCountTest::test_basics
  <https://ci-beam.apache.org/job/beam_PostCommit_Python_Examples_Spark/ws/src/sdks/python/apache_beam/io/fileio.py>:596: BeamDeprecationWarning: options is deprecated since First stable release. References to <pipeline>.options will not be supported
    p.options.view_as(GoogleCloudOptions).temp_location or

apache_beam/examples/dataframe/flight_delays_it_test.py::FlightDelaysTest::test_flight_delays
  <https://ci-beam.apache.org/job/beam_PostCommit_Python_Examples_Spark/ws/src/build/gradleenv/-1720702907/lib/python3.10/site-packages/_pytest/threadexception.py>:73: PytestUnhandledThreadExceptionWarning: Exception in thread read_grpc_client_inputs
  
  Traceback (most recent call last):
    File "/usr/lib/python3.10/threading.py", line 1009, in _bootstrap_inner
      self.run()
    File "/usr/lib/python3.10/threading.py", line 946, in run
      self._target(*self._args, **self._kwargs)
    File "<https://ci-beam.apache.org/job/beam_PostCommit_Python_Examples_Spark/ws/src/sdks/python/apache_beam/runners/worker/data_plane.py",> line 671, in <lambda>
      target=lambda: self._read_inputs(elements_iterator),
    File "<https://ci-beam.apache.org/job/beam_PostCommit_Python_Examples_Spark/ws/src/sdks/python/apache_beam/runners/worker/data_plane.py",> line 654, in _read_inputs
      for elements in elements_iterator:
    File "<https://ci-beam.apache.org/job/beam_PostCommit_Python_Examples_Spark/ws/src/build/gradleenv/-1720702907/lib/python3.10/site-packages/grpc/_channel.py",> line 426, in __next__
      return self._next()
    File "<https://ci-beam.apache.org/job/beam_PostCommit_Python_Examples_Spark/ws/src/build/gradleenv/-1720702907/lib/python3.10/site-packages/grpc/_channel.py",> line 826, in _next
      raise self
  grpc._channel._MultiThreadedRendezvous: <_MultiThreadedRendezvous of RPC that terminated with:
  	status = StatusCode.CANCELLED
  	details = "Multiplexer hanging up"
  	debug_error_string = "UNKNOWN:Error received from peer ipv6:%5B::1%5D:33249 {created_time:"2023-03-23T01:41:19.833549314+00:00", grpc_status:1, grpc_message:"Multiplexer hanging up"}"
  >
  
    warnings.warn(pytest.PytestUnhandledThreadExceptionWarning(msg))

apache_beam/examples/dataframe/wordcount_test.py::WordCountTest::test_basics
  <https://ci-beam.apache.org/job/beam_PostCommit_Python_Examples_Spark/ws/src/build/gradleenv/-1720702907/lib/python3.10/site-packages/_pytest/threadexception.py>:73: PytestUnhandledThreadExceptionWarning: Exception in thread read_grpc_client_inputs
  
  Traceback (most recent call last):
    File "/usr/lib/python3.10/threading.py", line 1009, in _bootstrap_inner
      self.run()
    File "/usr/lib/python3.10/threading.py", line 946, in run
      self._target(*self._args, **self._kwargs)
    File "<https://ci-beam.apache.org/job/beam_PostCommit_Python_Examples_Spark/ws/src/sdks/python/apache_beam/runners/worker/data_plane.py",> line 671, in <lambda>
      target=lambda: self._read_inputs(elements_iterator),
    File "<https://ci-beam.apache.org/job/beam_PostCommit_Python_Examples_Spark/ws/src/sdks/python/apache_beam/runners/worker/data_plane.py",> line 654, in _read_inputs
      for elements in elements_iterator:
    File "<https://ci-beam.apache.org/job/beam_PostCommit_Python_Examples_Spark/ws/src/build/gradleenv/-1720702907/lib/python3.10/site-packages/grpc/_channel.py",> line 426, in __next__
      return self._next()
    File "<https://ci-beam.apache.org/job/beam_PostCommit_Python_Examples_Spark/ws/src/build/gradleenv/-1720702907/lib/python3.10/site-packages/grpc/_channel.py",> line 826, in _next
      raise self
  grpc._channel._MultiThreadedRendezvous: <_MultiThreadedRendezvous of RPC that terminated with:
  	status = StatusCode.CANCELLED
  	details = "Multiplexer hanging up"
  	debug_error_string = "UNKNOWN:Error received from peer ipv6:%5B::1%5D:46393 {grpc_message:"Multiplexer hanging up", grpc_status:1, created_time:"2023-03-23T01:41:27.512367174+00:00"}"
  >
  
    warnings.warn(pytest.PytestUnhandledThreadExceptionWarning(msg))

-- Docs: https://docs.pytest.org/en/stable/how-to/capture-warnings.html
- generated xml file: <https://ci-beam.apache.org/job/beam_PostCommit_Python_Examples_Spark/ws/src/sdks/python/pytest_postCommitExamples-spark-py310.xml> -
=========================== short test summary info ============================
FAILED apache_beam/examples/complete/juliaset/juliaset/juliaset_test.py::JuliaSetTest::test_output_file_format - Failed: Timeout >600.0s [while running 'WriteToText/Write/WriteImpl/FinalizeWrite']
= 1 failed, 21 passed, 10 skipped, 6835 deselected, 149 warnings in 826.49s (0:13:46) =

FAILURE: Build failed with an exception.

* Where:
Script '<https://ci-beam.apache.org/job/beam_PostCommit_Python_Examples_Spark/ws/src/sdks/python/test-suites/portable/common.gradle'> line: 276

* What went wrong:
Execution failed for task ':sdks:python:test-suites:portable:py310:sparkExamples'.
> Process 'command 'sh'' finished with non-zero exit value 1

* Try:
> Run with --stacktrace option to get the stack trace.
> Run with --info or --debug option to get more log output.

* Get more help at https://help.gradle.org

Deprecated Gradle features were used in this build, making it incompatible with Gradle 8.0.

You can use '--warning-mode all' to show the individual deprecation warnings and determine if they come from your own scripts or plugins.

See https://docs.gradle.org/7.5.1/userguide/command_line_interface.html#sec:command_line_warnings

BUILD FAILED in 15m 19s
81 actionable tasks: 51 executed, 28 from cache, 2 up-to-date

Publishing build scan...
https://gradle.com/s/z2nogjezelayw

Build step 'Invoke Gradle script' changed build result to FAILURE
Build step 'Invoke Gradle script' marked build as failure

---------------------------------------------------------------------
To unsubscribe, e-mail: builds-unsubscribe@beam.apache.org
For additional commands, e-mail: builds-help@beam.apache.org


Jenkins build is back to normal : beam_PostCommit_Python_Examples_Spark #1595

Posted by Apache Jenkins Server <je...@builds.apache.org>.
See <https://ci-beam.apache.org/job/beam_PostCommit_Python_Examples_Spark/1595/display/redirect>


---------------------------------------------------------------------
To unsubscribe, e-mail: builds-unsubscribe@beam.apache.org
For additional commands, e-mail: builds-help@beam.apache.org